hbase-builds mailing list archives

Site index · List index
Message view « Date » · « Thread »
Top « Date » · « Thread »
From Apache Jenkins Server <jenk...@builds.apache.org>
Subject Build failed in Jenkins: HBase-Trunk_matrix » JDK 1.8 (latest),yahoo-not-h2 #1440
Date Fri, 19 Aug 2016 02:40:16 GMT
See <https://builds.apache.org/job/HBase-Trunk_matrix/jdk=JDK%201.8%20(latest),label=yahoo-not-h2/1440/>

------------------------------------------
[...truncated 17183 lines...]
org.apache.hadoop.hbase.replication.TestReplicationSmallTests.org.apache.hadoop.hbase.replication.TestReplicationSmallTests
  Run 1: TestReplicationSmallTests>TestReplicationBase.setUpBeforeClass:135 » IO Timed
...
  Run 2: TestReplicationSmallTests>TestReplicationBase.tearDownAfterClass:172 » NullPointer

  TestReplicationSource.setUpBeforeClass:63 » IO Timed out waiting for Mini HDFS...
  TestReplicationStateHBaseImpl.setUpBeforeClass:87 » IO Timed out waiting for M...
org.apache.hadoop.hbase.replication.TestReplicationSyncUpTool.org.apache.hadoop.hbase.replication.TestReplicationSyncUpTool
  Run 1: TestReplicationSyncUpTool>TestReplicationBase.setUpBeforeClass:135 » IO Timed
...
  Run 2: TestReplicationSyncUpTool>TestReplicationBase.tearDownAfterClass:172 » NullPointer

org.apache.hadoop.hbase.replication.TestReplicationSyncUpToolWithBulkLoadedData.org.apache.hadoop.hbase.replication.TestReplicationSyncUpToolWithBulkLoadedData
  Run 1: TestReplicationSyncUpToolWithBulkLoadedData.setUpBeforeClass:59->TestReplicationBase.setUpBeforeClass:135
» IO
  Run 2: TestReplicationSyncUpToolWithBulkLoadedData>TestReplicationBase.tearDownAfterClass:172
» NullPointer

  TestReplicationTableBase.testSlowStartup:85 » IO Timed out waiting for Mini HD...
  TestReplicationWithTags.setUpBeforeClass:140 » IO Timed out waiting for Mini H...
  TestSerialReplication.setUpBeforeClass:114 » IO Timed out waiting for Mini HDF...
org.apache.hadoop.hbase.replication.multiwal.TestReplicationEndpointWithMultipleAsyncWAL.org.apache.hadoop.hbase.replication.multiwal.TestReplicationEndpointWithMultipleAsyncWAL
  Run 1: TestReplicationEndpointWithMultipleAsyncWAL.setUpBeforeClass:34->TestReplicationEndpoint.setUpBeforeClass:65->TestReplicationBase.setUpBeforeClass:135
» IO
  Run 2: TestReplicationEndpointWithMultipleAsyncWAL>TestReplicationEndpoint.tearDownAfterClass:72->TestReplicationBase.tearDownAfterClass:172
» NullPointer

org.apache.hadoop.hbase.replication.multiwal.TestReplicationEndpointWithMultipleWAL.org.apache.hadoop.hbase.replication.multiwal.TestReplicationEndpointWithMultipleWAL
  Run 1: TestReplicationEndpointWithMultipleWAL.setUpBeforeClass:34->TestReplicationEndpoint.setUpBeforeClass:65->TestReplicationBase.setUpBeforeClass:135
» IO
  Run 2: TestReplicationEndpointWithMultipleWAL>TestReplicationEndpoint.tearDownAfterClass:72->TestReplicationBase.tearDownAfterClass:172
» NullPointer

org.apache.hadoop.hbase.replication.multiwal.TestReplicationKillMasterRSCompressedWithMultipleAsyncWAL.org.apache.hadoop.hbase.replication.multiwal.TestReplicationKillMasterRSCompressedWithMultipleAsyncWAL
  Run 1: TestReplicationKillMasterRSCompressedWithMultipleAsyncWAL.setUpBeforeClass:35->TestReplicationKillMasterRSCompressed.setUpBeforeClass:40->TestReplicationBase.setUpBeforeClass:135
» IO
  Run 2: TestReplicationKillMasterRSCompressedWithMultipleAsyncWAL>TestReplicationBase.tearDownAfterClass:172
» NullPointer

org.apache.hadoop.hbase.replication.multiwal.TestReplicationKillMasterRSCompressedWithMultipleWAL.org.apache.hadoop.hbase.replication.multiwal.TestReplicationKillMasterRSCompressedWithMultipleWAL
  Run 1: TestReplicationKillMasterRSCompressedWithMultipleWAL.setUpBeforeClass:35->TestReplicationKillMasterRSCompressed.setUpBeforeClass:40->TestReplicationBase.setUpBeforeClass:135
» IO
  Run 2: TestReplicationKillMasterRSCompressedWithMultipleWAL>TestReplicationBase.tearDownAfterClass:172
» NullPointer

org.apache.hadoop.hbase.replication.multiwal.TestReplicationSyncUpToolWithMultipleAsyncWAL.org.apache.hadoop.hbase.replication.multiwal.TestReplicationSyncUpToolWithMultipleAsyncWAL
  Run 1: TestReplicationSyncUpToolWithMultipleAsyncWAL.setUpBeforeClass:35->TestReplicationBase.setUpBeforeClass:135
» IO
  Run 2: TestReplicationSyncUpToolWithMultipleAsyncWAL>TestReplicationBase.tearDownAfterClass:172
» NullPointer

org.apache.hadoop.hbase.replication.multiwal.TestReplicationSyncUpToolWithMultipleWAL.org.apache.hadoop.hbase.replication.multiwal.TestReplicationSyncUpToolWithMultipleWAL
  Run 1: TestReplicationSyncUpToolWithMultipleWAL.setUpBeforeClass:35->TestReplicationBase.setUpBeforeClass:135
» IO
  Run 2: TestReplicationSyncUpToolWithMultipleWAL>TestReplicationBase.tearDownAfterClass:172
» NullPointer

  TestRegionReplicaReplicationEndpoint.beforeClass:99 » IO Timed out waiting for...
org.apache.hadoop.hbase.replication.regionserver.TestRegionReplicaReplicationEndpointNoMaster.org.apache.hadoop.hbase.replication.regionserver.TestRegionReplicaReplicationEndpointNoMaster
  Run 1: TestRegionReplicaReplicationEndpointNoMaster.beforeClass:113 » IO Timed out wa...
  Run 2: TestRegionReplicaReplicationEndpointNoMaster.afterClass:135 NullPointer

  TestReplicationSink.setUpBeforeClass:122 » IO Timed out waiting for Mini HDFS ...
  TestReplicationWALReaderManager.setUpBeforeClass:125 » IO Timed out waiting fo...
org.apache.hadoop.hbase.replication.regionserver.TestTableBasedReplicationSourceManagerImpl.org.apache.hadoop.hbase.replication.regionserver.TestTableBasedReplicationSourceManagerImpl
  Run 1: TestTableBasedReplicationSourceManagerImpl.setUpBeforeClass:52 » IO Timed out ...
  Run 2: TestTableBasedReplicationSourceManagerImpl>TestReplicationSourceManager.tearDownAfterClass:190
» NullPointer

  TestAccessControlFilter.setupBeforeClass:84 » IO Timed out waiting for Mini HD...
org.apache.hadoop.hbase.security.access.TestAccessController.org.apache.hadoop.hbase.security.access.TestAccessController
  Run 1: TestAccessController.setupBeforeClass:218 » IO Timed out waiting for Mini HDFS...
  Run 2: TestAccessController.tearDownAfterClass:258->cleanUp:322->SecureTestUtil.deleteTable:697
» IO

org.apache.hadoop.hbase.security.access.TestAccessController2.org.apache.hadoop.hbase.security.access.TestAccessController2
  Run 1: TestAccessController2.setupBeforeClass:117 » IO Timed out waiting for Mini HDF...
  Run 2: TestAccessController2.tearDownAfterClass:155 NullPointer

org.apache.hadoop.hbase.security.access.TestAccessController3.org.apache.hadoop.hbase.security.access.TestAccessController3
  Run 1: TestAccessController3.setupBeforeClass:150 » IO Timed out waiting for Mini HDF...
  Run 2: TestAccessController3.tearDownAfterClass:195 NullPointer

  TestCellACLWithMultipleVersions.setupBeforeClass:109 » IO Timed out waiting fo...
  TestCellACLs.setupBeforeClass:112 » IO Timed out waiting for Mini HDFS Cluster...
org.apache.hadoop.hbase.security.access.TestNamespaceCommands.org.apache.hadoop.hbase.security.access.TestNamespaceCommands
  Run 1: TestNamespaceCommands.beforeClass:149 » IO Timed out waiting for Mini HDFS Clu...
  Run 2: TestNamespaceCommands.afterClass:185 » IO java.lang.reflect.InvocationTargetEx...

  TestScanEarlyTermination.setupBeforeClass:93 » IO Timed out waiting for Mini H...
  TestTablePermissions.beforeClass:97 » IO Timed out waiting for Mini HDFS Clust...
  TestWithDisabledAuthorization.setupBeforeClass:152 » IO Timed out waiting for ...
  TestZKPermissionsWatcher.beforeClass:77 » IO Timed out waiting for Mini HDFS C...
org.apache.hadoop.hbase.security.token.TestDelegationTokenWithEncryption.org.apache.hadoop.hbase.security.token.TestDelegationTokenWithEncryption
  Run 1: TestDelegationTokenWithEncryption.setUp:55->SecureTestCluster.setUp:105 » IO
T...
  Run 2: TestDelegationTokenWithEncryption>SecureTestCluster.tearDown:117 » NullPointer

org.apache.hadoop.hbase.security.token.TestGenerateDelegationToken.org.apache.hadoop.hbase.security.token.TestGenerateDelegationToken
  Run 1: TestGenerateDelegationToken>SecureTestCluster.setUp:105 » IO Timed out waiting...
  Run 2: TestGenerateDelegationToken>SecureTestCluster.tearDown:117 » NullPointer

  TestDefaultScanLabelGeneratorStack.setupBeforeClass:79 » IO Timed out waiting ...
  TestEnforcingScanLabelGenerator.setupBeforeClass:76 » IO Timed out waiting for...
  TestVisibilityLabelReplicationWithExpAsString.setup:137 » IO Timed out waiting...
  TestVisibilityLabelsOpWithDifferentUsersNoACL.setupBeforeClass:69 » IO Timed o...
  TestVisibilityLabelsReplication.setup:186 » IO Timed out waiting for Mini HDFS...
  TestVisibilityLabelsWithACL.setupBeforeClass:89 » IO Timed out waiting for Min...
  TestVisibilityLabelsWithCustomVisLabService.setupBeforeClass:52 » IO Timed out...
  TestVisibilityLabelsWithDefaultVisLabelService.setupBeforeClass:74 » IO Timed ...
  TestVisibilityLabelsWithDeletes.setupBeforeClass:97 » IO Timed out waiting for...
  TestVisibilityLabelsWithSLGStack.setupBeforeClass:76 » IO Timed out waiting fo...
  TestVisibilityLablesWithGroups.setupBeforeClass:88 » IO Timed out waiting for ...
  TestVisibilityWithCheckAuths.setupBeforeClass:79 » IO Timed out waiting for Mi...
  TestWithDisabledAuthorization.setUpBeforeClass:87 » IO Timed out waiting for M...
  TestExportSnapshot.setUpBeforeClass:93 » IO Timed out waiting for Mini HDFS Cl...
  TestFlushSnapshotFromClient.setupCluster:88 » IO Timed out waiting for Mini HD...
  TestMobExportSnapshot.setUpBeforeClass:47 » IO Timed out waiting for Mini HDFS...
  TestMobFlushSnapshotFromClient.setupCluster:56 » IO Timed out waiting for Mini...
  TestMobRestoreFlushSnapshotFromClient.setupCluster:47 » IO Timed out waiting f...
  TestMobSecureExportSnapshot.setUpBeforeClass:47 » IO Timed out waiting for Min...
  TestRestoreFlushSnapshotFromClient.setupCluster:69 » IO Timed out waiting for ...
  TestSecureExportSnapshot.setUpBeforeClass:53 » IO Timed out waiting for Mini H...
  TestSnapshotClientRetries.setUp:55 » IO Timed out waiting for Mini HDFS Cluste...
  TestSnapshotClientRetries.setUp:55 » IO Timed out waiting for Mini HDFS Cluste...
  TestCanaryTool.setUp:68 » IO Timed out waiting for Mini HDFS Cluster to start
  TestCanaryTool.setUp:68 » IO Timed out waiting for Mini HDFS Cluster to start
  TestCanaryTool.setUp:68 » IO Timed out waiting for Mini HDFS Cluster to start
  TestCanaryTool.setUp:68 » IO Timed out waiting for Mini HDFS Cluster to start
  TestCanaryTool.setUp:68 » IO Timed out waiting for Mini HDFS Cluster to start
  TestHTraceHooks.before:64 » IO Timed out waiting for Mini HDFS Cluster to star...
  TestConnectionCache.testConnectionChore:38 » IO Timed out waiting for Mini HDF...
  TestCoprocessorScanPolicy.setUpBeforeClass:84 » IO Timed out waiting for Mini ...
  TestFSUtils.testDFSHedgedReadMetrics:407 » IO Timed out waiting for Mini HDFS ...
  TestFSUtils.testIsHDFS:117 » IO Timed out waiting for Mini HDFS Cluster to sta...
  TestFSUtils.testRenameAndSetModifyTime:313 » IO Timed out waiting for Mini HDF...
  TestFSUtils.testSetStoragePolicyDefault:375->verifyFileInDirWithStoragePolicy:352 »
IO
  TestFSUtils.testSetStoragePolicyInvalid:387->verifyFileInDirWithStoragePolicy:352 »
IO
  TestFSUtils.testSetStoragePolicyValidButMaybeNotPresent:381->verifyFileInDirWithStoragePolicy:352
» IO
  TestFSUtils.testcomputeHDFSBlocksDistribution:143 » IO Timed out waiting for M...
  TestHBaseFsckEncryption.setUp:84 » IO Timed out waiting for Mini HDFS Cluster ...
org.apache.hadoop.hbase.util.TestHBaseFsckMOB.org.apache.hadoop.hbase.util.TestHBaseFsckMOB
  Run 1: TestHBaseFsckMOB.setUpBeforeClass:62 » IO Timed out waiting for Mini HDFS Clus...
  Run 2: TestHBaseFsckMOB.tearDownAfterClass:84 NullPointer

org.apache.hadoop.hbase.util.TestHBaseFsckOneRS.org.apache.hadoop.hbase.util.TestHBaseFsckOneRS
  Run 1: TestHBaseFsckOneRS.setUpBeforeClass:109 » IO Timed out waiting for Mini HDFS C...
  Run 2: TestHBaseFsckOneRS.tearDownAfterClass:131 NullPointer

org.apache.hadoop.hbase.util.TestHBaseFsckReplicas.org.apache.hadoop.hbase.util.TestHBaseFsckReplicas
  Run 1: TestHBaseFsckReplicas.setUpBeforeClass:69 » IO Timed out waiting for Mini HDFS...
  Run 2: TestHBaseFsckReplicas.tearDownAfterClass:91 NullPointer

org.apache.hadoop.hbase.util.TestHBaseFsckTwoRS.org.apache.hadoop.hbase.util.TestHBaseFsckTwoRS
  Run 1: TestHBaseFsckTwoRS.setUpBeforeClass:77 » IO Timed out waiting for Mini HDFS Cl...
  Run 2: TestHBaseFsckTwoRS.tearDownAfterClass:99 NullPointer

  TestMergeTable.testMergeTable:78 » IO Timed out waiting for Mini HDFS Cluster ...
  TestMergeTool.setUp:138 » IO Timed out waiting for Mini HDFS Cluster to start
  TestMiniClusterLoadEncoded>TestMiniClusterLoadSequential.setUp:104 » IO Timed ...
  TestMiniClusterLoadEncoded>TestMiniClusterLoadSequential.setUp:104 » IO Timed ...
  TestMiniClusterLoadEncoded>TestMiniClusterLoadSequential.setUp:104 » IO Timed ...
  TestMiniClusterLoadEncoded>TestMiniClusterLoadSequential.setUp:104 » IO Timed ...
  TestMiniClusterLoadEncoded>TestMiniClusterLoadSequential.setUp:104 » IO Timed ...
  TestMiniClusterLoadParallel>TestMiniClusterLoadSequential.setUp:104 » IO Timed...
  TestMiniClusterLoadParallel>TestMiniClusterLoadSequential.setUp:104 » IO Timed...
  TestMiniClusterLoadParallel>TestMiniClusterLoadSequential.setUp:104 » IO Timed...
  TestMiniClusterLoadParallel>TestMiniClusterLoadSequential.setUp:104 » IO Timed...
  TestMiniClusterLoadSequential.setUp:104 » IO Timed out waiting for Mini HDFS C...
  TestMiniClusterLoadSequential.setUp:104 » IO Timed out waiting for Mini HDFS C...
  TestMiniClusterLoadSequential.setUp:104 » IO Timed out waiting for Mini HDFS C...
  TestMiniClusterLoadSequential.setUp:104 » IO Timed out waiting for Mini HDFS C...
  TestRegionMover.setUpBeforeClass:57 » IO Timed out waiting for Mini HDFS Clust...
  TestRegionSplitter.setup:63 » IO Timed out waiting for Mini HDFS Cluster to st...
org.apache.hadoop.hbase.util.hbck.TestOfflineMetaRebuildBase.testMetaRebuild(org.apache.hadoop.hbase.util.hbck.TestOfflineMetaRebuildBase)
  Run 1: TestOfflineMetaRebuildBase>OfflineMetaRebuildTestCore.setUpBefore:96 » IO Time...
  Run 2: TestOfflineMetaRebuildBase>OfflineMetaRebuildTestCore.tearDownAfter:120 » NullPointer

org.apache.hadoop.hbase.util.hbck.TestOfflineMetaRebuildHole.testMetaRebuildHoleFail(org.apache.hadoop.hbase.util.hbck.TestOfflineMetaRebuildHole)
  Run 1: TestOfflineMetaRebuildHole>OfflineMetaRebuildTestCore.setUpBefore:96 » IO Time...
  Run 2: TestOfflineMetaRebuildHole>OfflineMetaRebuildTestCore.tearDownAfter:120 » NullPointer

org.apache.hadoop.hbase.util.hbck.TestOfflineMetaRebuildOverlap.testMetaRebuildOverlapFail(org.apache.hadoop.hbase.util.hbck.TestOfflineMetaRebuildOverlap)
  Run 1: TestOfflineMetaRebuildOverlap>OfflineMetaRebuildTestCore.setUpBefore:96 » IO
T...
  Run 2: TestOfflineMetaRebuildOverlap>OfflineMetaRebuildTestCore.tearDownAfter:120 »
NullPointer

  TestBoundedRegionGroupingStrategy.setUpBeforeClass:104 » IO Timed out waiting ...
  TestDefaultWALProviderWithHLogKey>TestFSHLogProvider.setUpBeforeClass:105 » IO
  TestFSHLogProvider.setUpBeforeClass:105 » IO Timed out waiting for Mini HDFS C...
  TestSecureWAL.setUpBeforeClass:100 » IO Timed out waiting for Mini HDFS Cluste...
  TestWALFactory.setUpBeforeClass:145 » IO Timed out waiting for Mini HDFS Clust...
  TestWALFiltering.setUp:66 » IO Timed out waiting for Mini HDFS Cluster to star...
  TestWALSplit.setUpBeforeClass:166 » IO Timed out waiting for Mini HDFS Cluster...
  TestWALSplitCompressed.setUpBeforeClass:33->TestWALSplit.setUpBeforeClass:166 » IO

Tests run: 1392, Failures: 0, Errors: 512, Skipped: 23

[INFO] ------------------------------------------------------------------------
[INFO] Reactor Summary:
[INFO] 
[INFO] Apache HBase ...................................... SUCCESS [3.047s]
[INFO] Apache HBase - Checkstyle ......................... SUCCESS [1.614s]
[INFO] Apache HBase - Resource Bundle .................... SUCCESS [0.394s]
[INFO] Apache HBase - Annotations ........................ SUCCESS [0.420s]
[INFO] Apache HBase - Protocol ........................... SUCCESS [3.325s]
[INFO] Apache HBase - Common ............................. SUCCESS [1:17.578s]
[INFO] Apache HBase - Procedure .......................... SUCCESS [1:12.587s]
[INFO] Apache HBase - Client ............................. SUCCESS [33.595s]
[INFO] Apache HBase - Hadoop Compatibility ............... SUCCESS [7.620s]
[INFO] Apache HBase - Hadoop Two Compatibility ........... SUCCESS [9.064s]
[INFO] Apache HBase - Prefix Tree ........................ SUCCESS [8.581s]
[INFO] Apache HBase - Server ............................. FAILURE [51:51.331s]
[INFO] Apache HBase - Testing Util ....................... SKIPPED
[INFO] Apache HBase - Thrift ............................. SKIPPED
[INFO] Apache HBase - RSGroup ............................ SKIPPED
[INFO] Apache HBase - Shell .............................. SKIPPED
[INFO] Apache HBase - Integration Tests .................. SKIPPED
[INFO] Apache HBase - Examples ........................... SKIPPED
[INFO] Apache HBase - Rest ............................... SKIPPED
[INFO] Apache HBase - External Block Cache ............... SKIPPED
[INFO] Apache HBase - Spark .............................. SKIPPED
[INFO] Apache HBase - Assembly ........................... SKIPPED
[INFO] Apache HBase - Shaded ............................. SKIPPED
[INFO] Apache HBase - Shaded - Client .................... SKIPPED
[INFO] Apache HBase - Shaded - Server .................... SKIPPED
[INFO] Apache HBase - Archetypes ......................... SKIPPED
[INFO] Apache HBase - Exemplar for hbase-client archetype  SKIPPED
[INFO] Apache HBase - Exemplar for hbase-shaded-client archetype  SKIPPED
[INFO] Apache HBase - Archetype builder .................. SKIPPED
[INFO] ------------------------------------------------------------------------
[INFO] BUILD FAILURE
[INFO] ------------------------------------------------------------------------
[INFO] Total time: 55:30.895s
[INFO] Finished at: Fri Aug 19 02:35:37 UTC 2016
[INFO] Final Memory: 63M/2010M
[INFO] ------------------------------------------------------------------------
[ERROR] Failed to execute goal org.apache.maven.plugins:maven-surefire-plugin:2.18.1:test
(secondPartTestsExecution) on project hbase-server: There are test failures.
[ERROR] 
[ERROR] Please refer to <https://builds.apache.org/job/HBase-Trunk_matrix/jdk=JDK%201.8%20(latest),label=yahoo-not-h2/ws/hbase-server/target/surefire-reports>
for the individual test results.
[ERROR] -> [Help 1]
[ERROR] 
[ERROR] To see the full stack trace of the errors, re-run Maven with the -e switch.
[ERROR] Re-run Maven using the -X switch to enable full debug logging.
[ERROR] 
[ERROR] For more information about the errors and possible solutions, please read the following
articles:
[ERROR] [Help 1] http://cwiki.apache.org/confluence/display/MAVEN/MojoFailureException
[ERROR] 
[ERROR] After correcting the problems, you can resume the build with the command
[ERROR]   mvn <goals> -rf :hbase-server
Build step 'Invoke top-level Maven targets' marked build as failure
Performing Post build task...
Match found for :.* : True
Logical operation result is TRUE
Running script  : # Run zombie detector script
./dev-support/zombie-detector.sh --jenkins ${BUILD_ID}
[yahoo-not-h2] $ /bin/bash -xe /tmp/hudson8011079051496266362.sh
+ ./dev-support/zombie-detector.sh --jenkins 1440
Fri Aug 19 02:35:41 UTC 2016 We're ok: there is no zombie test


    {color:green}+1 zombies{color}. No zombie tests found running at the end of the build.
POST BUILD TASK : SUCCESS
END OF POST BUILD TASK : 0
Archiving artifacts
No prior successful build to compare, so performing full copy of artifacts
Recording test results
[FINDBUGS] Skipping publisher since build result is FAILURE
[CHECKSTYLE] Skipping publisher since build result is FAILURE

Mime
View raw message