hbase-builds mailing list archives

Site index · List index
Message view « Date » · « Thread »
Top « Date » · « Thread »
From Apache Jenkins Server <jenk...@builds.apache.org>
Subject Build failed in Jenkins: HBase-Trunk_matrix » latest1.7,yahoo-not-h2 #1351
Date Thu, 04 Aug 2016 07:06:55 GMT
See <https://builds.apache.org/job/HBase-Trunk_matrix/jdk=latest1.7,label=yahoo-not-h2/1351/changes>

Changes:

[enis] HBASE-16350 Undo server abort from HBASE-14968

[ndimiduk] HBASE-16317 revert all ESAPI changes

[busbey] HBASE-15574 Fix typo in HRegionServerCommandLine

------------------------------------------
[...truncated 4746 lines...]
Tests run: 15, Failures: 0, Errors: 0, Skipped: 0, Time elapsed: 0.675 sec - in org.apache.hadoop.hbase.util.TestRegionSplitCalculator
Running org.apache.hadoop.hbase.util.TestPoolMap$TestThreadLocalPoolType
Tests run: 3, Failures: 0, Errors: 0, Skipped: 0, Time elapsed: 0.215 sec - in org.apache.hadoop.hbase.util.TestPoolMap$TestThreadLocalPoolType
Running org.apache.hadoop.hbase.util.TestSortedCopyOnWriteSet
Tests run: 2, Failures: 0, Errors: 0, Skipped: 0, Time elapsed: 0.193 sec - in org.apache.hadoop.hbase.util.TestSortedCopyOnWriteSet
Running org.apache.hadoop.hbase.util.TestEncryptionTest
Tests run: 3, Failures: 0, Errors: 0, Skipped: 0, Time elapsed: 1.495 sec - in org.apache.hadoop.hbase.util.TestEncryptionTest
Running org.apache.hadoop.hbase.util.TestSortedList
Tests run: 4, Failures: 0, Errors: 0, Skipped: 0, Time elapsed: 0.25 sec - in org.apache.hadoop.hbase.util.TestSortedList
Running org.apache.hadoop.hbase.util.TestPoolMap$TestRoundRobinPoolType
Tests run: 3, Failures: 0, Errors: 0, Skipped: 0, Time elapsed: 0.226 sec - in org.apache.hadoop.hbase.util.TestPoolMap$TestRoundRobinPoolType
Running org.apache.hadoop.hbase.util.TestBloomFilterChunk
Tests run: 5, Failures: 0, Errors: 0, Skipped: 0, Time elapsed: 0.943 sec - in org.apache.hadoop.hbase.util.TestBloomFilterChunk
Running org.apache.hadoop.hbase.util.TestPoolMap$TestRoundRobinPoolType
Tests run: 3, Failures: 0, Errors: 0, Skipped: 0, Time elapsed: 0.218 sec - in org.apache.hadoop.hbase.util.TestPoolMap$TestRoundRobinPoolType
Running org.apache.hadoop.hbase.util.TestPoolMap$TestThreadLocalPoolType
Tests run: 3, Failures: 0, Errors: 0, Skipped: 0, Time elapsed: 0.111 sec - in org.apache.hadoop.hbase.util.TestPoolMap$TestThreadLocalPoolType
Running org.apache.hadoop.hbase.util.TestPoolMap$TestReusablePoolType
Tests run: 3, Failures: 0, Errors: 0, Skipped: 0, Time elapsed: 0.121 sec - in org.apache.hadoop.hbase.util.TestPoolMap$TestReusablePoolType
Running org.apache.hadoop.hbase.util.TestCompressionTest
Tests run: 2, Failures: 0, Errors: 0, Skipped: 0, Time elapsed: 0.786 sec - in org.apache.hadoop.hbase.util.TestCompressionTest
Running org.apache.hadoop.hbase.util.TestBoundedPriorityBlockingQueue
Tests run: 7, Failures: 0, Errors: 0, Skipped: 0, Time elapsed: 1.367 sec - in org.apache.hadoop.hbase.util.TestBoundedPriorityBlockingQueue
Running org.apache.hadoop.hbase.util.TestByteBufferUtils
Tests run: 16, Failures: 0, Errors: 0, Skipped: 0, Time elapsed: 0.684 sec - in org.apache.hadoop.hbase.util.TestByteBufferUtils
Running org.apache.hadoop.hbase.util.TestByteBuffUtils
Tests run: 1, Failures: 0, Errors: 0, Skipped: 0, Time elapsed: 0.163 sec - in org.apache.hadoop.hbase.util.TestByteBuffUtils
Running org.apache.hadoop.hbase.util.TestHBaseFsckComparator
Tests run: 6, Failures: 0, Errors: 0, Skipped: 0, Time elapsed: 0.254 sec - in org.apache.hadoop.hbase.util.TestHBaseFsckComparator
Running org.apache.hadoop.hbase.util.TestPoolMap$TestReusablePoolType
Tests run: 3, Failures: 0, Errors: 0, Skipped: 0, Time elapsed: 0.213 sec - in org.apache.hadoop.hbase.util.TestPoolMap$TestReusablePoolType
Running org.apache.hadoop.hbase.util.TestIncrementingEnvironmentEdge
Tests run: 1, Failures: 0, Errors: 0, Skipped: 0, Time elapsed: 0.139 sec - in org.apache.hadoop.hbase.util.TestIncrementingEnvironmentEdge
Running org.apache.hadoop.hbase.util.TestConfigurationUtil
Tests run: 2, Failures: 0, Errors: 0, Skipped: 0, Time elapsed: 0.587 sec - in org.apache.hadoop.hbase.util.TestConfigurationUtil
Running org.apache.hadoop.hbase.util.TestHFileArchiveUtil
Tests run: 4, Failures: 0, Errors: 0, Skipped: 0, Time elapsed: 1.292 sec - in org.apache.hadoop.hbase.util.TestHFileArchiveUtil
Running org.apache.hadoop.hbase.wal.TestWALMethods
Tests run: 3, Failures: 0, Errors: 0, Skipped: 0, Time elapsed: 1.11 sec - in org.apache.hadoop.hbase.wal.TestWALMethods
Running org.apache.hadoop.hbase.mob.TestMobFile
Tests run: 2, Failures: 0, Errors: 0, Skipped: 0, Time elapsed: 1.061 sec - in org.apache.hadoop.hbase.mob.TestMobFile
Running org.apache.hadoop.hbase.mob.TestMobFileCache
Tests run: 1, Failures: 0, Errors: 0, Skipped: 0, Time elapsed: 2.471 sec - in org.apache.hadoop.hbase.mob.TestMobFileCache
Running org.apache.hadoop.hbase.mob.mapreduce.TestMobSweepMapper
Tests run: 1, Failures: 0, Errors: 0, Skipped: 0, Time elapsed: 1.843 sec - in org.apache.hadoop.hbase.mob.mapreduce.TestMobSweepMapper
Running org.apache.hadoop.hbase.mob.TestMobFileName
Tests run: 4, Failures: 0, Errors: 0, Skipped: 0, Time elapsed: 0.32 sec - in org.apache.hadoop.hbase.mob.TestMobFileName
Running org.apache.hadoop.hbase.mob.TestMobFileLink
Tests run: 1, Failures: 0, Errors: 0, Skipped: 0, Time elapsed: 1.166 sec - in org.apache.hadoop.hbase.mob.TestMobFileLink
Running org.apache.hadoop.hbase.mob.compactions.TestPartitionedMobCompactionRequest
Tests run: 2, Failures: 0, Errors: 0, Skipped: 0, Time elapsed: 0.191 sec - in org.apache.hadoop.hbase.mob.compactions.TestPartitionedMobCompactionRequest
Running org.apache.hadoop.hbase.mob.TestCachedMobFile
Tests run: 3, Failures: 0, Errors: 0, Skipped: 0, Time elapsed: 1.123 sec - in org.apache.hadoop.hbase.mob.TestCachedMobFile
Running org.apache.hadoop.hbase.constraint.TestConstraints
Tests run: 6, Failures: 0, Errors: 0, Skipped: 0, Time elapsed: 1.415 sec - in org.apache.hadoop.hbase.constraint.TestConstraints
Running org.apache.hadoop.hbase.TestHRegionLocation
Tests run: 3, Failures: 0, Errors: 0, Skipped: 0, Time elapsed: 0.248 sec - in org.apache.hadoop.hbase.TestHRegionLocation
Running org.apache.hadoop.hbase.TestHDFSBlocksDistribution
Tests run: 2, Failures: 0, Errors: 0, Skipped: 0, Time elapsed: 0.179 sec - in org.apache.hadoop.hbase.TestHDFSBlocksDistribution
Running org.apache.hadoop.hbase.filter.TestFirstKeyValueMatchingQualifiersFilter
Tests run: 1, Failures: 0, Errors: 0, Skipped: 0, Time elapsed: 0.076 sec - in org.apache.hadoop.hbase.filter.TestFirstKeyValueMatchingQualifiersFilter
Running org.apache.hadoop.hbase.filter.TestParseFilter
Tests run: 34, Failures: 0, Errors: 0, Skipped: 0, Time elapsed: 1.333 sec - in org.apache.hadoop.hbase.filter.TestParseFilter
Running org.apache.hadoop.hbase.filter.TestFuzzyRowFilter
Tests run: 6, Failures: 0, Errors: 0, Skipped: 0, Time elapsed: 0.352 sec - in org.apache.hadoop.hbase.filter.TestFuzzyRowFilter
Running org.apache.hadoop.hbase.filter.TestSingleColumnValueFilter
Tests run: 3, Failures: 0, Errors: 0, Skipped: 0, Time elapsed: 1.198 sec - in org.apache.hadoop.hbase.filter.TestSingleColumnValueFilter
Running org.apache.hadoop.hbase.filter.TestDependentColumnFilter
Tests run: 4, Failures: 0, Errors: 0, Skipped: 0, Time elapsed: 2.047 sec - in org.apache.hadoop.hbase.filter.TestDependentColumnFilter
Running org.apache.hadoop.hbase.filter.TestNullComparator
Tests run: 3, Failures: 0, Errors: 0, Skipped: 0, Time elapsed: 0.212 sec - in org.apache.hadoop.hbase.filter.TestNullComparator
Running org.apache.hadoop.hbase.filter.TestRandomRowFilter
Tests run: 2, Failures: 0, Errors: 0, Skipped: 0, Time elapsed: 0.568 sec - in org.apache.hadoop.hbase.filter.TestRandomRowFilter
Running org.apache.hadoop.hbase.filter.TestInvocationRecordFilter
Tests run: 1, Failures: 0, Errors: 0, Skipped: 0, Time elapsed: 1.701 sec - in org.apache.hadoop.hbase.filter.TestInvocationRecordFilter
Running org.apache.hadoop.hbase.filter.TestColumnPaginationFilter
Tests run: 1, Failures: 0, Errors: 0, Skipped: 0, Time elapsed: 1.07 sec - in org.apache.hadoop.hbase.filter.TestColumnPaginationFilter
Running org.apache.hadoop.hbase.filter.TestPrefixFilter
Tests run: 3, Failures: 0, Errors: 0, Skipped: 0, Time elapsed: 0.176 sec - in org.apache.hadoop.hbase.filter.TestPrefixFilter
Running org.apache.hadoop.hbase.filter.TestFilter
Tests run: 22, Failures: 0, Errors: 0, Skipped: 0, Time elapsed: 5.87 sec - in org.apache.hadoop.hbase.filter.TestFilter
Running org.apache.hadoop.hbase.filter.TestSingleColumnValueExcludeFilter
Tests run: 1, Failures: 0, Errors: 0, Skipped: 0, Time elapsed: 0.082 sec - in org.apache.hadoop.hbase.filter.TestSingleColumnValueExcludeFilter
Running org.apache.hadoop.hbase.filter.TestPageFilter
Tests run: 2, Failures: 0, Errors: 0, Skipped: 0, Time elapsed: 0.207 sec - in org.apache.hadoop.hbase.filter.TestPageFilter
Running org.apache.hadoop.hbase.filter.TestBitComparator
Tests run: 6, Failures: 0, Errors: 0, Skipped: 0, Time elapsed: 0.304 sec - in org.apache.hadoop.hbase.filter.TestBitComparator
Running org.apache.hadoop.hbase.filter.TestFilterFromRegionSide
Tests run: 2, Failures: 0, Errors: 0, Skipped: 0, Time elapsed: 0.394 sec - in org.apache.hadoop.hbase.filter.TestFilterFromRegionSide
Running org.apache.hadoop.hbase.filter.TestColumnPrefixFilter
Tests run: 2, Failures: 0, Errors: 0, Skipped: 0, Time elapsed: 4.324 sec - in org.apache.hadoop.hbase.filter.TestColumnPrefixFilter
Running org.apache.hadoop.hbase.filter.TestFilterList
Tests run: 7, Failures: 0, Errors: 0, Skipped: 0, Time elapsed: 1.297 sec - in org.apache.hadoop.hbase.filter.TestFilterList
Running org.apache.hadoop.hbase.filter.TestComparatorSerialization
Tests run: 6, Failures: 0, Errors: 0, Skipped: 0, Time elapsed: 1.359 sec - in org.apache.hadoop.hbase.filter.TestComparatorSerialization
Running org.apache.hadoop.hbase.filter.TestInclusiveStopFilter
Tests run: 2, Failures: 0, Errors: 0, Skipped: 0, Time elapsed: 0.137 sec - in org.apache.hadoop.hbase.filter.TestInclusiveStopFilter
Running org.apache.hadoop.hbase.filter.TestMultipleColumnPrefixFilter
Tests run: 3, Failures: 0, Errors: 0, Skipped: 0, Time elapsed: 5.548 sec - in org.apache.hadoop.hbase.filter.TestMultipleColumnPrefixFilter
Running org.apache.hadoop.hbase.filter.TestRegexComparator
Tests run: 3, Failures: 0, Errors: 0, Skipped: 0, Time elapsed: 0.422 sec - in org.apache.hadoop.hbase.filter.TestRegexComparator
Running org.apache.hadoop.hbase.filter.TestFilterSerialization
Tests run: 26, Failures: 0, Errors: 0, Skipped: 0, Time elapsed: 2.153 sec - in org.apache.hadoop.hbase.filter.TestFilterSerialization
Running org.apache.hadoop.hbase.io.TestReference
Tests run: 1, Failures: 0, Errors: 0, Skipped: 0, Time elapsed: 0.664 sec - in org.apache.hadoop.hbase.io.TestReference
Running org.apache.hadoop.hbase.io.TestByteBufferOutputStream
Tests run: 1, Failures: 0, Errors: 0, Skipped: 0, Time elapsed: 0.162 sec - in org.apache.hadoop.hbase.io.TestByteBufferOutputStream
Running org.apache.hadoop.hbase.io.hfile.TestLruCachedBlock
Tests run: 1, Failures: 0, Errors: 0, Skipped: 0, Time elapsed: 0.347 sec - in org.apache.hadoop.hbase.io.hfile.TestLruCachedBlock
Running org.apache.hadoop.hbase.io.hfile.TestHFileDataBlockEncoder
Tests run: 40, Failures: 0, Errors: 0, Skipped: 0, Time elapsed: 2.394 sec - in org.apache.hadoop.hbase.io.hfile.TestHFileDataBlockEncoder
Running org.apache.hadoop.hbase.io.hfile.TestReseekTo
Tests run: 1, Failures: 0, Errors: 0, Skipped: 0, Time elapsed: 1.314 sec - in org.apache.hadoop.hbase.io.hfile.TestReseekTo
Running org.apache.hadoop.hbase.io.hfile.TestHFileEncryption
Tests run: 3, Failures: 0, Errors: 0, Skipped: 0, Time elapsed: 4.082 sec - in org.apache.hadoop.hbase.io.hfile.TestHFileEncryption
Running org.apache.hadoop.hbase.io.hfile.TestLazyDataBlockDecompression
Tests run: 2, Failures: 0, Errors: 0, Skipped: 0, Time elapsed: 1.437 sec - in org.apache.hadoop.hbase.io.hfile.TestLazyDataBlockDecompression
Running org.apache.hadoop.hbase.io.hfile.TestHFileInlineToRootChunkConversion
Tests run: 1, Failures: 0, Errors: 0, Skipped: 0, Time elapsed: 0.932 sec - in org.apache.hadoop.hbase.io.hfile.TestHFileInlineToRootChunkConversion
Running org.apache.hadoop.hbase.io.hfile.TestChecksum
Tests run: 4, Failures: 0, Errors: 0, Skipped: 0, Time elapsed: 1.206 sec - in org.apache.hadoop.hbase.io.hfile.TestChecksum
Running org.apache.hadoop.hbase.io.hfile.TestCombinedBlockCache
Tests run: 1, Failures: 0, Errors: 0, Skipped: 0, Time elapsed: 0.167 sec - in org.apache.hadoop.hbase.io.hfile.TestCombinedBlockCache
Running org.apache.hadoop.hbase.io.hfile.TestHFileWriterV3
Tests run: 4, Failures: 0, Errors: 0, Skipped: 0, Time elapsed: 3.691 sec - in org.apache.hadoop.hbase.io.hfile.TestHFileWriterV3
Running org.apache.hadoop.hbase.io.hfile.TestPrefetch
Tests run: 2, Failures: 0, Errors: 0, Skipped: 0, Time elapsed: 3.124 sec - in org.apache.hadoop.hbase.io.hfile.TestPrefetch
Running org.apache.hadoop.hbase.io.hfile.TestHFile
Tests run: 9, Failures: 0, Errors: 0, Skipped: 0, Time elapsed: 0.929 sec - in org.apache.hadoop.hbase.io.hfile.TestHFile
Running org.apache.hadoop.hbase.io.hfile.TestSeekTo
Tests run: 20, Failures: 0, Errors: 0, Skipped: 0, Time elapsed: 2.226 sec - in org.apache.hadoop.hbase.io.hfile.TestSeekTo
Running org.apache.hadoop.hbase.io.hfile.TestLruBlockCache
Tests run: 11, Failures: 0, Errors: 0, Skipped: 0, Time elapsed: 1.119 sec - in org.apache.hadoop.hbase.io.hfile.TestLruBlockCache
Running org.apache.hadoop.hbase.io.hfile.TestScannerSelectionUsingKeyRange
Tests run: 3, Failures: 0, Errors: 0, Skipped: 0, Time elapsed: 1.985 sec - in org.apache.hadoop.hbase.io.hfile.TestScannerSelectionUsingKeyRange
Running org.apache.hadoop.hbase.io.hfile.TestFixedFileTrailer
Tests run: 4, Failures: 0, Errors: 0, Skipped: 0, Time elapsed: 0.927 sec - in org.apache.hadoop.hbase.io.hfile.TestFixedFileTrailer
Running org.apache.hadoop.hbase.io.hfile.TestBlockCacheReporting
Tests run: 2, Failures: 0, Errors: 0, Skipped: 0, Time elapsed: 1.013 sec - in org.apache.hadoop.hbase.io.hfile.TestBlockCacheReporting
Running org.apache.hadoop.hbase.io.hfile.TestCachedBlockQueue
Tests run: 2, Failures: 0, Errors: 0, Skipped: 0, Time elapsed: 0.209 sec - in org.apache.hadoop.hbase.io.hfile.TestCachedBlockQueue
Running org.apache.hadoop.hbase.io.hfile.bucket.TestByteBufferIOEngine
Tests run: 2, Failures: 0, Errors: 0, Skipped: 0, Time elapsed: 0.37 sec - in org.apache.hadoop.hbase.io.hfile.bucket.TestByteBufferIOEngine
Running org.apache.hadoop.hbase.io.hfile.bucket.TestBucketCache
Tests run: 10, Failures: 0, Errors: 0, Skipped: 0, Time elapsed: 8.541 sec - in org.apache.hadoop.hbase.io.hfile.bucket.TestBucketCache
Running org.apache.hadoop.hbase.io.hfile.bucket.TestFileIOEngine
Tests run: 1, Failures: 0, Errors: 0, Skipped: 0, Time elapsed: 0.18 sec - in org.apache.hadoop.hbase.io.hfile.bucket.TestFileIOEngine
Running org.apache.hadoop.hbase.io.hfile.bucket.TestBucketWriterThread
Tests run: 4, Failures: 0, Errors: 0, Skipped: 0, Time elapsed: 0.719 sec - in org.apache.hadoop.hbase.io.hfile.bucket.TestBucketWriterThread
Running org.apache.hadoop.hbase.io.hfile.bucket.TestFileMmapEngine
Tests run: 1, Failures: 0, Errors: 0, Skipped: 0, Time elapsed: 0.181 sec - in org.apache.hadoop.hbase.io.hfile.bucket.TestFileMmapEngine
Running org.apache.hadoop.hbase.io.hfile.TestHFileBlockPositionalRead
Tests run: 6, Failures: 0, Errors: 0, Skipped: 0, Time elapsed: 0.558 sec - in org.apache.hadoop.hbase.io.hfile.TestHFileBlockPositionalRead
Running org.apache.hadoop.hbase.io.TestImmutableBytesWritable
Tests run: 3, Failures: 0, Errors: 0, Skipped: 0, Time elapsed: 0.25 sec - in org.apache.hadoop.hbase.io.TestImmutableBytesWritable
Running org.apache.hadoop.hbase.io.encoding.TestSeekToBlockWithEncoders
Tests run: 18, Failures: 0, Errors: 0, Skipped: 0, Time elapsed: 0.756 sec - in org.apache.hadoop.hbase.io.encoding.TestSeekToBlockWithEncoders
Running org.apache.hadoop.hbase.io.encoding.TestPrefixTree
Tests run: 2, Failures: 0, Errors: 0, Skipped: 0, Time elapsed: 1.927 sec - in org.apache.hadoop.hbase.io.encoding.TestPrefixTree
Running org.apache.hadoop.hbase.io.encoding.TestPrefixTreeEncoding
Tests run: 8, Failures: 0, Errors: 0, Skipped: 0, Time elapsed: 1.599 sec - in org.apache.hadoop.hbase.io.encoding.TestPrefixTreeEncoding
Running org.apache.hadoop.hbase.io.encoding.TestSeekBeforeWithReverseScan
Tests run: 2, Failures: 0, Errors: 0, Skipped: 0, Time elapsed: 1.84 sec - in org.apache.hadoop.hbase.io.encoding.TestSeekBeforeWithReverseScan
Running org.apache.hadoop.hbase.io.asyncfs.TestLocalAsyncOutput
Tests run: 1, Failures: 0, Errors: 0, Skipped: 0, Time elapsed: 0.691 sec - in org.apache.hadoop.hbase.io.asyncfs.TestLocalAsyncOutput
Running org.apache.hadoop.hbase.io.TestHFileLink
Tests run: 2, Failures: 0, Errors: 0, Skipped: 0, Time elapsed: 0.282 sec - in org.apache.hadoop.hbase.io.TestHFileLink
Running org.apache.hadoop.hbase.io.TestHalfStoreFileReader
Tests run: 2, Failures: 0, Errors: 0, Skipped: 0, Time elapsed: 1.321 sec - in org.apache.hadoop.hbase.io.TestHalfStoreFileReader
Running org.apache.hadoop.hbase.io.TestHeapSize
Tests run: 5, Failures: 0, Errors: 0, Skipped: 0, Time elapsed: 0.294 sec - in org.apache.hadoop.hbase.io.TestHeapSize

Results :

Tests in error: 
  TestLogLevel.testDynamicLogLevel:70 » IO Server returned HTTP response code: 5...

Tests run: 1101, Failures: 0, Errors: 1, Skipped: 21

[INFO] ------------------------------------------------------------------------
[INFO] Reactor Summary:
[INFO] 
[INFO] Apache HBase ...................................... SUCCESS [  2.690 s]
[INFO] Apache HBase - Checkstyle ......................... SUCCESS [  0.669 s]
[INFO] Apache HBase - Resource Bundle .................... SUCCESS [  0.262 s]
[INFO] Apache HBase - Annotations ........................ SUCCESS [  0.212 s]
[INFO] Apache HBase - Protocol ........................... SUCCESS [  3.524 s]
[INFO] Apache HBase - Common ............................. SUCCESS [01:32 min]
[INFO] Apache HBase - Procedure .......................... SUCCESS [01:38 min]
[INFO] Apache HBase - Client ............................. SUCCESS [ 42.061 s]
[INFO] Apache HBase - Hadoop Compatibility ............... SUCCESS [  7.570 s]
[INFO] Apache HBase - Hadoop Two Compatibility ........... SUCCESS [  9.462 s]
[INFO] Apache HBase - Prefix Tree ........................ SUCCESS [ 10.814 s]
[INFO] Apache HBase - Server ............................. FAILURE [14:03 min]
[INFO] Apache HBase - Testing Util ....................... SKIPPED
[INFO] Apache HBase - Thrift ............................. SKIPPED
[INFO] Apache HBase - RSGroup ............................ SKIPPED
[INFO] Apache HBase - Shell .............................. SKIPPED
[INFO] Apache HBase - Integration Tests .................. SKIPPED
[INFO] Apache HBase - Examples ........................... SKIPPED
[INFO] Apache HBase - Rest ............................... SKIPPED
[INFO] Apache HBase - External Block Cache ............... SKIPPED
[INFO] Apache HBase - Spark .............................. SKIPPED
[INFO] Apache HBase - Assembly ........................... SKIPPED
[INFO] Apache HBase - Shaded ............................. SKIPPED
[INFO] Apache HBase - Shaded - Client .................... SKIPPED
[INFO] Apache HBase - Shaded - Server .................... SKIPPED
[INFO] Apache HBase - Archetypes ......................... SKIPPED
[INFO] Apache HBase - Exemplar for hbase-client archetype  SKIPPED
[INFO] Apache HBase - Exemplar for hbase-shaded-client archetype  SKIPPED
[INFO] Apache HBase - Archetype builder .................. SKIPPED
[INFO] ------------------------------------------------------------------------
[INFO] BUILD FAILURE
[INFO] ------------------------------------------------------------------------
[INFO] Total time: 18:33 min
[INFO] Finished at: 2016-08-04T07:06:23+00:00
[INFO] Final Memory: 69M/587M
[INFO] ------------------------------------------------------------------------
[ERROR] Failed to execute goal org.apache.maven.plugins:maven-surefire-plugin:2.18.1:test
(default-test) on project hbase-server: There are test failures.
[ERROR] 
[ERROR] Please refer to <https://builds.apache.org/job/HBase-Trunk_matrix/jdk=latest1.7,label=yahoo-not-h2/ws/hbase-server/target/surefire-reports>
for the individual test results.
[ERROR] -> [Help 1]
[ERROR] 
[ERROR] To see the full stack trace of the errors, re-run Maven with the -e switch.
[ERROR] Re-run Maven using the -X switch to enable full debug logging.
[ERROR] 
[ERROR] For more information about the errors and possible solutions, please read the following
articles:
[ERROR] [Help 1] http://cwiki.apache.org/confluence/display/MAVEN/MojoFailureException
[ERROR] 
[ERROR] After correcting the problems, you can resume the build with the command
[ERROR]   mvn <goals> -rf :hbase-server
Build step 'Invoke top-level Maven targets' marked build as failure
Performing Post build task...
Match found for :.* : True
Logical operation result is TRUE
Running script  : # Run zombie detector script
./dev-support/zombie-detector.sh --jenkins ${BUILD_ID}
[yahoo-not-h2] $ /bin/bash -xe /tmp/hudson358502781800451678.sh
+ ./dev-support/zombie-detector.sh --jenkins 1351
Thu Aug  4 07:06:24 UTC 2016 We're ok: there is no zombie test


    {color:green}+1 zombies{color}. No zombie tests found running at the end of the build.
POST BUILD TASK : SUCCESS
END OF POST BUILD TASK : 0
Archiving artifacts
Recording test results
[FINDBUGS] Skipping publisher since build result is FAILURE
[CHECKSTYLE] Skipping publisher since build result is FAILURE

Mime
View raw message