hbase-builds mailing list archives

Site index · List index
Message view « Date » · « Thread »
Top « Date » · « Thread »
From Apache Jenkins Server <jenk...@builds.apache.org>
Subject Build failed in Jenkins: HBase-1.1-JDK7 #1758
Date Tue, 02 Aug 2016 08:49:47 GMT
See <https://builds.apache.org/job/HBase-1.1-JDK7/1758/changes>

Changes:

[apurtell] HBASE-16296 Reverse scan performance degrades when using filter lists

------------------------------------------
[...truncated 4382 lines...]
  Run 2: TestCacheOnWrite.testStoreFileCacheOnWrite:452->testStoreFileCacheOnWriteInternals:239->readStoreFile:315
expected:<...INTERMEDIATE_INDEX=3[4]}> but was:<...INTERMEDIATE_INDEX=3[2]}>
  Run 3: TestCacheOnWrite.testStoreFileCacheOnWrite:452->testStoreFileCacheOnWriteInternals:239->readStoreFile:315
expected:<...INTERMEDIATE_INDEX=3[4]}> but was:<...INTERMEDIATE_INDEX=3[2]}>

org.apache.hadoop.hbase.io.hfile.TestCacheOnWrite.testStoreFileCacheOnWrite[26](org.apache.hadoop.hbase.io.hfile.TestCacheOnWrite)
  Run 1: TestCacheOnWrite.testStoreFileCacheOnWrite:452->testStoreFileCacheOnWriteInternals:239->readStoreFile:315
expected:<...INTERMEDIATE_INDEX=3[4]}> but was:<...INTERMEDIATE_INDEX=3[2]}>
  Run 2: TestCacheOnWrite.testStoreFileCacheOnWrite:452->testStoreFileCacheOnWriteInternals:239->readStoreFile:315
expected:<...INTERMEDIATE_INDEX=3[4]}> but was:<...INTERMEDIATE_INDEX=3[2]}>
  Run 3: TestCacheOnWrite.testStoreFileCacheOnWrite:452->testStoreFileCacheOnWriteInternals:239->readStoreFile:315
expected:<...INTERMEDIATE_INDEX=3[4]}> but was:<...INTERMEDIATE_INDEX=3[2]}>

org.apache.hadoop.hbase.io.hfile.TestCacheOnWrite.testStoreFileCacheOnWrite[27](org.apache.hadoop.hbase.io.hfile.TestCacheOnWrite)
  Run 1: TestCacheOnWrite.testStoreFileCacheOnWrite:452->testStoreFileCacheOnWriteInternals:239->readStoreFile:315
expected:<...INTERMEDIATE_INDEX=3[4]}> but was:<...INTERMEDIATE_INDEX=3[2]}>
  Run 2: TestCacheOnWrite.testStoreFileCacheOnWrite:452->testStoreFileCacheOnWriteInternals:239->readStoreFile:315
expected:<...INTERMEDIATE_INDEX=3[4]}> but was:<...INTERMEDIATE_INDEX=3[2]}>
  Run 3: TestCacheOnWrite.testStoreFileCacheOnWrite:452->testStoreFileCacheOnWriteInternals:239->readStoreFile:315
expected:<...INTERMEDIATE_INDEX=3[4]}> but was:<...INTERMEDIATE_INDEX=3[2]}>

org.apache.hadoop.hbase.io.hfile.TestCacheOnWrite.testStoreFileCacheOnWrite[28](org.apache.hadoop.hbase.io.hfile.TestCacheOnWrite)
  Run 1: TestCacheOnWrite.testStoreFileCacheOnWrite:452->testStoreFileCacheOnWriteInternals:239->readStoreFile:315
expected:<...INTERMEDIATE_INDEX=3[4]}> but was:<...INTERMEDIATE_INDEX=3[2]}>
  Run 2: TestCacheOnWrite.testStoreFileCacheOnWrite:452->testStoreFileCacheOnWriteInternals:239->readStoreFile:315
expected:<...INTERMEDIATE_INDEX=3[4]}> but was:<...INTERMEDIATE_INDEX=3[2]}>
  Run 3: TestCacheOnWrite.testStoreFileCacheOnWrite:452->testStoreFileCacheOnWriteInternals:239->readStoreFile:315
expected:<...INTERMEDIATE_INDEX=3[4]}> but was:<...INTERMEDIATE_INDEX=3[2]}>

org.apache.hadoop.hbase.io.hfile.TestCacheOnWrite.testStoreFileCacheOnWrite[29](org.apache.hadoop.hbase.io.hfile.TestCacheOnWrite)
  Run 1: TestCacheOnWrite.testStoreFileCacheOnWrite:452->testStoreFileCacheOnWriteInternals:239->readStoreFile:315
expected:<...INTERMEDIATE_INDEX=3[4]}> but was:<...INTERMEDIATE_INDEX=3[2]}>
  Run 2: TestCacheOnWrite.testStoreFileCacheOnWrite:452->testStoreFileCacheOnWriteInternals:239->readStoreFile:315
expected:<...INTERMEDIATE_INDEX=3[4]}> but was:<...INTERMEDIATE_INDEX=3[2]}>
  Run 3: TestCacheOnWrite.testStoreFileCacheOnWrite:452->testStoreFileCacheOnWriteInternals:239->readStoreFile:315
expected:<...INTERMEDIATE_INDEX=3[4]}> but was:<...INTERMEDIATE_INDEX=3[2]}>

org.apache.hadoop.hbase.io.hfile.TestCacheOnWrite.testStoreFileCacheOnWrite[2](org.apache.hadoop.hbase.io.hfile.TestCacheOnWrite)
  Run 1: TestCacheOnWrite.testStoreFileCacheOnWrite:452->testStoreFileCacheOnWriteInternals:239->readStoreFile:315
expected:<...INTERMEDIATE_INDEX=3[4]}> but was:<...INTERMEDIATE_INDEX=3[2]}>
  Run 2: TestCacheOnWrite.testStoreFileCacheOnWrite:452->testStoreFileCacheOnWriteInternals:239->readStoreFile:315
expected:<...INTERMEDIATE_INDEX=3[4]}> but was:<...INTERMEDIATE_INDEX=3[2]}>
  Run 3: TestCacheOnWrite.testStoreFileCacheOnWrite:452->testStoreFileCacheOnWriteInternals:239->readStoreFile:315
expected:<...INTERMEDIATE_INDEX=3[4]}> but was:<...INTERMEDIATE_INDEX=3[2]}>

org.apache.hadoop.hbase.io.hfile.TestCacheOnWrite.testStoreFileCacheOnWrite[30](org.apache.hadoop.hbase.io.hfile.TestCacheOnWrite)
  Run 1: TestCacheOnWrite.testStoreFileCacheOnWrite:452->testStoreFileCacheOnWriteInternals:239->readStoreFile:315
expected:<...INTERMEDIATE_INDEX=3[4]}> but was:<...INTERMEDIATE_INDEX=3[2]}>
  Run 2: TestCacheOnWrite.testStoreFileCacheOnWrite:452->testStoreFileCacheOnWriteInternals:239->readStoreFile:315
expected:<...INTERMEDIATE_INDEX=3[4]}> but was:<...INTERMEDIATE_INDEX=3[2]}>
  Run 3: TestCacheOnWrite.testStoreFileCacheOnWrite:452->testStoreFileCacheOnWriteInternals:239->readStoreFile:315
expected:<...INTERMEDIATE_INDEX=3[4]}> but was:<...INTERMEDIATE_INDEX=3[2]}>

org.apache.hadoop.hbase.io.hfile.TestCacheOnWrite.testStoreFileCacheOnWrite[31](org.apache.hadoop.hbase.io.hfile.TestCacheOnWrite)
  Run 1: TestCacheOnWrite.testStoreFileCacheOnWrite:452->testStoreFileCacheOnWriteInternals:239->readStoreFile:315
expected:<...INTERMEDIATE_INDEX=3[4]}> but was:<...INTERMEDIATE_INDEX=3[2]}>
  Run 2: TestCacheOnWrite.testStoreFileCacheOnWrite:452->testStoreFileCacheOnWriteInternals:239->readStoreFile:315
expected:<...INTERMEDIATE_INDEX=3[4]}> but was:<...INTERMEDIATE_INDEX=3[2]}>
  Run 3: TestCacheOnWrite.testStoreFileCacheOnWrite:452->testStoreFileCacheOnWriteInternals:239->readStoreFile:315
expected:<...INTERMEDIATE_INDEX=3[4]}> but was:<...INTERMEDIATE_INDEX=3[2]}>

org.apache.hadoop.hbase.io.hfile.TestCacheOnWrite.testStoreFileCacheOnWrite[32](org.apache.hadoop.hbase.io.hfile.TestCacheOnWrite)
  Run 1: TestCacheOnWrite.testStoreFileCacheOnWrite:452->testStoreFileCacheOnWriteInternals:239->readStoreFile:315
expected:<...INTERMEDIATE_INDEX=3[4]}> but was:<...INTERMEDIATE_INDEX=3[2]}>
  Run 2: TestCacheOnWrite.testStoreFileCacheOnWrite:452->testStoreFileCacheOnWriteInternals:239->readStoreFile:315
expected:<...INTERMEDIATE_INDEX=3[4]}> but was:<...INTERMEDIATE_INDEX=3[2]}>
  Run 3: TestCacheOnWrite.testStoreFileCacheOnWrite:452->testStoreFileCacheOnWriteInternals:239->readStoreFile:315
expected:<...INTERMEDIATE_INDEX=3[4]}> but was:<...INTERMEDIATE_INDEX=3[2]}>

org.apache.hadoop.hbase.io.hfile.TestCacheOnWrite.testStoreFileCacheOnWrite[33](org.apache.hadoop.hbase.io.hfile.TestCacheOnWrite)
  Run 1: TestCacheOnWrite.testStoreFileCacheOnWrite:452->testStoreFileCacheOnWriteInternals:239->readStoreFile:315
expected:<...INTERMEDIATE_INDEX=3[4]}> but was:<...INTERMEDIATE_INDEX=3[2]}>
  Run 2: TestCacheOnWrite.testStoreFileCacheOnWrite:452->testStoreFileCacheOnWriteInternals:239->readStoreFile:315
expected:<...INTERMEDIATE_INDEX=3[4]}> but was:<...INTERMEDIATE_INDEX=3[2]}>
  Run 3: TestCacheOnWrite.testStoreFileCacheOnWrite:452->testStoreFileCacheOnWriteInternals:239->readStoreFile:315
expected:<...INTERMEDIATE_INDEX=3[4]}> but was:<...INTERMEDIATE_INDEX=3[2]}>

org.apache.hadoop.hbase.io.hfile.TestCacheOnWrite.testStoreFileCacheOnWrite[34](org.apache.hadoop.hbase.io.hfile.TestCacheOnWrite)
  Run 1: TestCacheOnWrite.testStoreFileCacheOnWrite:452->testStoreFileCacheOnWriteInternals:239->readStoreFile:315
expected:<...INTERMEDIATE_INDEX=3[4]}> but was:<...INTERMEDIATE_INDEX=3[2]}>
  Run 2: TestCacheOnWrite.testStoreFileCacheOnWrite:452->testStoreFileCacheOnWriteInternals:239->readStoreFile:315
expected:<...INTERMEDIATE_INDEX=3[4]}> but was:<...INTERMEDIATE_INDEX=3[2]}>
  Run 3: TestCacheOnWrite.testStoreFileCacheOnWrite:452->testStoreFileCacheOnWriteInternals:239->readStoreFile:315
expected:<...INTERMEDIATE_INDEX=3[4]}> but was:<...INTERMEDIATE_INDEX=3[2]}>

org.apache.hadoop.hbase.io.hfile.TestCacheOnWrite.testStoreFileCacheOnWrite[35](org.apache.hadoop.hbase.io.hfile.TestCacheOnWrite)
  Run 1: TestCacheOnWrite.testStoreFileCacheOnWrite:452->testStoreFileCacheOnWriteInternals:239->readStoreFile:315
expected:<...INTERMEDIATE_INDEX=3[4]}> but was:<...INTERMEDIATE_INDEX=3[2]}>
  Run 2: TestCacheOnWrite.testStoreFileCacheOnWrite:452->testStoreFileCacheOnWriteInternals:239->readStoreFile:315
expected:<...INTERMEDIATE_INDEX=3[4]}> but was:<...INTERMEDIATE_INDEX=3[2]}>
  Run 3: TestCacheOnWrite.testStoreFileCacheOnWrite:452->testStoreFileCacheOnWriteInternals:239->readStoreFile:315
expected:<...INTERMEDIATE_INDEX=3[4]}> but was:<...INTERMEDIATE_INDEX=3[2]}>

org.apache.hadoop.hbase.io.hfile.TestCacheOnWrite.testStoreFileCacheOnWrite[3](org.apache.hadoop.hbase.io.hfile.TestCacheOnWrite)
  Run 1: TestCacheOnWrite.testStoreFileCacheOnWrite:452->testStoreFileCacheOnWriteInternals:239->readStoreFile:315
expected:<...INTERMEDIATE_INDEX=3[4]}> but was:<...INTERMEDIATE_INDEX=3[2]}>
  Run 2: TestCacheOnWrite.testStoreFileCacheOnWrite:452->testStoreFileCacheOnWriteInternals:239->readStoreFile:315
expected:<...INTERMEDIATE_INDEX=3[4]}> but was:<...INTERMEDIATE_INDEX=3[2]}>
  Run 3: TestCacheOnWrite.testStoreFileCacheOnWrite:452->testStoreFileCacheOnWriteInternals:239->readStoreFile:315
expected:<...INTERMEDIATE_INDEX=3[4]}> but was:<...INTERMEDIATE_INDEX=3[2]}>

org.apache.hadoop.hbase.io.hfile.TestCacheOnWrite.testStoreFileCacheOnWrite[4](org.apache.hadoop.hbase.io.hfile.TestCacheOnWrite)
  Run 1: TestCacheOnWrite.testStoreFileCacheOnWrite:452->testStoreFileCacheOnWriteInternals:239->readStoreFile:315
expected:<...INTERMEDIATE_INDEX=3[4]}> but was:<...INTERMEDIATE_INDEX=3[2]}>
  Run 2: TestCacheOnWrite.testStoreFileCacheOnWrite:452->testStoreFileCacheOnWriteInternals:239->readStoreFile:315
expected:<...INTERMEDIATE_INDEX=3[4]}> but was:<...INTERMEDIATE_INDEX=3[2]}>
  Run 3: TestCacheOnWrite.testStoreFileCacheOnWrite:452->testStoreFileCacheOnWriteInternals:239->readStoreFile:315
expected:<...INTERMEDIATE_INDEX=3[4]}> but was:<...INTERMEDIATE_INDEX=3[2]}>

org.apache.hadoop.hbase.io.hfile.TestCacheOnWrite.testStoreFileCacheOnWrite[5](org.apache.hadoop.hbase.io.hfile.TestCacheOnWrite)
  Run 1: TestCacheOnWrite.testStoreFileCacheOnWrite:452->testStoreFileCacheOnWriteInternals:239->readStoreFile:315
expected:<...INTERMEDIATE_INDEX=3[4]}> but was:<...INTERMEDIATE_INDEX=3[2]}>
  Run 2: TestCacheOnWrite.testStoreFileCacheOnWrite:452->testStoreFileCacheOnWriteInternals:239->readStoreFile:315
expected:<...INTERMEDIATE_INDEX=3[4]}> but was:<...INTERMEDIATE_INDEX=3[2]}>
  Run 3: TestCacheOnWrite.testStoreFileCacheOnWrite:452->testStoreFileCacheOnWriteInternals:239->readStoreFile:315
expected:<...INTERMEDIATE_INDEX=3[4]}> but was:<...INTERMEDIATE_INDEX=3[2]}>

org.apache.hadoop.hbase.io.hfile.TestCacheOnWrite.testStoreFileCacheOnWrite[6](org.apache.hadoop.hbase.io.hfile.TestCacheOnWrite)
  Run 1: TestCacheOnWrite.testStoreFileCacheOnWrite:452->testStoreFileCacheOnWriteInternals:239->readStoreFile:315
expected:<...INTERMEDIATE_INDEX=3[4]}> but was:<...INTERMEDIATE_INDEX=3[2]}>
  Run 2: TestCacheOnWrite.testStoreFileCacheOnWrite:452->testStoreFileCacheOnWriteInternals:239->readStoreFile:315
expected:<...INTERMEDIATE_INDEX=3[4]}> but was:<...INTERMEDIATE_INDEX=3[2]}>
  Run 3: TestCacheOnWrite.testStoreFileCacheOnWrite:452->testStoreFileCacheOnWriteInternals:239->readStoreFile:315
expected:<...INTERMEDIATE_INDEX=3[4]}> but was:<...INTERMEDIATE_INDEX=3[2]}>

org.apache.hadoop.hbase.io.hfile.TestCacheOnWrite.testStoreFileCacheOnWrite[7](org.apache.hadoop.hbase.io.hfile.TestCacheOnWrite)
  Run 1: TestCacheOnWrite.testStoreFileCacheOnWrite:452->testStoreFileCacheOnWriteInternals:239->readStoreFile:315
expected:<...INTERMEDIATE_INDEX=3[4]}> but was:<...INTERMEDIATE_INDEX=3[2]}>
  Run 2: TestCacheOnWrite.testStoreFileCacheOnWrite:452->testStoreFileCacheOnWriteInternals:239->readStoreFile:315
expected:<...INTERMEDIATE_INDEX=3[4]}> but was:<...INTERMEDIATE_INDEX=3[2]}>
  Run 3: TestCacheOnWrite.testStoreFileCacheOnWrite:452->testStoreFileCacheOnWriteInternals:239->readStoreFile:315
expected:<...INTERMEDIATE_INDEX=3[4]}> but was:<...INTERMEDIATE_INDEX=3[2]}>

org.apache.hadoop.hbase.io.hfile.TestCacheOnWrite.testStoreFileCacheOnWrite[8](org.apache.hadoop.hbase.io.hfile.TestCacheOnWrite)
  Run 1: TestCacheOnWrite.testStoreFileCacheOnWrite:452->testStoreFileCacheOnWriteInternals:239->readStoreFile:315
expected:<...INTERMEDIATE_INDEX=3[4]}> but was:<...INTERMEDIATE_INDEX=3[2]}>
  Run 2: TestCacheOnWrite.testStoreFileCacheOnWrite:452->testStoreFileCacheOnWriteInternals:239->readStoreFile:315
expected:<...INTERMEDIATE_INDEX=3[4]}> but was:<...INTERMEDIATE_INDEX=3[2]}>
  Run 3: TestCacheOnWrite.testStoreFileCacheOnWrite:452->testStoreFileCacheOnWriteInternals:239->readStoreFile:315
expected:<...INTERMEDIATE_INDEX=3[4]}> but was:<...INTERMEDIATE_INDEX=3[2]}>

org.apache.hadoop.hbase.io.hfile.TestCacheOnWrite.testStoreFileCacheOnWrite[9](org.apache.hadoop.hbase.io.hfile.TestCacheOnWrite)
  Run 1: TestCacheOnWrite.testStoreFileCacheOnWrite:452->testStoreFileCacheOnWriteInternals:239->readStoreFile:315
expected:<...INTERMEDIATE_INDEX=3[4]}> but was:<...INTERMEDIATE_INDEX=3[2]}>
  Run 2: TestCacheOnWrite.testStoreFileCacheOnWrite:452->testStoreFileCacheOnWriteInternals:239->readStoreFile:315
expected:<...INTERMEDIATE_INDEX=3[4]}> but was:<...INTERMEDIATE_INDEX=3[2]}>
  Run 3: TestCacheOnWrite.testStoreFileCacheOnWrite:452->testStoreFileCacheOnWriteInternals:239->readStoreFile:315
expected:<...INTERMEDIATE_INDEX=3[4]}> but was:<...INTERMEDIATE_INDEX=3[2]}>

Tests in error: 
org.apache.hadoop.hbase.TestPartialResultsFromClientSide.testBatchingResultWhenRegionMove(org.apache.hadoop.hbase.TestPartialResultsFromClientSide)
  Run 1: TestPartialResultsFromClientSide.testBatchingResultWhenRegionMove:1021 » RetriesExhausted
  Run 2: TestPartialResultsFromClientSide.testBatchingResultWhenRegionMove:1039 » RetriesExhausted
  Run 3: TestPartialResultsFromClientSide.testBatchingResultWhenRegionMove:1023 » RetriesExhausted

org.apache.hadoop.hbase.TestPartialResultsFromClientSide.testCompleteResultWhenRegionMove(org.apache.hadoop.hbase.TestPartialResultsFromClientSide)
  Run 1: TestPartialResultsFromClientSide.testCompleteResultWhenRegionMove:948 » RetriesExhausted
  Run 2: TestPartialResultsFromClientSide.testCompleteResultWhenRegionMove:946 » RetriesExhausted
  Run 3: TestPartialResultsFromClientSide.testCompleteResultWhenRegionMove:956 » RetriesExhausted

org.apache.hadoop.hbase.TestPartialResultsFromClientSide.testPartialResultWhenRegionMove(org.apache.hadoop.hbase.TestPartialResultsFromClientSide)
  Run 1: TestPartialResultsFromClientSide.testPartialResultWhenRegionMove:871 » RetriesExhausted
  Run 2: TestPartialResultsFromClientSide.testPartialResultWhenRegionMove:869 » RetriesExhausted
  Run 3: TestPartialResultsFromClientSide.testPartialResultWhenRegionMove:871 » RetriesExhausted

org.apache.hadoop.hbase.TestPartialResultsFromClientSide.testReversedCompleteResultWhenRegionMove(org.apache.hadoop.hbase.TestPartialResultsFromClientSide)
  Run 1: TestPartialResultsFromClientSide.testReversedCompleteResultWhenRegionMove:983 »
RetriesExhausted
  Run 2: TestPartialResultsFromClientSide.testReversedCompleteResultWhenRegionMove:983 »
RetriesExhausted
  Run 3: TestPartialResultsFromClientSide.testReversedCompleteResultWhenRegionMove:983 »
RetriesExhausted

org.apache.hadoop.hbase.TestPartialResultsFromClientSide.testReversedPartialResultWhenRegionMove(org.apache.hadoop.hbase.TestPartialResultsFromClientSide)
  Run 1: TestPartialResultsFromClientSide.testReversedPartialResultWhenRegionMove:910 » RetriesExhausted
  Run 2: TestPartialResultsFromClientSide.testReversedPartialResultWhenRegionMove:908 » RetriesExhausted
  Run 3: TestPartialResultsFromClientSide.testReversedPartialResultWhenRegionMove:908 » RetriesExhausted

org.apache.hadoop.hbase.util.TestHBaseFsck.testQuarantineMissingHFile(org.apache.hadoop.hbase.util.TestHBaseFsck)
  Run 1: TestHBaseFsck.testQuarantineMissingHFile:2237->doQuarantineTest:2208->cleanupTable:488->deleteTable:2882
» TableNotDisabled
  Run 2: TestHBaseFsck.testQuarantineMissingHFile:2237->doQuarantineTest:2208->cleanupTable:488->deleteTable:2882
» TableNotDisabled
  Run 3: TestHBaseFsck.testQuarantineMissingHFile:2237->doQuarantineTest:2208->cleanupTable:488->deleteTable:2882
» TableNotDisabled

Flaked tests: 
org.apache.hadoop.hbase.client.TestSnapshotCloneIndependence.testOnlineSnapshotDeleteIndependent(org.apache.hadoop.hbase.client.TestSnapshotCloneIndependence)
  Run 1: TestSnapshotCloneIndependence.testOnlineSnapshotDeleteIndependent:182->runTestSnapshotDeleteIndependent:425
expected:<17576> but was:<14046>
  Run 2: PASS


Tests run: 2521, Failures: 36, Errors: 6, Skipped: 20, Flakes: 1

[INFO] ------------------------------------------------------------------------
[INFO] Reactor Summary:
[INFO] 
[INFO] Apache HBase ....................................... SUCCESS [  4.340 s]
[INFO] Apache HBase - Checkstyle .......................... SUCCESS [  1.028 s]
[INFO] Apache HBase - Resource Bundle ..................... SUCCESS [  0.382 s]
[INFO] Apache HBase - Annotations ......................... SUCCESS [  1.523 s]
[INFO] Apache HBase - Protocol ............................ SUCCESS [ 19.107 s]
[INFO] Apache HBase - Common .............................. SUCCESS [01:50 min]
[INFO] Apache HBase - Procedure ........................... SUCCESS [03:20 min]
[INFO] Apache HBase - Client .............................. SUCCESS [01:39 min]
[INFO] Apache HBase - Hadoop Compatibility ................ SUCCESS [  9.172 s]
[INFO] Apache HBase - Hadoop Two Compatibility ............ SUCCESS [ 11.209 s]
[INFO] Apache HBase - Prefix Tree ......................... SUCCESS [ 15.096 s]
[INFO] Apache HBase - Server .............................. FAILURE [  02:36 h]
[INFO] Apache HBase - Testing Util ........................ SKIPPED
[INFO] Apache HBase - Thrift .............................. SKIPPED
[INFO] Apache HBase - Rest ................................ SKIPPED
[INFO] Apache HBase - Shell ............................... SKIPPED
[INFO] Apache HBase - Integration Tests ................... SKIPPED
[INFO] Apache HBase - Examples ............................ SKIPPED
[INFO] Apache HBase - Assembly ............................ SKIPPED
[INFO] Apache HBase - Shaded .............................. SKIPPED
[INFO] Apache HBase - Shaded - Client ..................... SKIPPED
[INFO] Apache HBase - Shaded - Server ..................... SKIPPED
[INFO] ------------------------------------------------------------------------
[INFO] BUILD FAILURE
[INFO] ------------------------------------------------------------------------
[INFO] Total time: 02:44 h
[INFO] Finished at: 2016-08-02T08:45:25+00:00
[INFO] Final Memory: 60M/643M
[INFO] ------------------------------------------------------------------------
[ERROR] Failed to execute goal org.apache.maven.plugins:maven-surefire-plugin:2.18.1:test
(secondPartTestsExecution) on project hbase-server: There are test failures.
[ERROR] 
[ERROR] Please refer to <https://builds.apache.org/job/HBase-1.1-JDK7/ws/hbase-server/target/surefire-reports>
for the individual test results.
[ERROR] -> [Help 1]
[ERROR] 
[ERROR] To see the full stack trace of the errors, re-run Maven with the -e switch.
[ERROR] Re-run Maven using the -X switch to enable full debug logging.
[ERROR] 
[ERROR] For more information about the errors and possible solutions, please read the following
articles:
[ERROR] [Help 1] http://cwiki.apache.org/confluence/display/MAVEN/MojoFailureException
[ERROR] 
[ERROR] After correcting the problems, you can resume the build with the command
[ERROR]   mvn <goals> -rf :hbase-server
Build step 'Invoke top-level Maven targets' marked build as failure
Performing Post build task...
Match found for :.* : True
Logical operation result is TRUE
Running script  : # Post-build task script. TODO: Check this in and have all builds reference
check-in.
pwd && ls
# NOTE!!!! The below code has been copied and pasted from ./dev-tools/run-test.sh
# Do not change here without syncing there and vice-versa.
ZOMBIE_TESTS_COUNT=`jps -v | grep surefirebooter | grep -e '-Dhbase.test' | wc -l`
if [[ $ZOMBIE_TESTS_COUNT != 0 ]] ; then
 echo "Suspicious java process found - waiting 30s to see if there are just slow to stop"
 sleep 30
 ZOMBIE_TESTS_COUNT=`jps -v | grep surefirebooter | grep -e '-Dhbase.test' | wc -l`
 if [[ $ZOMBIE_TESTS_COUNT != 0 ]] ; then
   echo " {color:red}There appear to be $ZOMBIE_TESTS_COUNT zombie tests{color}, they should
have been killed by surefire but survived"
   jps -v | grep surefirebooter | grep -e '-Dhbase.test'
   jps -v | grep surefirebooter | grep -e '-Dhbase.test' | cut -d ' ' -f 1 | xargs -n 1 jstack
   # Exit with error
   exit 1
 else
   echo "We're ok: there is no zombie test, but some tests took some time to stop"
 fi
else
  echo "We're ok: there is no zombie test"
fi
[HBase-1.1-JDK7] $ /bin/bash -xe /tmp/hudson3240377994811380176.sh
+ pwd
<https://builds.apache.org/job/HBase-1.1-JDK7/ws/>
+ ls
bin
CHANGES.txt
conf
dev-support
hbase-annotations
hbase-assembly
hbase-checkstyle
hbase-client
hbase-common
hbase-examples
hbase-hadoop2-compat
hbase-hadoop-compat
hbase-it
hbase-native-client
hbase-prefix-tree
hbase-procedure
hbase-protocol
hbase-resource-bundle
hbase-rest
hbase-server
hbase-shaded
hbase-shell
hbase-testing-util
hbase-thrift
LICENSE.txt
NOTICE.txt
pom.xml
README.txt
src
target
++ jps -v
++ grep surefirebooter
++ grep -e -Dhbase.test
++ wc -l
+ ZOMBIE_TESTS_COUNT=0
+ [[ 0 != 0 ]]
+ echo 'We'\''re ok: there is no zombie test'
We're ok: there is no zombie test
POST BUILD TASK : SUCCESS
END OF POST BUILD TASK : 0
Archiving artifacts
Recording test results
Updating HBASE-16296

Mime
View raw message