hbase-builds mailing list archives

Site index · List index
Message view « Date » · « Thread »
Top « Date » · « Thread »
From Apache Jenkins Server <jenk...@builds.apache.org>
Subject Build failed in Jenkins: HBase-Trunk_matrix » JDK 1.8 (latest),yahoo-not-h2 #1413
Date Sun, 14 Aug 2016 13:47:04 GMT
See <https://builds.apache.org/job/HBase-Trunk_matrix/jdk=JDK%201.8%20(latest),label=yahoo-not-h2/1413/>

------------------------------------------
[...truncated 4801 lines...]
-------------------------------------------------------
 T E S T S
-------------------------------------------------------
Java HotSpot(TM) 64-Bit Server VM warning: ignoring option MaxPermSize=256m; support was removed
in 8.0
Running org.apache.hadoop.hbase.ipc.TestIPCUtil
Tests run: 1, Failures: 0, Errors: 0, Skipped: 0, Time elapsed: 0.417 sec - in org.apache.hadoop.hbase.ipc.TestIPCUtil
Java HotSpot(TM) 64-Bit Server VM warning: ignoring option MaxPermSize=256m; support was removed
in 8.0
Running org.apache.hadoop.hbase.ipc.TestPayloadCarryingRpcController
Tests run: 1, Failures: 0, Errors: 0, Skipped: 0, Time elapsed: 0.169 sec - in org.apache.hadoop.hbase.ipc.TestPayloadCarryingRpcController
Java HotSpot(TM) 64-Bit Server VM warning: ignoring option MaxPermSize=256m; support was removed
in 8.0
Running org.apache.hadoop.hbase.filter.TestComparators
Tests run: 1, Failures: 0, Errors: 0, Skipped: 0, Time elapsed: 0.158 sec - in org.apache.hadoop.hbase.filter.TestComparators
Java HotSpot(TM) 64-Bit Server VM warning: ignoring option MaxPermSize=256m; support was removed
in 8.0
Running org.apache.hadoop.hbase.filter.TestLongComparator
Tests run: 1, Failures: 0, Errors: 0, Skipped: 0, Time elapsed: 0.124 sec - in org.apache.hadoop.hbase.filter.TestLongComparator
Java HotSpot(TM) 64-Bit Server VM warning: ignoring option MaxPermSize=256m; support was removed
in 8.0
Running org.apache.hadoop.hbase.replication.TestReplicationPeerConfig
Tests run: 1, Failures: 0, Errors: 0, Skipped: 0, Time elapsed: 0.004 sec - in org.apache.hadoop.hbase.replication.TestReplicationPeerConfig
Java HotSpot(TM) 64-Bit Server VM warning: ignoring option MaxPermSize=256m; support was removed
in 8.0
Java HotSpot(TM) 64-Bit Server VM warning: ignoring option MaxPermSize=256m; support was removed
in 8.0
Running org.apache.hadoop.hbase.zookeeper.TestZooKeeperWatcher
Tests run: 1, Failures: 0, Errors: 0, Skipped: 0, Time elapsed: 0.649 sec - in org.apache.hadoop.hbase.zookeeper.TestZooKeeperWatcher
Java HotSpot(TM) 64-Bit Server VM warning: ignoring option MaxPermSize=256m; support was removed
in 8.0
Running org.apache.hadoop.hbase.zookeeper.TestInstancePending
Tests run: 1, Failures: 0, Errors: 0, Skipped: 0, Time elapsed: 0.208 sec - in org.apache.hadoop.hbase.zookeeper.TestInstancePending
Java HotSpot(TM) 64-Bit Server VM warning: ignoring option MaxPermSize=256m; support was removed
in 8.0
Running org.apache.hadoop.hbase.zookeeper.TestZKUtil
Tests run: 1, Failures: 0, Errors: 0, Skipped: 0, Time elapsed: 0.456 sec - in org.apache.hadoop.hbase.zookeeper.TestZKUtil
Java HotSpot(TM) 64-Bit Server VM warning: ignoring option MaxPermSize=256m; support was removed
in 8.0
Running org.apache.hadoop.hbase.security.TestEncryptionUtil
Tests run: 3, Failures: 0, Errors: 0, Skipped: 0, Time elapsed: 1.051 sec - in org.apache.hadoop.hbase.security.TestEncryptionUtil
Java HotSpot(TM) 64-Bit Server VM warning: ignoring option MaxPermSize=256m; support was removed
in 8.0
Running org.apache.hadoop.hbase.security.TestHBaseSaslRpcClient
Tests run: 5, Failures: 0, Errors: 0, Skipped: 0, Time elapsed: 0.528 sec - in org.apache.hadoop.hbase.security.TestHBaseSaslRpcClient
Java HotSpot(TM) 64-Bit Server VM warning: ignoring option MaxPermSize=256m; support was removed
in 8.0
Running org.apache.hadoop.hbase.security.TestSaslUtil
Tests run: 1, Failures: 0, Errors: 0, Skipped: 0, Time elapsed: 0.153 sec - in org.apache.hadoop.hbase.security.TestSaslUtil
Java HotSpot(TM) 64-Bit Server VM warning: ignoring option MaxPermSize=256m; support was removed
in 8.0
Running org.apache.hadoop.hbase.client.TestPutDotHas
Tests run: 4, Failures: 0, Errors: 0, Skipped: 0, Time elapsed: 0.028 sec - in org.apache.hadoop.hbase.client.TestPutDotHas
Java HotSpot(TM) 64-Bit Server VM warning: ignoring option MaxPermSize=256m; support was removed
in 8.0
Running org.apache.hadoop.hbase.client.TestClientSmallReversedScanner
Tests run: 4, Failures: 0, Errors: 0, Skipped: 0, Time elapsed: 0.722 sec - in org.apache.hadoop.hbase.client.TestClientSmallReversedScanner
Java HotSpot(TM) 64-Bit Server VM warning: ignoring option MaxPermSize=256m; support was removed
in 8.0
Running org.apache.hadoop.hbase.client.TestClientScanner
Tests run: 6, Failures: 0, Errors: 0, Skipped: 0, Time elapsed: 0.795 sec - in org.apache.hadoop.hbase.client.TestClientScanner
Java HotSpot(TM) 64-Bit Server VM warning: ignoring option MaxPermSize=256m; support was removed
in 8.0
Running org.apache.hadoop.hbase.client.TestClientNoCluster
Tests run: 5, Failures: 0, Errors: 0, Skipped: 1, Time elapsed: 1.593 sec - in org.apache.hadoop.hbase.client.TestClientNoCluster
Java HotSpot(TM) 64-Bit Server VM warning: ignoring option MaxPermSize=256m; support was removed
in 8.0
Running org.apache.hadoop.hbase.client.TestScan
Tests run: 4, Failures: 0, Errors: 0, Skipped: 0, Time elapsed: 0.75 sec - in org.apache.hadoop.hbase.client.TestScan
Java HotSpot(TM) 64-Bit Server VM warning: ignoring option MaxPermSize=256m; support was removed
in 8.0
Running org.apache.hadoop.hbase.client.TestMetricsConnection
Tests run: 1, Failures: 0, Errors: 0, Skipped: 0, Time elapsed: 0.662 sec - in org.apache.hadoop.hbase.client.TestMetricsConnection
Java HotSpot(TM) 64-Bit Server VM warning: ignoring option MaxPermSize=256m; support was removed
in 8.0
Running org.apache.hadoop.hbase.client.TestClientSmallScanner
Tests run: 4, Failures: 0, Errors: 0, Skipped: 0, Time elapsed: 0.773 sec - in org.apache.hadoop.hbase.client.TestClientSmallScanner
Java HotSpot(TM) 64-Bit Server VM warning: ignoring option MaxPermSize=256m; support was removed
in 8.0
Running org.apache.hadoop.hbase.client.TestClientExponentialBackoff
Tests run: 5, Failures: 0, Errors: 0, Skipped: 0, Time elapsed: 0.684 sec - in org.apache.hadoop.hbase.client.TestClientExponentialBackoff
Java HotSpot(TM) 64-Bit Server VM warning: ignoring option MaxPermSize=256m; support was removed
in 8.0
Running org.apache.hadoop.hbase.client.TestUnmodifyableHTableDescriptor
Tests run: 1, Failures: 0, Errors: 0, Skipped: 0, Time elapsed: 0.01 sec - in org.apache.hadoop.hbase.client.TestUnmodifyableHTableDescriptor
Java HotSpot(TM) 64-Bit Server VM warning: ignoring option MaxPermSize=256m; support was removed
in 8.0
Running org.apache.hadoop.hbase.client.TestDelayingRunner
Tests run: 1, Failures: 0, Errors: 0, Skipped: 0, Time elapsed: 1.025 sec - in org.apache.hadoop.hbase.client.TestDelayingRunner
Java HotSpot(TM) 64-Bit Server VM warning: ignoring option MaxPermSize=256m; support was removed
in 8.0
Java HotSpot(TM) 64-Bit Server VM warning: ignoring option MaxPermSize=256m; support was removed
in 8.0
Running org.apache.hadoop.hbase.client.TestGet
Tests run: 5, Failures: 0, Errors: 0, Skipped: 0, Time elapsed: 0.916 sec - in org.apache.hadoop.hbase.client.TestGet
Java HotSpot(TM) 64-Bit Server VM warning: ignoring option MaxPermSize=256m; support was removed
in 8.0
Running org.apache.hadoop.hbase.client.TestDeleteTimeStamp
Tests run: 1, Failures: 0, Errors: 0, Skipped: 0, Time elapsed: 0.036 sec - in org.apache.hadoop.hbase.client.TestDeleteTimeStamp
Java HotSpot(TM) 64-Bit Server VM warning: ignoring option MaxPermSize=256m; support was removed
in 8.0
Running org.apache.hadoop.hbase.client.TestAttributes
Tests run: 7, Failures: 0, Errors: 0, Skipped: 0, Time elapsed: 0.196 sec - in org.apache.hadoop.hbase.client.TestAttributes
Java HotSpot(TM) 64-Bit Server VM warning: ignoring option MaxPermSize=256m; support was removed
in 8.0
Running org.apache.hadoop.hbase.client.TestOperation
Tests run: 3, Failures: 0, Errors: 0, Skipped: 0, Time elapsed: 0.184 sec - in org.apache.hadoop.hbase.client.TestOperation
Java HotSpot(TM) 64-Bit Server VM warning: ignoring option MaxPermSize=256m; support was removed
in 8.0
Running org.apache.hadoop.hbase.client.TestProcedureFuture
Tests run: 4, Failures: 0, Errors: 0, Skipped: 0, Time elapsed: 0.532 sec - in org.apache.hadoop.hbase.client.TestProcedureFuture
Java HotSpot(TM) 64-Bit Server VM warning: ignoring option MaxPermSize=256m; support was removed
in 8.0
Running org.apache.hadoop.hbase.client.TestHTableMultiplexerViaMocks
Tests run: 2, Failures: 0, Errors: 0, Skipped: 0, Time elapsed: 0.352 sec - in org.apache.hadoop.hbase.client.TestHTableMultiplexerViaMocks
Java HotSpot(TM) 64-Bit Server VM warning: ignoring option MaxPermSize=256m; support was removed
in 8.0
Running org.apache.hadoop.hbase.client.TestIncrement
Tests run: 1, Failures: 0, Errors: 0, Skipped: 0, Time elapsed: 0.193 sec - in org.apache.hadoop.hbase.client.TestIncrement
Java HotSpot(TM) 64-Bit Server VM warning: ignoring option MaxPermSize=256m; support was removed
in 8.0
Java HotSpot(TM) 64-Bit Server VM warning: ignoring option MaxPermSize=256m; support was removed
in 8.0
Running org.apache.hadoop.hbase.client.TestSnapshotFromAdmin
Tests run: 2, Failures: 0, Errors: 0, Skipped: 0, Time elapsed: 4.893 sec - in org.apache.hadoop.hbase.client.TestSnapshotFromAdmin
Java HotSpot(TM) 64-Bit Server VM warning: ignoring option MaxPermSize=256m; support was removed
in 8.0
Running org.apache.hadoop.hbase.TestInterfaceAudienceAnnotations
Tests run: 5, Failures: 0, Errors: 5, Skipped: 0, Time elapsed: 0.055 sec <<< FAILURE!
- in org.apache.hadoop.hbase.TestInterfaceAudienceAnnotations
testProtosInParamTypes(org.apache.hadoop.hbase.TestInterfaceAudienceAnnotations)  Time elapsed:
0.027 sec  <<< ERROR!
java.io.FileNotFoundException: /home/jenkins/jenkins-slave/workspace/HBase-Trunk_matrix/jdk/JDK%201.8%20(latest)/label/yahoo-not-h2/hbase-annotations/target/hbase-annotations-2.0.0-SNAPSHOT.jar
(No such file or directory)
	at java.io.FileInputStream.open0(Native Method)
	at java.io.FileInputStream.open(FileInputStream.java:195)
	at java.io.FileInputStream.<init>(FileInputStream.java:138)
	at java.io.FileInputStream.<init>(FileInputStream.java:93)
	at org.apache.hadoop.hbase.ClassFinder.findClassesFromJar(ClassFinder.java:186)
	at org.apache.hadoop.hbase.ClassFinder.findClasses(ClassFinder.java:176)
	at org.apache.hadoop.hbase.ClassFinder.findClasses(ClassFinder.java:136)
	at org.apache.hadoop.hbase.TestInterfaceAudienceAnnotations.findPublicClasses(TestInterfaceAudienceAnnotations.java:359)
	at org.apache.hadoop.hbase.TestInterfaceAudienceAnnotations.testProtosInParamTypes(TestInterfaceAudienceAnnotations.java:365)

testInterfaceStabilityAnnotation(org.apache.hadoop.hbase.TestInterfaceAudienceAnnotations)
 Time elapsed: 0.005 sec  <<< ERROR!
java.io.FileNotFoundException: /home/jenkins/jenkins-slave/workspace/HBase-Trunk_matrix/jdk/JDK%201.8%20(latest)/label/yahoo-not-h2/hbase-annotations/target/hbase-annotations-2.0.0-SNAPSHOT.jar
(No such file or directory)
	at java.io.FileInputStream.open0(Native Method)
	at java.io.FileInputStream.open(FileInputStream.java:195)
	at java.io.FileInputStream.<init>(FileInputStream.java:138)
	at java.io.FileInputStream.<init>(FileInputStream.java:93)
	at org.apache.hadoop.hbase.ClassFinder.findClassesFromJar(ClassFinder.java:186)
	at org.apache.hadoop.hbase.ClassFinder.findClasses(ClassFinder.java:176)
	at org.apache.hadoop.hbase.ClassFinder.findClasses(ClassFinder.java:136)
	at org.apache.hadoop.hbase.TestInterfaceAudienceAnnotations.testInterfaceStabilityAnnotation(TestInterfaceAudienceAnnotations.java:320)

testProtosInConstructors(org.apache.hadoop.hbase.TestInterfaceAudienceAnnotations)  Time elapsed:
0.006 sec  <<< ERROR!
java.io.FileNotFoundException: /home/jenkins/jenkins-slave/workspace/HBase-Trunk_matrix/jdk/JDK%201.8%20(latest)/label/yahoo-not-h2/hbase-annotations/target/hbase-annotations-2.0.0-SNAPSHOT.jar
(No such file or directory)
	at java.io.FileInputStream.open0(Native Method)
	at java.io.FileInputStream.open(FileInputStream.java:195)
	at java.io.FileInputStream.<init>(FileInputStream.java:138)
	at java.io.FileInputStream.<init>(FileInputStream.java:93)
	at org.apache.hadoop.hbase.ClassFinder.findClassesFromJar(ClassFinder.java:186)
	at org.apache.hadoop.hbase.ClassFinder.findClasses(ClassFinder.java:176)
	at org.apache.hadoop.hbase.ClassFinder.findClasses(ClassFinder.java:136)
	at org.apache.hadoop.hbase.TestInterfaceAudienceAnnotations.findPublicClasses(TestInterfaceAudienceAnnotations.java:359)
	at org.apache.hadoop.hbase.TestInterfaceAudienceAnnotations.testProtosInConstructors(TestInterfaceAudienceAnnotations.java:386)

testProtosInReturnTypes(org.apache.hadoop.hbase.TestInterfaceAudienceAnnotations)  Time elapsed:
0.003 sec  <<< ERROR!
java.io.FileNotFoundException: /home/jenkins/jenkins-slave/workspace/HBase-Trunk_matrix/jdk/JDK%201.8%20(latest)/label/yahoo-not-h2/hbase-annotations/target/hbase-annotations-2.0.0-SNAPSHOT.jar
(No such file or directory)
	at java.io.FileInputStream.open0(Native Method)
	at java.io.FileInputStream.open(FileInputStream.java:195)
	at java.io.FileInputStream.<init>(FileInputStream.java:138)
	at java.io.FileInputStream.<init>(FileInputStream.java:93)
	at org.apache.hadoop.hbase.ClassFinder.findClassesFromJar(ClassFinder.java:186)
	at org.apache.hadoop.hbase.ClassFinder.findClasses(ClassFinder.java:176)
	at org.apache.hadoop.hbase.ClassFinder.findClasses(ClassFinder.java:136)
	at org.apache.hadoop.hbase.TestInterfaceAudienceAnnotations.findPublicClasses(TestInterfaceAudienceAnnotations.java:359)
	at org.apache.hadoop.hbase.TestInterfaceAudienceAnnotations.testProtosInReturnTypes(TestInterfaceAudienceAnnotations.java:334)

testInterfaceAudienceAnnotation(org.apache.hadoop.hbase.TestInterfaceAudienceAnnotations)
 Time elapsed: 0.003 sec  <<< ERROR!
java.io.FileNotFoundException: /home/jenkins/jenkins-slave/workspace/HBase-Trunk_matrix/jdk/JDK%201.8%20(latest)/label/yahoo-not-h2/hbase-annotations/target/hbase-annotations-2.0.0-SNAPSHOT.jar
(No such file or directory)
	at java.io.FileInputStream.open0(Native Method)
	at java.io.FileInputStream.open(FileInputStream.java:195)
	at java.io.FileInputStream.<init>(FileInputStream.java:138)
	at java.io.FileInputStream.<init>(FileInputStream.java:93)
	at org.apache.hadoop.hbase.ClassFinder.findClassesFromJar(ClassFinder.java:186)
	at org.apache.hadoop.hbase.ClassFinder.findClasses(ClassFinder.java:176)
	at org.apache.hadoop.hbase.ClassFinder.findClasses(ClassFinder.java:136)
	at org.apache.hadoop.hbase.TestInterfaceAudienceAnnotations.testInterfaceAudienceAnnotation(TestInterfaceAudienceAnnotations.java:281)

Java HotSpot(TM) 64-Bit Server VM warning: ignoring option MaxPermSize=256m; support was removed
in 8.0
Running org.apache.hadoop.hbase.quotas.TestQuotaFilter
Tests run: 1, Failures: 0, Errors: 0, Skipped: 0, Time elapsed: 0.004 sec - in org.apache.hadoop.hbase.quotas.TestQuotaFilter
Java HotSpot(TM) 64-Bit Server VM warning: ignoring option MaxPermSize=256m; support was removed
in 8.0
Running org.apache.hadoop.hbase.TestHColumnDescriptor
Tests run: 6, Failures: 0, Errors: 0, Skipped: 0, Time elapsed: 0.978 sec - in org.apache.hadoop.hbase.TestHColumnDescriptor
Java HotSpot(TM) 64-Bit Server VM warning: ignoring option MaxPermSize=256m; support was removed
in 8.0
Running org.apache.hadoop.hbase.TestRegionLocations
Tests run: 8, Failures: 0, Errors: 0, Skipped: 0, Time elapsed: 0.009 sec - in org.apache.hadoop.hbase.TestRegionLocations
Java HotSpot(TM) 64-Bit Server VM warning: ignoring option MaxPermSize=256m; support was removed
in 8.0
Running org.apache.hadoop.hbase.TestHTableDescriptor
Tests run: 18, Failures: 0, Errors: 0, Skipped: 0, Time elapsed: 0.831 sec - in org.apache.hadoop.hbase.TestHTableDescriptor

Results :

Tests in error: 
  TestInterfaceAudienceAnnotations.testInterfaceAudienceAnnotation:281 » FileNotFound
  TestInterfaceAudienceAnnotations.testInterfaceStabilityAnnotation:320 » FileNotFound
  TestInterfaceAudienceAnnotations.testProtosInConstructors:386->findPublicClasses:359
» FileNotFound
  TestInterfaceAudienceAnnotations.testProtosInParamTypes:365->findPublicClasses:359 »
FileNotFound
  TestInterfaceAudienceAnnotations.testProtosInReturnTypes:334->findPublicClasses:359 »
FileNotFound

Tests run: 115, Failures: 0, Errors: 5, Skipped: 1

[INFO] ------------------------------------------------------------------------
[INFO] Reactor Summary:
[INFO] 
[INFO] Apache HBase ...................................... SUCCESS [2.821s]
[INFO] Apache HBase - Checkstyle ......................... SUCCESS [1.004s]
[INFO] Apache HBase - Resource Bundle .................... SUCCESS [0.212s]
[INFO] Apache HBase - Annotations ........................ SUCCESS [0.258s]
[INFO] Apache HBase - Protocol ........................... SUCCESS [3.382s]
[INFO] Apache HBase - Common ............................. SUCCESS [1:26.217s]
[INFO] Apache HBase - Procedure .......................... SUCCESS [1:23.713s]
[INFO] Apache HBase - Client ............................. FAILURE [42.914s]
[INFO] Apache HBase - Hadoop Compatibility ............... SKIPPED
[INFO] Apache HBase - Hadoop Two Compatibility ........... SKIPPED
[INFO] Apache HBase - Prefix Tree ........................ SKIPPED
[INFO] Apache HBase - Server ............................. SKIPPED
[INFO] Apache HBase - Testing Util ....................... SKIPPED
[INFO] Apache HBase - Thrift ............................. SKIPPED
[INFO] Apache HBase - RSGroup ............................ SKIPPED
[INFO] Apache HBase - Shell .............................. SKIPPED
[INFO] Apache HBase - Integration Tests .................. SKIPPED
[INFO] Apache HBase - Examples ........................... SKIPPED
[INFO] Apache HBase - Rest ............................... SKIPPED
[INFO] Apache HBase - External Block Cache ............... SKIPPED
[INFO] Apache HBase - Spark .............................. SKIPPED
[INFO] Apache HBase - Assembly ........................... SKIPPED
[INFO] Apache HBase - Shaded ............................. SKIPPED
[INFO] Apache HBase - Shaded - Client .................... SKIPPED
[INFO] Apache HBase - Shaded - Server .................... SKIPPED
[INFO] Apache HBase - Archetypes ......................... SKIPPED
[INFO] Apache HBase - Exemplar for hbase-client archetype  SKIPPED
[INFO] Apache HBase - Exemplar for hbase-shaded-client archetype  SKIPPED
[INFO] Apache HBase - Archetype builder .................. SKIPPED
[INFO] ------------------------------------------------------------------------
[INFO] BUILD FAILURE
[INFO] ------------------------------------------------------------------------
[INFO] Total time: 3:42.532s
[INFO] Finished at: Sun Aug 14 13:46:05 UTC 2016
[INFO] Final Memory: 59M/1512M
[INFO] ------------------------------------------------------------------------
[ERROR] Failed to execute goal org.apache.maven.plugins:maven-surefire-plugin:2.18.1:test
(default-test) on project hbase-client: There are test failures.
[ERROR] 
[ERROR] Please refer to <https://builds.apache.org/job/HBase-Trunk_matrix/jdk=JDK%201.8%20(latest),label=yahoo-not-h2/ws/hbase-client/target/surefire-reports>
for the individual test results.
[ERROR] -> [Help 1]
[ERROR] 
[ERROR] To see the full stack trace of the errors, re-run Maven with the -e switch.
[ERROR] Re-run Maven using the -X switch to enable full debug logging.
[ERROR] 
[ERROR] For more information about the errors and possible solutions, please read the following
articles:
[ERROR] [Help 1] http://cwiki.apache.org/confluence/display/MAVEN/MojoFailureException
[ERROR] 
[ERROR] After correcting the problems, you can resume the build with the command
[ERROR]   mvn <goals> -rf :hbase-client
Build step 'Invoke top-level Maven targets' marked build as failure
Performing Post build task...
Match found for :.* : True
Logical operation result is TRUE
Running script  : # Run zombie detector script
./dev-support/zombie-detector.sh --jenkins ${BUILD_ID}
[yahoo-not-h2] $ /bin/bash -xe /tmp/hudson3067331437657892450.sh
+ ./dev-support/zombie-detector.sh --jenkins 1413
Sun Aug 14 13:46:07 UTC 2016 We're ok: there is no zombie test


    {color:green}+1 zombies{color}. No zombie tests found running at the end of the build.
POST BUILD TASK : SUCCESS
END OF POST BUILD TASK : 0
Archiving artifacts
No prior successful build to compare, so performing full copy of artifacts
Recording test results
[FINDBUGS] Skipping publisher since build result is FAILURE
[CHECKSTYLE] Skipping publisher since build result is FAILURE

Mime
View raw message