hbase-builds mailing list archives

Site index · List index
Message view « Date » · « Thread »
Top « Date » · « Thread »
From Apache Jenkins Server <jenk...@builds.apache.org>
Subject Build failed in Jenkins: HBase-1.3-IT » IntegrationTestImportTsv,JDK 1.8 (latest),yahoo-not-h2 #793
Date Thu, 18 Aug 2016 06:44:45 GMT
See <https://builds.apache.org/job/HBase-1.3-IT/it.test=IntegrationTestImportTsv,jdk=JDK%201.8%20(latest),label=yahoo-not-h2/793/changes>

Changes:

[liyu] HBASE-16429 FSHLog: deadlock if rollWriter called when ring buffer

------------------------------------------
[...truncated 2407 lines...]
     bool UseCounterDecay                           = true                               
{product}
     bool UseDivMod                                 = true                               
{C2 product}
     bool UseDynamicNumberOfGCThreads               = false                              
{product}
     bool UseFPUForSpilling                         = true                               
{C2 product}
     bool UseFastAccessorMethods                    = false                              
{product}
     bool UseFastEmptyMethods                       = false                              
{product}
     bool UseFastJNIAccessors                       = true                               
{product}
     bool UseFastStosb                              = false                              
{ARCH product}
     bool UseG1GC                                   = false                              
{product}
     bool UseGCLogFileRotation                      = false                              
{product}
     bool UseGCOverheadLimit                        = true                               
{product}
     bool UseGCTaskAffinity                         = false                              
{product}
     bool UseHeavyMonitors                          = false                              
{product}
     bool UseHugeTLBFS                              = false                              
{product}
     bool UseInlineCaches                           = true                               
{product}
     bool UseInterpreter                            = true                               
{product}
     bool UseJumpTables                             = true                               
{C2 product}
     bool UseLWPSynchronization                     = true                               
{product}
     bool UseLargePages                             = false                              
{pd product}
     bool UseLargePagesInMetaspace                  = false                              
{product}
     bool UseLargePagesIndividualAllocation         = false                              
{pd product}
     bool UseLinuxPosixThreadCPUClocks              = true                               
{product}
     bool UseLockedTracing                          = false                              
{product}
     bool UseLoopCounter                            = true                               
{product}
     bool UseLoopInvariantCodeMotion                = true                               
{C1 product}
     bool UseLoopPredicate                          = true                               
{C2 product}
     bool UseMathExactIntrinsics                    = true                               
{C2 product}
     bool UseMaximumCompactionOnSystemGC            = true                               
{product}
     bool UseMembar                                 = false                              
{pd product}
     bool UseMontgomeryMultiplyIntrinsic            = false                              
{C2 product}
     bool UseMontgomerySquareIntrinsic              = false                              
{C2 product}
     bool UseMulAddIntrinsic                        = false                              
{C2 product}
     bool UseMultiplyToLenIntrinsic                 = true                               
{C2 product}
     bool UseNUMA                                   = false                              
{product}
     bool UseNUMAInterleaving                       = false                              
{product}
     bool UseNewLongLShift                          = false                              
{ARCH product}
     bool UseOSErrorReporting                       = false                              
{pd product}
     bool UseOldInlining                            = true                               
{C2 product}
     bool UseOnStackReplacement                     = true                               
{pd product}
     bool UseOnlyInlinedBimorphic                   = true                               
{C2 product}
     bool UseOprofile                               = false                              
{product}
     bool UseOptoBiasInlining                       = true                               
{C2 product}
     bool UsePSAdaptiveSurvivorSizePolicy           = true                               
{product}
     bool UseParNewGC                               = false                              
{product}
     bool UseParallelGC                            := true                               
{product}
     bool UseParallelOldGC                          = true                               
{product}
     bool UsePerfData                               = true                               
{product}
     bool UsePopCountInstruction                    = true                               
{product}
     bool UseRDPCForConstantTableBase               = false                              
{C2 product}
     bool UseRTMDeopt                               = false                              
{ARCH product}
     bool UseRTMLocking                             = false                              
{ARCH product}
     bool UseSHA                                    = false                              
{product}
     bool UseSHA1Intrinsics                         = false                              
{product}
     bool UseSHA256Intrinsics                       = false                              
{product}
     bool UseSHA512Intrinsics                       = false                              
{product}
     bool UseSHM                                    = false                              
{product}
     intx UseSSE                                    = 4                                  
{product}
     bool UseSSE42Intrinsics                        = true                               
{product}
     bool UseSerialGC                               = false                              
{product}
     bool UseSharedSpaces                           = false                              
{product}
     bool UseSignalChaining                         = true                               
{product}
     bool UseSquareToLenIntrinsic                   = false                              
{C2 product}
     bool UseStoreImmI16                            = false                              
{ARCH product}
     bool UseStringDeduplication                    = false                              
{product}
     bool UseSuperWord                              = true                               
{C2 product}
     bool UseTLAB                                   = true                               
{pd product}
     bool UseThreadPriorities                       = true                               
{pd product}
     bool UseTransparentHugePages                   = false                              
{product}
     bool UseTypeProfile                            = true                               
{product}
     bool UseTypeSpeculation                        = true                               
{C2 product}
     bool UseUnalignedLoadStores                    = true                               
{ARCH product}
     bool UseVMInterruptibleIO                      = false                              
{product}
     bool UseXMMForArrayCopy                        = true                               
{product}
     bool UseXmmI2D                                 = false                              
{ARCH product}
     bool UseXmmI2F                                 = false                              
{ARCH product}
     bool UseXmmLoadAndClearUpper                   = true                               
{ARCH product}
     bool UseXmmRegToRegMoveAll                     = true                               
{ARCH product}
     bool VMThreadHintNoPreempt                     = false                              
{product}
     intx VMThreadPriority                          = -1                                 
{product}
     intx VMThreadStackSize                         = 1024                               
{pd product}
     intx ValueMapInitialSize                       = 11                                 
{C1 product}
     intx ValueMapMaxLoopSize                       = 8                                  
{C1 product}
     intx ValueSearchLimit                          = 1000                               
{C2 product}
     bool VerifyMergedCPBytecodes                   = true                               
{product}
     bool VerifySharedSpaces                        = false                              
{product}
     intx WorkAroundNPTLTimedWaitHang               = 1                                  
{product}
    uintx YoungGenerationSizeIncrement              = 20                                 
{product}
    uintx YoungGenerationSizeSupplement             = 80                                 
{product}
    uintx YoungGenerationSizeSupplementDecay        = 8                                  
{product}
    uintx YoungPLABSize                             = 4096                               
{product}
     bool ZeroTLAB                                  = false                              
{product}
     intx hashCode                                  = 5                                  
{product}
Running org.apache.hadoop.hbase.mapreduce.IntegrationTestImportTsv
SUREFIRE-859: [GC (Allocation Failure)  193536K->67769K(741888K), 0.1161465 secs]
SUREFIRE-859: [GC (Metadata GC Threshold)  100483K->43343K(935424K), 0.0139216 secs]
SUREFIRE-859: [Full GC (Metadata GC Threshold)  43343K->7854K(741888K), 0.0724299 secs]
SUREFIRE-859: [GC (Metadata GC Threshold)  307190K->88358K(741888K), 0.1311400 secs]
SUREFIRE-859: [Full GC (Metadata GC Threshold)  88358K->85445K(961536K), 0.1253592 secs]
SUREFIRE-859: [GC (Allocation Failure)  472517K->126205K(1152512K), 0.0671761 secs]
SUREFIRE-859: [GC (Metadata GC Threshold)  168350K->113182K(1199104K), 0.0301666 secs]
SUREFIRE-859: [Full GC (Metadata GC Threshold)  113182K->92657K(1251840K), 0.3427210 secs]
SUREFIRE-859: [GC (Allocation Failure)  717297K->128432K(1728512K), 0.0513789 secs]
Tests run: 1, Failures: 1, Errors: 0, Skipped: 0, Time elapsed: 82.919 sec <<< FAILURE!
- in org.apache.hadoop.hbase.mapreduce.IntegrationTestImportTsv
testGenerateAndLoad(org.apache.hadoop.hbase.mapreduce.IntegrationTestImportTsv)  Time elapsed:
15.513 sec  <<< FAILURE!
java.lang.AssertionError: expected:<0> but was:<1>
	at org.junit.Assert.fail(Assert.java:88)
	at org.junit.Assert.failNotEquals(Assert.java:834)
	at org.junit.Assert.assertEquals(Assert.java:645)
	at org.junit.Assert.assertEquals(Assert.java:631)
	at org.apache.hadoop.hbase.mapreduce.TestImportTsv.doMROnTableTest(TestImportTsv.java:440)
	at org.apache.hadoop.hbase.mapreduce.TestImportTsv.doMROnTableTest(TestImportTsv.java:393)
	at org.apache.hadoop.hbase.mapreduce.IntegrationTestImportTsv.testGenerateAndLoad(IntegrationTestImportTsv.java:203)


Results :

Failed tests: 
  IntegrationTestImportTsv.testGenerateAndLoad:203 expected:<0> but was:<1>

Tests run: 1, Failures: 1, Errors: 0, Skipped: 0

[WARNING] File encoding has not been set, using platform encoding ISO-8859-1, i.e. build is
platform dependent! The file encoding for reports output files should be provided by the POM
property ${project.reporting.outputEncoding}.
[INFO] 
[INFO] --- maven-failsafe-plugin:2.18.1:verify (verify) @ hbase-it ---
[INFO] Failsafe report directory: <https://builds.apache.org/job/HBase-1.3-IT/it.test=IntegrationTestImportTsv,jdk=JDK%201.8%20(latest),label=yahoo-not-h2/ws/hbase-it/target/failsafe-reports>
[WARNING] File encoding has not been set, using platform encoding ISO-8859-1, i.e. build is
platform dependent! The file encoding for reports output files should be provided by the POM
property ${project.reporting.outputEncoding}.
[INFO] ------------------------------------------------------------------------
[INFO] Reactor Summary:
[INFO] 
[INFO] Apache HBase ...................................... SUCCESS [5.034s]
[INFO] Apache HBase - Checkstyle ......................... SUCCESS [0.974s]
[INFO] Apache HBase - Resource Bundle .................... SUCCESS [0.415s]
[INFO] Apache HBase - Annotations ........................ SUCCESS [1.329s]
[INFO] Apache HBase - Protocol ........................... SUCCESS [20.424s]
[INFO] Apache HBase - Common ............................. SUCCESS [12.646s]
[INFO] Apache HBase - Procedure .......................... SUCCESS [1.978s]
[INFO] Apache HBase - Client ............................. SUCCESS [8.060s]
[INFO] Apache HBase - Hadoop Compatibility ............... SUCCESS [0.698s]
[INFO] Apache HBase - Hadoop Two Compatibility ........... SUCCESS [1.904s]
[INFO] Apache HBase - Prefix Tree ........................ SUCCESS [1.934s]
[INFO] Apache HBase - Server ............................. SUCCESS [1:01.198s]
[INFO] Apache HBase - Testing Util ....................... SUCCESS [1.588s]
[INFO] Apache HBase - Thrift ............................. SUCCESS [9.002s]
[INFO] Apache HBase - Rest ............................... SUCCESS [5.030s]
[INFO] Apache HBase - Shell .............................. SUCCESS [1.244s]
[INFO] Apache HBase - Integration Tests .................. FAILURE [1:28.495s]
[INFO] Apache HBase - Examples ........................... SKIPPED
[INFO] Apache HBase - External Block Cache ............... SKIPPED
[INFO] Apache HBase - Assembly ........................... SKIPPED
[INFO] Apache HBase - Shaded ............................. SKIPPED
[INFO] Apache HBase - Shaded - Client .................... SKIPPED
[INFO] Apache HBase - Shaded - Server .................... SKIPPED
[INFO] Apache HBase - Archetypes ......................... SKIPPED
[INFO] Apache HBase - Exemplar for hbase-client archetype  SKIPPED
[INFO] Apache HBase - Exemplar for hbase-shaded-client archetype  SKIPPED
[INFO] Apache HBase - Archetype builder .................. SKIPPED
[INFO] ------------------------------------------------------------------------
[INFO] BUILD FAILURE
[INFO] ------------------------------------------------------------------------
[INFO] Total time: 3:43.417s
[INFO] Finished at: Thu Aug 18 06:44:27 UTC 2016
[INFO] Final Memory: 183M/3461M
[INFO] ------------------------------------------------------------------------
[ERROR] Failed to execute goal org.apache.maven.plugins:maven-failsafe-plugin:2.18.1:verify
(verify) on project hbase-it: There are test failures.
[ERROR] 
[ERROR] Please refer to <https://builds.apache.org/job/HBase-1.3-IT/it.test=IntegrationTestImportTsv,jdk=JDK%201.8%20(latest),label=yahoo-not-h2/ws/hbase-it/target/failsafe-reports>
for the individual test results.
[ERROR] -> [Help 1]
[ERROR] 
[ERROR] To see the full stack trace of the errors, re-run Maven with the -e switch.
[ERROR] Re-run Maven using the -X switch to enable full debug logging.
[ERROR] 
[ERROR] For more information about the errors and possible solutions, please read the following
articles:
[ERROR] [Help 1] http://cwiki.apache.org/confluence/display/MAVEN/MojoFailureException
[ERROR] 
[ERROR] After correcting the problems, you can resume the build with the command
[ERROR]   mvn <goals> -rf :hbase-it
Build step 'Invoke top-level Maven targets' marked build as failure
Performing Post build task...
Match found for :.* : True
Logical operation result is TRUE
Running script  : # Post-build task script. TODO: Check this in and have all builds reference
check-in.
pwd && ls
# NOTE!!!! The below code has been copied and pasted from ./dev-tools/run-test.sh
# Do not change here without syncing there and vice-versa.
ZOMBIE_TESTS_COUNT=`jps -v | grep surefirebooter | grep -e '-Dhbase.test' | wc -l`
if [[ $ZOMBIE_TESTS_COUNT != 0 ]] ; then
 echo "Suspicious java process found - waiting 30s to see if there are just slow to stop"
 sleep 30
 ZOMBIE_TESTS_COUNT=`jps -v | grep surefirebooter | grep -e '-Dhbase.test' | wc -l`
 if [[ $ZOMBIE_TESTS_COUNT != 0 ]] ; then
   echo " {color:red}There appear to be $ZOMBIE_TESTS_COUNT zombie tests{color}, they should
have been killed by surefire but survived"
   jps -v | grep surefirebooter | grep -e '-Dhbase.test'
   jps -v | grep surefirebooter | grep -e '-Dhbase.test' | cut -d ' ' -f 1 | xargs -n 1 jstack
   # Exit with error
   exit 1
 else
   echo "We're ok: there is no zombie test, but some tests took some time to stop"
 fi
else
  echo "We're ok: there is no zombie test"
fi
[yahoo-not-h2] $ /bin/bash -xe /tmp/hudson7538090407813413092.sh
+ pwd
<https://builds.apache.org/job/HBase-1.3-IT/it.test=IntegrationTestImportTsv,jdk=JDK%201.8%20(latest),label=yahoo-not-h2/ws/>
+ ls
bin
CHANGES.txt
conf
dev-support
hbase-annotations
hbase-archetypes
hbase-assembly
hbase-checkstyle
hbase-client
hbase-common
hbase-examples
hbase-external-blockcache
hbase-hadoop2-compat
hbase-hadoop-compat
hbase-it
hbase-native-client
hbase-prefix-tree
hbase-procedure
hbase-protocol
hbase-resource-bundle
hbase-rest
hbase-server
hbase-shaded
hbase-shell
hbase-testing-util
hbase-thrift
LICENSE.txt
NOTICE.txt
pom.xml
README.txt
src
target
++ jps -v
++ grep surefirebooter
++ grep -e -Dhbase.test
++ wc -l
+ ZOMBIE_TESTS_COUNT=0
+ [[ 0 != 0 ]]
+ echo 'We'\''re ok: there is no zombie test'
We're ok: there is no zombie test
POST BUILD TASK : SUCCESS
END OF POST BUILD TASK : 0
Archiving artifacts
No prior successful build to compare, so performing full copy of artifacts

Mime
View raw message