hbase-builds mailing list archives

Site index · List index
Message view « Date » · « Thread »
Top « Date » · « Thread »
From Apache Jenkins Server <jenk...@builds.apache.org>
Subject Build failed in Jenkins: HBase-1.4 » JDK 1.7 (latest),yahoo-not-h2 #351
Date Tue, 16 Aug 2016 00:07:59 GMT
See <https://builds.apache.org/job/HBase-1.4/jdk=JDK%201.7%20(latest),label=yahoo-not-h2/351/changes>

Changes:

[stack] HBASE-16341 Missing bit on "Regression: Random Read/WorkloadC slower in

------------------------------------------
[...truncated 30128 lines...]
Tests run: 31, Failures: 0, Errors: 0, Skipped: 0, Time elapsed: 0.998 sec - in org.apache.hadoop.hbase.util.TestBytes
Running org.apache.hadoop.hbase.util.TestBoundedArrayQueue
Tests run: 1, Failures: 0, Errors: 0, Skipped: 0, Time elapsed: 0.088 sec - in org.apache.hadoop.hbase.util.TestBoundedArrayQueue
Running org.apache.hadoop.hbase.util.TestSimpleMutableByteRange
Tests run: 3, Failures: 0, Errors: 0, Skipped: 0, Time elapsed: 0.163 sec - in org.apache.hadoop.hbase.util.TestSimpleMutableByteRange

Results :

Tests in error: 
org.apache.hadoop.hbase.TestClassFinder.org.apache.hadoop.hbase.TestClassFinder
  Run 1: TestClassFinder.org.apache.hadoop.hbase.TestClassFinder » ExceptionInInitializer
  Run 2: TestClassFinder.org.apache.hadoop.hbase.TestClassFinder » NoClassDefFound Coul...

  TestHBaseConfiguration.org.apache.hadoop.hbase.TestHBaseConfiguration » NoClassDefFound
  TestHBaseConfiguration.testGetIntDeprecated » NoClassDefFound Could not initia...
  TestHBaseConfiguration.testGetPassword » ExceptionInInitializer
  TestHBaseConfiguration.testSubset » NoClassDefFound Could not initialize class...
org.apache.hadoop.hbase.io.crypto.TestCipherProvider.testCustomProvider(org.apache.hadoop.hbase.io.crypto.TestCipherProvider)
  Run 1: TestCipherProvider.testCustomProvider:126 » Runtime hbase-default.xml file see...
  Run 2: TestCipherProvider.testCustomProvider:126 » Runtime hbase-default.xml file see...
  Run 3: TestCipherProvider.testCustomProvider:126 » Runtime hbase-default.xml file see...

org.apache.hadoop.hbase.io.crypto.TestCipherProvider.testDefaultProvider(org.apache.hadoop.hbase.io.crypto.TestCipherProvider)
  Run 1: TestCipherProvider.testDefaultProvider:140 » Runtime hbase-default.xml file se...
  Run 2: TestCipherProvider.testDefaultProvider:140 » Runtime hbase-default.xml file se...
  Run 3: TestCipherProvider.testDefaultProvider:140 » Runtime hbase-default.xml file se...

org.apache.hadoop.hbase.io.crypto.TestEncryption.testLargeBlocks(org.apache.hadoop.hbase.io.crypto.TestEncryption)
  Run 1: TestEncryption.testLargeBlocks:60->checkTransformSymmetry:90 » Runtime hbase-d...
  Run 2: TestEncryption.testLargeBlocks:60->checkTransformSymmetry:90 » Runtime hbase-d...
  Run 3: TestEncryption.testLargeBlocks:60->checkTransformSymmetry:90 » Runtime hbase-d...

org.apache.hadoop.hbase.io.crypto.TestEncryption.testOddSizedBlocks(org.apache.hadoop.hbase.io.crypto.TestEncryption)
  Run 1: TestEncryption.testOddSizedBlocks:71->checkTransformSymmetry:90 » Runtime hbas...
  Run 2: TestEncryption.testOddSizedBlocks:71->checkTransformSymmetry:90 » Runtime hbas...
  Run 3: TestEncryption.testOddSizedBlocks:71->checkTransformSymmetry:90 » Runtime hbas...

org.apache.hadoop.hbase.io.crypto.TestEncryption.testSmallBlocks(org.apache.hadoop.hbase.io.crypto.TestEncryption)
  Run 1: TestEncryption.testSmallBlocks:49->checkTransformSymmetry:90 » Runtime hbase-d...
  Run 2: TestEncryption.testSmallBlocks:49->checkTransformSymmetry:90 » Runtime hbase-d...
  Run 3: TestEncryption.testSmallBlocks:49->checkTransformSymmetry:90 » Runtime hbase-d...

org.apache.hadoop.hbase.io.crypto.TestEncryption.testTypicalHFileBlocks(org.apache.hadoop.hbase.io.crypto.TestEncryption)
  Run 1: TestEncryption.testTypicalHFileBlocks:82->checkTransformSymmetry:90 » Runtime
...
  Run 2: TestEncryption.testTypicalHFileBlocks:82->checkTransformSymmetry:90 » Runtime
...
  Run 3: TestEncryption.testTypicalHFileBlocks:82->checkTransformSymmetry:90 » Runtime
...

org.apache.hadoop.hbase.io.crypto.TestKeyProvider.testTestProvider(org.apache.hadoop.hbase.io.crypto.TestKeyProvider)
  Run 1: TestKeyProvider.testTestProvider:39 » Runtime hbase-default.xml file seems to ...
  Run 2: TestKeyProvider.testTestProvider:39 » Runtime hbase-default.xml file seems to ...
  Run 3: TestKeyProvider.testTestProvider:39 » Runtime hbase-default.xml file seems to ...

  TestKeyStoreKeyProvider.org.apache.hadoop.hbase.io.crypto.TestKeyStoreKeyProvider » ExceptionInInitializer
org.apache.hadoop.hbase.io.crypto.aes.TestAES.testAESAlgorithm(org.apache.hadoop.hbase.io.crypto.aes.TestAES)
  Run 1: TestAES.testAESAlgorithm:54 » Runtime hbase-default.xml file seems to be for a...
  Run 2: TestAES.testAESAlgorithm:54 » Runtime hbase-default.xml file seems to be for a...
  Run 3: TestAES.testAESAlgorithm:54 » Runtime hbase-default.xml file seems to be for a...

org.apache.hadoop.hbase.io.crypto.aes.TestAES.testAlternateRNG(org.apache.hadoop.hbase.io.crypto.aes.TestAES)
  Run 1: TestAES.testAlternateRNG:89 » Runtime hbase-default.xml file seems to be for a...
  Run 2: TestAES.testAlternateRNG:89 » Runtime hbase-default.xml file seems to be for a...
  Run 3: TestAES.testAlternateRNG:89 » Runtime hbase-default.xml file seems to be for a...

org.apache.hadoop.hbase.util.TestCoprocessorClassLoader.testCleanupOldJars(org.apache.hadoop.hbase.util.TestCoprocessorClassLoader)
  Run 1: TestCoprocessorClassLoader.testCleanupOldJars » NoClassDefFound Could not init...
  Run 2: TestCoprocessorClassLoader.testCleanupOldJars » NoClassDefFound Could not init...
  Run 3: TestCoprocessorClassLoader.testCleanupOldJars » NoClassDefFound Could not init...

org.apache.hadoop.hbase.util.TestCoprocessorClassLoader.testDirectoryAndWildcard(org.apache.hadoop.hbase.util.TestCoprocessorClassLoader)
  Run 1: TestCoprocessorClassLoader.testDirectoryAndWildcard » NoClassDefFound Could no...
  Run 2: TestCoprocessorClassLoader.testDirectoryAndWildcard » NoClassDefFound Could no...
  Run 3: TestCoprocessorClassLoader.testDirectoryAndWildcard » NoClassDefFound Could no...

org.apache.hadoop.hbase.util.TestCoprocessorClassLoader.testLibJarName(org.apache.hadoop.hbase.util.TestCoprocessorClassLoader)
  Run 1: TestCoprocessorClassLoader.testLibJarName » NoClassDefFound Could not initiali...
  Run 2: TestCoprocessorClassLoader.testLibJarName » NoClassDefFound Could not initiali...
  Run 3: TestCoprocessorClassLoader.testLibJarName » NoClassDefFound Could not initiali...

org.apache.hadoop.hbase.util.TestCoprocessorClassLoader.testRelativeLibJarName(org.apache.hadoop.hbase.util.TestCoprocessorClassLoader)
  Run 1: TestCoprocessorClassLoader.testRelativeLibJarName » ExceptionInInitializer
  Run 2: TestCoprocessorClassLoader.testRelativeLibJarName » NoClassDefFound Could not ...
  Run 3: TestCoprocessorClassLoader.testRelativeLibJarName » NoClassDefFound Could not ...

org.apache.hadoop.hbase.util.TestDynamicClassLoader.testLoadClassFromAnotherPath(org.apache.hadoop.hbase.util.TestDynamicClassLoader)
  Run 1: TestDynamicClassLoader.testLoadClassFromAnotherPath » ExceptionInInitializer
  Run 2: TestDynamicClassLoader.testLoadClassFromAnotherPath » NoClassDefFound Could no...
  Run 3: TestDynamicClassLoader.testLoadClassFromAnotherPath » NoClassDefFound Could no...

org.apache.hadoop.hbase.util.TestDynamicClassLoader.testLoadClassFromLocalPath(org.apache.hadoop.hbase.util.TestDynamicClassLoader)
  Run 1: TestDynamicClassLoader.testLoadClassFromLocalPath » NoClassDefFound Could not ...
  Run 2: TestDynamicClassLoader.testLoadClassFromLocalPath » NoClassDefFound Could not ...
  Run 3: TestDynamicClassLoader.testLoadClassFromLocalPath » NoClassDefFound Could not ...

org.apache.hadoop.hbase.util.TestDynamicClassLoader.testLoadClassFromLocalPathWithDynamicDirOff(org.apache.hadoop.hbase.util.TestDynamicClassLoader)
  Run 1: TestDynamicClassLoader.testLoadClassFromLocalPathWithDynamicDirOff » NoClassDefFound
  Run 2: TestDynamicClassLoader.testLoadClassFromLocalPathWithDynamicDirOff » NoClassDefFound
  Run 3: TestDynamicClassLoader.testLoadClassFromLocalPathWithDynamicDirOff » NoClassDefFound

org.apache.hadoop.hbase.zookeeper.TestZKConfig.testClusterKey(org.apache.hadoop.hbase.zookeeper.TestZKConfig)
  Run 1: TestZKConfig.testClusterKey:63->testKey:92->testKey:112 » Runtime hbase-defaul...
  Run 2: TestZKConfig.testClusterKey:63->testKey:92->testKey:112 » Runtime hbase-defaul...
  Run 3: TestZKConfig.testClusterKey:63->testKey:92->testKey:112 » Runtime hbase-defaul...

org.apache.hadoop.hbase.zookeeper.TestZKConfig.testClusterKeyWithMultiplePorts(org.apache.hadoop.hbase.zookeeper.TestZKConfig)
  Run 1: TestZKConfig.testClusterKeyWithMultiplePorts:75->testKey:112 » Runtime hbase-d...
  Run 2: TestZKConfig.testClusterKeyWithMultiplePorts:75->testKey:112 » Runtime hbase-d...
  Run 3: TestZKConfig.testClusterKeyWithMultiplePorts:75->testKey:112 » Runtime hbase-d...

org.apache.hadoop.hbase.zookeeper.TestZKConfig.testGetZooKeeperClusterKey(org.apache.hadoop.hbase.zookeeper.TestZKConfig)
  Run 1: TestZKConfig.testGetZooKeeperClusterKey:52 » Runtime hbase-default.xml file se...
  Run 2: TestZKConfig.testGetZooKeeperClusterKey:52 » Runtime hbase-default.xml file se...
  Run 3: TestZKConfig.testGetZooKeeperClusterKey:52 » Runtime hbase-default.xml file se...

org.apache.hadoop.hbase.zookeeper.TestZKConfig.testZKConfigLoading(org.apache.hadoop.hbase.zookeeper.TestZKConfig)
  Run 1: TestZKConfig.testZKConfigLoading:40 » Runtime hbase-default.xml file seems to ...
  Run 2: TestZKConfig.testZKConfigLoading:40 » Runtime hbase-default.xml file seems to ...
  Run 3: TestZKConfig.testZKConfigLoading:40 » Runtime hbase-default.xml file seems to ...


Tests run: 231, Failures: 0, Errors: 26, Skipped: 1

[INFO] ------------------------------------------------------------------------
[INFO] Reactor Summary:
[INFO] 
[INFO] Apache HBase ...................................... SUCCESS [1:48.244s]
[INFO] Apache HBase - Checkstyle ......................... SUCCESS [9.802s]
[INFO] Apache HBase - Resource Bundle .................... SUCCESS [0.231s]
[INFO] Apache HBase - Annotations ........................ SUCCESS [1.172s]
[INFO] Apache HBase - Protocol ........................... SUCCESS [17.888s]
[INFO] Apache HBase - Common ............................. FAILURE [4:05.804s]
[INFO] Apache HBase - Procedure .......................... SKIPPED
[INFO] Apache HBase - Client ............................. SKIPPED
[INFO] Apache HBase - Hadoop Compatibility ............... SKIPPED
[INFO] Apache HBase - Hadoop Two Compatibility ........... SKIPPED
[INFO] Apache HBase - Prefix Tree ........................ SKIPPED
[INFO] Apache HBase - Server ............................. SKIPPED
[INFO] Apache HBase - Testing Util ....................... SKIPPED
[INFO] Apache HBase - Thrift ............................. SKIPPED
[INFO] Apache HBase - Rest ............................... SKIPPED
[INFO] Apache HBase - Shell .............................. SKIPPED
[INFO] Apache HBase - Integration Tests .................. SKIPPED
[INFO] Apache HBase - Examples ........................... SKIPPED
[INFO] Apache HBase - External Block Cache ............... SKIPPED
[INFO] Apache HBase - Assembly ........................... SKIPPED
[INFO] Apache HBase - Shaded ............................. SKIPPED
[INFO] Apache HBase - Shaded - Client .................... SKIPPED
[INFO] Apache HBase - Shaded - Server .................... SKIPPED
[INFO] Apache HBase - Archetypes ......................... SKIPPED
[INFO] Apache HBase - Exemplar for hbase-client archetype  SKIPPED
[INFO] Apache HBase - Exemplar for hbase-shaded-client archetype  SKIPPED
[INFO] Apache HBase - Archetype builder .................. SKIPPED
[INFO] ------------------------------------------------------------------------
[INFO] BUILD FAILURE
[INFO] ------------------------------------------------------------------------
[INFO] Total time: 6:55.376s
[INFO] Finished at: Tue Aug 16 00:08:02 UTC 2016
[INFO] Final Memory: 55M/819M
[INFO] ------------------------------------------------------------------------
[ERROR] Failed to execute goal org.apache.maven.plugins:maven-surefire-plugin:2.18.1:test
(default-test) on project hbase-common: ExecutionException: java.lang.RuntimeException: There
was an error in the forked process
[ERROR] java.lang.ArrayIndexOutOfBoundsException: 1
[ERROR] at org.apache.maven.surefire.common.junit4.JUnit4ProviderUtil.generateFailingTests(JUnit4ProviderUtil.java:64)
[ERROR] at org.apache.maven.surefire.junitcore.JUnitCoreProvider.invoke(JUnitCoreProvider.java:151)
[ERROR] at org.apache.maven.surefire.booter.ForkedBooter.invokeProviderInSameClassLoader(ForkedBooter.java:203)
[ERROR] at org.apache.maven.surefire.booter.ForkedBooter.runSuitesInProcess(ForkedBooter.java:155)
[ERROR] at org.apache.maven.surefire.booter.ForkedBooter.main(ForkedBooter.java:103)
[ERROR] -> [Help 1]
[ERROR] 
[ERROR] To see the full stack trace of the errors, re-run Maven with the -e switch.
[ERROR] Re-run Maven using the -X switch to enable full debug logging.
[ERROR] 
[ERROR] For more information about the errors and possible solutions, please read the following
articles:
[ERROR] [Help 1] http://cwiki.apache.org/confluence/display/MAVEN/MojoFailureException
[ERROR] 
[ERROR] After correcting the problems, you can resume the build with the command
[ERROR]   mvn <goals> -rf :hbase-common
Build step 'Invoke top-level Maven targets' marked build as failure
Performing Post build task...
Match found for :.* : True
Logical operation result is TRUE
Running script  : # Post-build task script. TODO: Check this in and have all builds reference
check-in.
pwd && ls
# NOTE!!!! The below code has been copied and pasted from ./dev-tools/run-test.sh
# Do not change here without syncing there and vice-versa.
ZOMBIE_TESTS_COUNT=`jps -v | grep surefirebooter | grep -e '-Dhbase.test' | wc -l`
if [[ $ZOMBIE_TESTS_COUNT != 0 ]] ; then
 echo "Suspicious java process found - waiting 30s to see if there are just slow to stop"
 sleep 30
 ZOMBIE_TESTS_COUNT=`jps -v | grep surefirebooter | grep -e '-Dhbase.test' | wc -l`
 if [[ $ZOMBIE_TESTS_COUNT != 0 ]] ; then
   echo " {color:red}There appear to be $ZOMBIE_TESTS_COUNT zombie tests{color}, they should
have been killed by surefire but survived"
   jps -v | grep surefirebooter | grep -e '-Dhbase.test'
   jps -v | grep surefirebooter | grep -e '-Dhbase.test' | cut -d ' ' -f 1 | xargs -n 1 jstack
   # Exit with error
   exit 1
 else
   echo "We're ok: there is no zombie test, but some tests took some time to stop"
 fi
else
  echo "We're ok: there is no zombie test"
fi
[yahoo-not-h2] $ /bin/bash -xe /tmp/hudson4705830406736747329.sh
+ pwd
<https://builds.apache.org/job/HBase-1.4/jdk=JDK%201.7%20(latest),label=yahoo-not-h2/ws/>
+ ls
bin
CHANGES.txt
conf
dev-support
hbase-annotations
hbase-archetypes
hbase-assembly
hbase-checkstyle
hbase-client
hbase-common
hbase-examples
hbase-external-blockcache
hbase-hadoop2-compat
hbase-hadoop-compat
hbase-it
hbase-native-client
hbase-prefix-tree
hbase-procedure
hbase-protocol
hbase-resource-bundle
hbase-rest
hbase-server
hbase-shaded
hbase-shell
hbase-testing-util
hbase-thrift
LICENSE.txt
NOTICE.txt
pom.xml
README.txt
src
target
++ jps -v
++ grep surefirebooter
++ grep -e -Dhbase.test
++ wc -l
+ ZOMBIE_TESTS_COUNT=0
+ [[ 0 != 0 ]]
+ echo 'We'\''re ok: there is no zombie test'
We're ok: there is no zombie test
POST BUILD TASK : SUCCESS
END OF POST BUILD TASK : 0
Archiving artifacts
No prior successful build to compare, so performing full copy of artifacts
Recording test results

Mime
View raw message