hbase-builds mailing list archives

Site index · List index
Message view « Date » · « Thread »
Top « Date » · « Thread »
From Apache Jenkins Server <jenk...@builds.apache.org>
Subject Build failed in Jenkins: HBase-1.3-IT » IntegrationTestImportTsv,JDK 1.7 (latest),yahoo-not-h2 #790
Date Thu, 11 Aug 2016 02:50:20 GMT
See <https://builds.apache.org/job/HBase-1.3-IT/it.test=IntegrationTestImportTsv,jdk=JDK%201.7%20(latest),label=yahoo-not-h2/790/changes>

Changes:

[zhangduo] HBASE-16285 Drop RPC requests if it must be considered as timeout at

[appy] HBASE-14345 Consolidate printUsage in IntegrationTestLoadAndVerify (Reid

[esteban] HBASE-16379 [replication] Minor improvement to

[stack] HBASE-16385 Have hbase-rest pull hbase.rest.port from Constants.java (Yi

[stack] HBASE-16363 Correct javadoc for qualifier length and value (Xiang Li)

[zhangduo] HBASE-16368 test*WhenRegionMove in TestPartialResultsFromClientSide is

------------------------------------------
[...truncated 49907 lines...]
     bool UseAddressNop                             = true            {ARCH product}     

     bool UseAltSigs                                = false           {product}          

     bool UseAutoGCSelectPolicy                     = false           {product}          

     bool UseBiasedLocking                          = true            {product}          

     bool UseBimorphicInlining                      = true            {C2 product}       

     bool UseBoundThreads                           = true            {product}          

     bool UseCMSBestFit                             = true            {product}          

     bool UseCMSCollectionPassing                   = true            {product}          

     bool UseCMSCompactAtFullCollection             = true            {product}          

     bool UseCMSInitiatingOccupancyOnly             = false           {product}          

     bool UseCodeCacheFlushing                      = true            {product}          

     bool UseCompiler                               = true            {product}          

     bool UseCompilerSafepoints                     = true            {product}          

     bool UseCompressedOops                        := true            {lp64_product}     

     bool UseConcMarkSweepGC                        = false           {product}          

     bool UseCondCardMark                           = false           {C2 product}       

     bool UseCountLeadingZerosInstruction           = false           {ARCH product}     

     bool UseCounterDecay                           = true            {product}          

     bool UseDivMod                                 = true            {C2 product}       

     bool UseDynamicNumberOfGCThreads               = false           {product}          

     bool UseFPUForSpilling                         = false           {C2 product}       

     bool UseFastAccessorMethods                    = false           {product}          

     bool UseFastEmptyMethods                       = false           {product}          

     bool UseFastJNIAccessors                       = true            {product}          

     bool UseFastStosb                              = false           {ARCH product}     

     bool UseG1GC                                   = false           {product}          

     bool UseGCLogFileRotation                      = false           {product}          

     bool UseGCOverheadLimit                        = true            {product}          

     bool UseGCTaskAffinity                         = false           {product}          

     bool UseHeavyMonitors                          = false           {product}          

     bool UseHugeTLBFS                              = false           {product}          

     bool UseInlineCaches                           = true            {product}          

     bool UseInterpreter                            = true            {product}          

     bool UseJumpTables                             = true            {C2 product}       

     bool UseLWPSynchronization                     = true            {product}          

     bool UseLargePages                             = false           {pd product}       

     bool UseLargePagesIndividualAllocation         = false           {pd product}       

     bool UseLinuxPosixThreadCPUClocks              = true            {product}          

     bool UseLockedTracing                          = false           {product}          

     bool UseLoopCounter                            = true            {product}          

     bool UseLoopPredicate                          = true            {C2 product}       

     bool UseMaximumCompactionOnSystemGC            = true            {product}          

     bool UseMembar                                 = false           {pd product}       

     bool UseNUMA                                   = false           {product}          

     bool UseNUMAInterleaving                       = false           {product}          

     bool UseNewLongLShift                          = false           {ARCH product}     

     bool UseOSErrorReporting                       = false           {pd product}       

     bool UseOldInlining                            = true            {C2 product}       

     bool UseOnStackReplacement                     = true            {pd product}       

     bool UseOnlyInlinedBimorphic                   = true            {C2 product}       

     bool UseOprofile                               = false           {product}          

     bool UseOptoBiasInlining                       = true            {C2 product}       

     bool UsePPCLWSYNC                              = true            {product}          

     bool UsePSAdaptiveSurvivorSizePolicy           = true            {product}          

     bool UseParNewGC                               = false           {product}          

     bool UseParallelGC                            := true            {product}          

     bool UseParallelOldGC                          = true            {product}          

     bool UsePerfData                               = true            {product}          

     bool UsePopCountInstruction                    = true            {product}          

     bool UseRDPCForConstantTableBase               = false           {C2 product}       

     bool UseSHM                                    = false           {product}          

     intx UseSSE                                    = 4               {product}          

     bool UseSSE42Intrinsics                        = true            {product}          

     bool UseSerialGC                               = false           {product}          

     bool UseSharedSpaces                           = false           {product}          

     bool UseSignalChaining                         = true            {product}          

     bool UseSplitVerifier                          = true            {product}          

     bool UseStoreImmI16                            = false           {ARCH product}     

     bool UseStringCache                            = false           {product}          

     bool UseSuperWord                              = true            {C2 product}       

     bool UseTLAB                                   = true            {pd product}       

     bool UseThreadPriorities                       = true            {pd product}       

     bool UseTransparentHugePages                   = false           {product}          

     bool UseTypeProfile                            = true            {product}          

     bool UseUnalignedLoadStores                    = true            {ARCH product}     

     bool UseVMInterruptibleIO                      = false           {product}          

     bool UseVectoredExceptions                     = false           {pd product}       

     bool UseXMMForArrayCopy                        = true            {product}          

     bool UseXmmI2D                                 = false           {ARCH product}     

     bool UseXmmI2F                                 = false           {ARCH product}     

     bool UseXmmLoadAndClearUpper                   = true            {ARCH product}     

     bool UseXmmRegToRegMoveAll                     = true            {ARCH product}     

     bool VMThreadHintNoPreempt                     = false           {product}          

     intx VMThreadPriority                          = -1              {product}          

     intx VMThreadStackSize                         = 1024            {pd product}       

     intx ValueMapInitialSize                       = 11              {C1 product}       

     intx ValueMapMaxLoopSize                       = 8               {C1 product}       

     intx ValueSearchLimit                          = 1000            {C2 product}       

     bool VerifyMergedCPBytecodes                   = true            {product}          

     intx WorkAroundNPTLTimedWaitHang               = 1               {product}          

    uintx YoungGenerationSizeIncrement              = 20              {product}          

    uintx YoungGenerationSizeSupplement             = 80              {product}          

    uintx YoungGenerationSizeSupplementDecay        = 8               {product}          

    uintx YoungPLABSize                             = 4096            {product}          

     bool ZeroTLAB                                  = false           {product}          

     intx hashCode                                  = 0               {product}          

Running org.apache.hadoop.hbase.mapreduce.IntegrationTestImportTsv
SUREFIRE-859: [GC 194048K->14243K(740864K), 0.0172680 secs]
SUREFIRE-859: [GC 208291K->70855K(740864K), 0.1252900 secs]
SUREFIRE-859: [GC 264903K->99690K(740864K), 0.0757340 secs]
SUREFIRE-859: [GC 293738K->124111K(934912K), 0.0775700 secs]
SUREFIRE-859: [GC 512207K->154964K(934912K), 0.0405320 secs]
Tests run: 1, Failures: 1, Errors: 0, Skipped: 0, Time elapsed: 68.942 sec <<< FAILURE!
- in org.apache.hadoop.hbase.mapreduce.IntegrationTestImportTsv
testGenerateAndLoad(org.apache.hadoop.hbase.mapreduce.IntegrationTestImportTsv)  Time elapsed:
10.781 sec  <<< FAILURE!
java.lang.AssertionError: expected:<0> but was:<1>
	at org.junit.Assert.fail(Assert.java:88)
	at org.junit.Assert.failNotEquals(Assert.java:834)
	at org.junit.Assert.assertEquals(Assert.java:645)
	at org.junit.Assert.assertEquals(Assert.java:631)
	at org.apache.hadoop.hbase.mapreduce.TestImportTsv.doMROnTableTest(TestImportTsv.java:440)
	at org.apache.hadoop.hbase.mapreduce.TestImportTsv.doMROnTableTest(TestImportTsv.java:393)
	at org.apache.hadoop.hbase.mapreduce.IntegrationTestImportTsv.testGenerateAndLoad(IntegrationTestImportTsv.java:203)


Results :

Failed tests: 
  IntegrationTestImportTsv.testGenerateAndLoad:203 expected:<0> but was:<1>

Tests run: 1, Failures: 1, Errors: 0, Skipped: 0

[WARNING] File encoding has not been set, using platform encoding ISO-8859-1, i.e. build is
platform dependent! The file encoding for reports output files should be provided by the POM
property ${project.reporting.outputEncoding}.
[INFO] 
[INFO] --- maven-failsafe-plugin:2.18.1:verify (verify) @ hbase-it ---
[INFO] Failsafe report directory: <https://builds.apache.org/job/HBase-1.3-IT/it.test=IntegrationTestImportTsv,jdk=JDK%201.7%20(latest),label=yahoo-not-h2/ws/hbase-it/target/failsafe-reports>
[WARNING] File encoding has not been set, using platform encoding ISO-8859-1, i.e. build is
platform dependent! The file encoding for reports output files should be provided by the POM
property ${project.reporting.outputEncoding}.
[INFO] ------------------------------------------------------------------------
[INFO] Reactor Summary:
[INFO] 
[INFO] Apache HBase ...................................... SUCCESS [2:11.563s]
[INFO] Apache HBase - Checkstyle ......................... SUCCESS [10.476s]
[INFO] Apache HBase - Resource Bundle .................... SUCCESS [0.262s]
[INFO] Apache HBase - Annotations ........................ SUCCESS [1.067s]
[INFO] Apache HBase - Protocol ........................... SUCCESS [18.861s]
[INFO] Apache HBase - Common ............................. SUCCESS [1:25.391s]
[INFO] Apache HBase - Procedure .......................... SUCCESS [1.396s]
[INFO] Apache HBase - Client ............................. SUCCESS [11.388s]
[INFO] Apache HBase - Hadoop Compatibility ............... SUCCESS [2.891s]
[INFO] Apache HBase - Hadoop Two Compatibility ........... SUCCESS [4.741s]
[INFO] Apache HBase - Prefix Tree ........................ SUCCESS [1.312s]
[INFO] Apache HBase - Server ............................. SUCCESS [1:35.143s]
[INFO] Apache HBase - Testing Util ....................... SUCCESS [2.542s]
[INFO] Apache HBase - Thrift ............................. SUCCESS [10.741s]
[INFO] Apache HBase - Rest ............................... SUCCESS [3.049s]
[INFO] Apache HBase - Shell .............................. SUCCESS [11.656s]
[INFO] Apache HBase - Integration Tests .................. FAILURE [1:13.276s]
[INFO] Apache HBase - Examples ........................... SKIPPED
[INFO] Apache HBase - External Block Cache ............... SKIPPED
[INFO] Apache HBase - Assembly ........................... SKIPPED
[INFO] Apache HBase - Shaded ............................. SKIPPED
[INFO] Apache HBase - Shaded - Client .................... SKIPPED
[INFO] Apache HBase - Shaded - Server .................... SKIPPED
[INFO] Apache HBase - Archetypes ......................... SKIPPED
[INFO] Apache HBase - Exemplar for hbase-client archetype  SKIPPED
[INFO] Apache HBase - Exemplar for hbase-shaded-client archetype  SKIPPED
[INFO] Apache HBase - Archetype builder .................. SKIPPED
[INFO] ------------------------------------------------------------------------
[INFO] BUILD FAILURE
[INFO] ------------------------------------------------------------------------
[INFO] Total time: 8:29.707s
[INFO] Finished at: Thu Aug 11 02:50:09 UTC 2016
[INFO] Final Memory: 142M/1178M
[INFO] ------------------------------------------------------------------------
[ERROR] Failed to execute goal org.apache.maven.plugins:maven-failsafe-plugin:2.18.1:verify
(verify) on project hbase-it: There are test failures.
[ERROR] 
[ERROR] Please refer to <https://builds.apache.org/job/HBase-1.3-IT/it.test=IntegrationTestImportTsv,jdk=JDK%201.7%20(latest),label=yahoo-not-h2/ws/hbase-it/target/failsafe-reports>
for the individual test results.
[ERROR] -> [Help 1]
[ERROR] 
[ERROR] To see the full stack trace of the errors, re-run Maven with the -e switch.
[ERROR] Re-run Maven using the -X switch to enable full debug logging.
[ERROR] 
[ERROR] For more information about the errors and possible solutions, please read the following
articles:
[ERROR] [Help 1] http://cwiki.apache.org/confluence/display/MAVEN/MojoFailureException
[ERROR] 
[ERROR] After correcting the problems, you can resume the build with the command
[ERROR]   mvn <goals> -rf :hbase-it
Build step 'Invoke top-level Maven targets' marked build as failure
Performing Post build task...
Match found for :.* : True
Logical operation result is TRUE
Running script  : # Post-build task script. TODO: Check this in and have all builds reference
check-in.
pwd && ls
# NOTE!!!! The below code has been copied and pasted from ./dev-tools/run-test.sh
# Do not change here without syncing there and vice-versa.
ZOMBIE_TESTS_COUNT=`jps -v | grep surefirebooter | grep -e '-Dhbase.test' | wc -l`
if [[ $ZOMBIE_TESTS_COUNT != 0 ]] ; then
 echo "Suspicious java process found - waiting 30s to see if there are just slow to stop"
 sleep 30
 ZOMBIE_TESTS_COUNT=`jps -v | grep surefirebooter | grep -e '-Dhbase.test' | wc -l`
 if [[ $ZOMBIE_TESTS_COUNT != 0 ]] ; then
   echo " {color:red}There appear to be $ZOMBIE_TESTS_COUNT zombie tests{color}, they should
have been killed by surefire but survived"
   jps -v | grep surefirebooter | grep -e '-Dhbase.test'
   jps -v | grep surefirebooter | grep -e '-Dhbase.test' | cut -d ' ' -f 1 | xargs -n 1 jstack
   # Exit with error
   exit 1
 else
   echo "We're ok: there is no zombie test, but some tests took some time to stop"
 fi
else
  echo "We're ok: there is no zombie test"
fi
[yahoo-not-h2] $ /bin/bash -xe /tmp/hudson6234165042483363181.sh
+ pwd
<https://builds.apache.org/job/HBase-1.3-IT/it.test=IntegrationTestImportTsv,jdk=JDK%201.7%20(latest),label=yahoo-not-h2/ws/>
+ ls
bin
CHANGES.txt
conf
dev-support
hbase-annotations
hbase-archetypes
hbase-assembly
hbase-checkstyle
hbase-client
hbase-common
hbase-examples
hbase-external-blockcache
hbase-hadoop2-compat
hbase-hadoop-compat
hbase-it
hbase-native-client
hbase-prefix-tree
hbase-procedure
hbase-protocol
hbase-resource-bundle
hbase-rest
hbase-server
hbase-shaded
hbase-shell
hbase-testing-util
hbase-thrift
LICENSE.txt
NOTICE.txt
pom.xml
README.txt
src
target
++ jps -v
++ grep surefirebooter
++ grep -e -Dhbase.test
++ wc -l
+ ZOMBIE_TESTS_COUNT=0
+ [[ 0 != 0 ]]
+ echo 'We'\''re ok: there is no zombie test'
We're ok: there is no zombie test
POST BUILD TASK : SUCCESS
END OF POST BUILD TASK : 0
Archiving artifacts
No prior successful build to compare, so performing full copy of artifacts

Mime
View raw message