hbase-builds mailing list archives

Site index · List index
Message view « Date » · « Thread »
Top « Date » · « Thread »
From Apache Jenkins Server <jenk...@builds.apache.org>
Subject Build failed in Jenkins: HBase-Trunk_matrix » JDK 1.7 (latest),yahoo-not-h2 #1396
Date Thu, 11 Aug 2016 13:44:33 GMT
See <https://builds.apache.org/job/HBase-Trunk_matrix/jdk=JDK%201.7%20(latest),label=yahoo-not-h2/1396/>

------------------------------------------
[...truncated 5040 lines...]
	at org.apache.hadoop.hbase.HBaseConfiguration.addHbaseResources(HBaseConfiguration.java:83)
	at org.apache.hadoop.hbase.HBaseConfiguration.create(HBaseConfiguration.java:98)
	at org.apache.hadoop.hbase.HBaseCommonTestingUtility.<init>(HBaseCommonTestingUtility.java:46)
	at org.apache.hadoop.hbase.procedure2.store.wal.TestWALProcedureStore.setUp(TestWALProcedureStore.java:74)

testCorruptedTrailer(org.apache.hadoop.hbase.procedure2.store.wal.TestWALProcedureStore) 
Time elapsed: 0.022 sec  <<< ERROR!
java.lang.NullPointerException: null
	at org.apache.hadoop.hbase.procedure2.store.wal.TestWALProcedureStore.tearDown(TestWALProcedureStore.java:88)

testRollAndRemove(org.apache.hadoop.hbase.procedure2.store.wal.TestWALProcedureStore)  Time
elapsed: 0.018 sec  <<< ERROR!
java.lang.RuntimeException: hbase-default.xml file seems to be for an older version of HBase
(2.0.0-SNAPSHOT), this version is Unknown
	at org.apache.hadoop.hbase.HBaseConfiguration.checkDefaultsVersion(HBaseConfiguration.java:73)
	at org.apache.hadoop.hbase.HBaseConfiguration.addHbaseResources(HBaseConfiguration.java:83)
	at org.apache.hadoop.hbase.HBaseConfiguration.create(HBaseConfiguration.java:98)
	at org.apache.hadoop.hbase.HBaseCommonTestingUtility.<init>(HBaseCommonTestingUtility.java:46)
	at org.apache.hadoop.hbase.procedure2.store.wal.TestWALProcedureStore.setUp(TestWALProcedureStore.java:74)

testRollAndRemove(org.apache.hadoop.hbase.procedure2.store.wal.TestWALProcedureStore)  Time
elapsed: 0.019 sec  <<< ERROR!
java.lang.NullPointerException: null
	at org.apache.hadoop.hbase.procedure2.store.wal.TestWALProcedureStore.tearDown(TestWALProcedureStore.java:88)

testCorruptedProcedures(org.apache.hadoop.hbase.procedure2.store.wal.TestWALProcedureStore)
 Time elapsed: 0.018 sec  <<< ERROR!
java.lang.RuntimeException: hbase-default.xml file seems to be for an older version of HBase
(2.0.0-SNAPSHOT), this version is Unknown
	at org.apache.hadoop.hbase.HBaseConfiguration.checkDefaultsVersion(HBaseConfiguration.java:73)
	at org.apache.hadoop.hbase.HBaseConfiguration.addHbaseResources(HBaseConfiguration.java:83)
	at org.apache.hadoop.hbase.HBaseConfiguration.create(HBaseConfiguration.java:98)
	at org.apache.hadoop.hbase.HBaseCommonTestingUtility.<init>(HBaseCommonTestingUtility.java:46)
	at org.apache.hadoop.hbase.procedure2.store.wal.TestWALProcedureStore.setUp(TestWALProcedureStore.java:74)

testCorruptedProcedures(org.apache.hadoop.hbase.procedure2.store.wal.TestWALProcedureStore)
 Time elapsed: 0.018 sec  <<< ERROR!
java.lang.NullPointerException: null
	at org.apache.hadoop.hbase.procedure2.store.wal.TestWALProcedureStore.tearDown(TestWALProcedureStore.java:88)

Running org.apache.hadoop.hbase.procedure2.store.TestProcedureStoreTracker
Tests run: 7, Failures: 0, Errors: 0, Skipped: 0, Time elapsed: 60.301 sec - in org.apache.hadoop.hbase.procedure2.store.TestProcedureStoreTracker

Results :

Tests in error: 
org.apache.hadoop.hbase.procedure2.TestChildProcedures.testChildLoad(org.apache.hadoop.hbase.procedure2.TestChildProcedures)
  Run 1: TestChildProcedures.setUp:58 » Runtime hbase-default.xml file seems to be for ...
  Run 2: TestChildProcedures.tearDown:74 NullPointer

org.apache.hadoop.hbase.procedure2.TestChildProcedures.testChildLoadWithSteppedRestart(org.apache.hadoop.hbase.procedure2.TestChildProcedures)
  Run 1: TestChildProcedures.setUp:58 » Runtime hbase-default.xml file seems to be for ...
  Run 2: TestChildProcedures.tearDown:74 NullPointer

org.apache.hadoop.hbase.procedure2.TestChildProcedures.testChildRollbackLoad(org.apache.hadoop.hbase.procedure2.TestChildProcedures)
  Run 1: TestChildProcedures.setUp:58 » Runtime hbase-default.xml file seems to be for ...
  Run 2: TestChildProcedures.tearDown:74 NullPointer

org.apache.hadoop.hbase.procedure2.TestChildProcedures.testChildRollbackLoadWithSteppedRestart(org.apache.hadoop.hbase.procedure2.TestChildProcedures)
  Run 1: TestChildProcedures.setUp:58 » Runtime hbase-default.xml file seems to be for ...
  Run 2: TestChildProcedures.tearDown:74 NullPointer

org.apache.hadoop.hbase.procedure2.TestProcedureExecution.testAbortTimeout(org.apache.hadoop.hbase.procedure2.TestProcedureExecution)
  Run 1: TestProcedureExecution.setUp:61 » Runtime hbase-default.xml file seems to be f...
  Run 2: TestProcedureExecution.tearDown:75 NullPointer

org.apache.hadoop.hbase.procedure2.TestProcedureExecution.testAbortTimeoutWithChildren(org.apache.hadoop.hbase.procedure2.TestProcedureExecution)
  Run 1: TestProcedureExecution.setUp:61 » Runtime hbase-default.xml file seems to be f...
  Run 2: TestProcedureExecution.tearDown:75 NullPointer

org.apache.hadoop.hbase.procedure2.TestProcedureExecution.testBadSubprocList(org.apache.hadoop.hbase.procedure2.TestProcedureExecution)
  Run 1: TestProcedureExecution.setUp:61 » Runtime hbase-default.xml file seems to be f...
  Run 2: TestProcedureExecution.tearDown:75 NullPointer

org.apache.hadoop.hbase.procedure2.TestProcedureExecution.testRollbackRetriableFailure(org.apache.hadoop.hbase.procedure2.TestProcedureExecution)
  Run 1: TestProcedureExecution.setUp:61 » Runtime hbase-default.xml file seems to be f...
  Run 2: TestProcedureExecution.tearDown:75 NullPointer

org.apache.hadoop.hbase.procedure2.TestProcedureExecution.testSingleSequentialProc(org.apache.hadoop.hbase.procedure2.TestProcedureExecution)
  Run 1: TestProcedureExecution.setUp:61 » Runtime hbase-default.xml file seems to be f...
  Run 2: TestProcedureExecution.tearDown:75 NullPointer

org.apache.hadoop.hbase.procedure2.TestProcedureExecution.testSingleSequentialProcRollback(org.apache.hadoop.hbase.procedure2.TestProcedureExecution)
  Run 1: TestProcedureExecution.setUp:61 » Runtime hbase-default.xml file seems to be f...
  Run 2: TestProcedureExecution.tearDown:75 NullPointer

org.apache.hadoop.hbase.procedure2.TestProcedureRecovery.testCompletedProcWithSameNonce(org.apache.hadoop.hbase.procedure2.TestProcedureRecovery)
  Run 1: TestProcedureRecovery.setUp:67 » Runtime hbase-default.xml file seems to be fo...
  Run 2: TestProcedureRecovery.tearDown:84 NullPointer

org.apache.hadoop.hbase.procedure2.TestProcedureRecovery.testMultiStepProcRecovery(org.apache.hadoop.hbase.procedure2.TestProcedureRecovery)
  Run 1: TestProcedureRecovery.setUp:67 » Runtime hbase-default.xml file seems to be fo...
  Run 2: TestProcedureRecovery.tearDown:84 NullPointer

org.apache.hadoop.hbase.procedure2.TestProcedureRecovery.testMultiStepRollbackRecovery(org.apache.hadoop.hbase.procedure2.TestProcedureRecovery)
  Run 1: TestProcedureRecovery.setUp:67 » Runtime hbase-default.xml file seems to be fo...
  Run 2: TestProcedureRecovery.tearDown:84 NullPointer

org.apache.hadoop.hbase.procedure2.TestProcedureRecovery.testNoopLoad(org.apache.hadoop.hbase.procedure2.TestProcedureRecovery)
  Run 1: TestProcedureRecovery.setUp:67 » Runtime hbase-default.xml file seems to be fo...
  Run 2: TestProcedureRecovery.tearDown:84 NullPointer

org.apache.hadoop.hbase.procedure2.TestProcedureRecovery.testRunningProcWithSameNonce(org.apache.hadoop.hbase.procedure2.TestProcedureRecovery)
  Run 1: TestProcedureRecovery.setUp:67 » Runtime hbase-default.xml file seems to be fo...
  Run 2: TestProcedureRecovery.tearDown:84 NullPointer

org.apache.hadoop.hbase.procedure2.TestProcedureRecovery.testSingleStepProcRecovery(org.apache.hadoop.hbase.procedure2.TestProcedureRecovery)
  Run 1: TestProcedureRecovery.setUp:67 » Runtime hbase-default.xml file seems to be fo...
  Run 2: TestProcedureRecovery.tearDown:84 NullPointer

org.apache.hadoop.hbase.procedure2.TestProcedureRecovery.testStateMachineMultipleLevel(org.apache.hadoop.hbase.procedure2.TestProcedureRecovery)
  Run 1: TestProcedureRecovery.setUp:67 » Runtime hbase-default.xml file seems to be fo...
  Run 2: TestProcedureRecovery.tearDown:84 NullPointer

org.apache.hadoop.hbase.procedure2.TestProcedureRecovery.testStateMachineRecovery(org.apache.hadoop.hbase.procedure2.TestProcedureRecovery)
  Run 1: TestProcedureRecovery.setUp:67 » Runtime hbase-default.xml file seems to be fo...
  Run 2: TestProcedureRecovery.tearDown:84 NullPointer

org.apache.hadoop.hbase.procedure2.TestProcedureRecovery.testStateMachineRollbackRecovery(org.apache.hadoop.hbase.procedure2.TestProcedureRecovery)
  Run 1: TestProcedureRecovery.setUp:67 » Runtime hbase-default.xml file seems to be fo...
  Run 2: TestProcedureRecovery.tearDown:84 NullPointer

org.apache.hadoop.hbase.procedure2.TestYieldProcedures.testYieldEachExecutionStep(org.apache.hadoop.hbase.procedure2.TestYieldProcedures)
  Run 1: TestYieldProcedures.setUp:63 » Runtime hbase-default.xml file seems to be for ...
  Run 2: TestYieldProcedures.tearDown:79 NullPointer

org.apache.hadoop.hbase.procedure2.TestYieldProcedures.testYieldException(org.apache.hadoop.hbase.procedure2.TestYieldProcedures)
  Run 1: TestYieldProcedures.setUp:63 » Runtime hbase-default.xml file seems to be for ...
  Run 2: TestYieldProcedures.tearDown:79 NullPointer

org.apache.hadoop.hbase.procedure2.TestYieldProcedures.testYieldOnInterrupt(org.apache.hadoop.hbase.procedure2.TestYieldProcedures)
  Run 1: TestYieldProcedures.setUp:63 » Runtime hbase-default.xml file seems to be for ...
  Run 2: TestYieldProcedures.tearDown:79 NullPointer

org.apache.hadoop.hbase.procedure2.store.wal.TestWALProcedureStore.testCorruptedEntries(org.apache.hadoop.hbase.procedure2.store.wal.TestWALProcedureStore)
  Run 1: TestWALProcedureStore.setUp:74 » Runtime hbase-default.xml file seems to be fo...
  Run 2: TestWALProcedureStore.tearDown:88 NullPointer

org.apache.hadoop.hbase.procedure2.store.wal.TestWALProcedureStore.testCorruptedProcedures(org.apache.hadoop.hbase.procedure2.store.wal.TestWALProcedureStore)
  Run 1: TestWALProcedureStore.setUp:74 » Runtime hbase-default.xml file seems to be fo...
  Run 2: TestWALProcedureStore.tearDown:88 NullPointer

org.apache.hadoop.hbase.procedure2.store.wal.TestWALProcedureStore.testCorruptedTrailer(org.apache.hadoop.hbase.procedure2.store.wal.TestWALProcedureStore)
  Run 1: TestWALProcedureStore.setUp:74 » Runtime hbase-default.xml file seems to be fo...
  Run 2: TestWALProcedureStore.tearDown:88 NullPointer

org.apache.hadoop.hbase.procedure2.store.wal.TestWALProcedureStore.testEmptyLogLoad(org.apache.hadoop.hbase.procedure2.store.wal.TestWALProcedureStore)
  Run 1: TestWALProcedureStore.setUp:74 » Runtime hbase-default.xml file seems to be fo...
  Run 2: TestWALProcedureStore.tearDown:88 NullPointer

org.apache.hadoop.hbase.procedure2.store.wal.TestWALProcedureStore.testEmptyRoll(org.apache.hadoop.hbase.procedure2.store.wal.TestWALProcedureStore)
  Run 1: TestWALProcedureStore.setUp:74 » Runtime hbase-default.xml file seems to be fo...
  Run 2: TestWALProcedureStore.tearDown:88 NullPointer

org.apache.hadoop.hbase.procedure2.store.wal.TestWALProcedureStore.testFileNotFoundDuringLeaseRecovery(org.apache.hadoop.hbase.procedure2.store.wal.TestWALProcedureStore)
  Run 1: TestWALProcedureStore.setUp:74 » Runtime hbase-default.xml file seems to be fo...
  Run 2: TestWALProcedureStore.tearDown:88 NullPointer

org.apache.hadoop.hbase.procedure2.store.wal.TestWALProcedureStore.testLoad(org.apache.hadoop.hbase.procedure2.store.wal.TestWALProcedureStore)
  Run 1: TestWALProcedureStore.setUp:74 » Runtime hbase-default.xml file seems to be fo...
  Run 2: TestWALProcedureStore.tearDown:88 NullPointer

org.apache.hadoop.hbase.procedure2.store.wal.TestWALProcedureStore.testNoTrailerDoubleRestart(org.apache.hadoop.hbase.procedure2.store.wal.TestWALProcedureStore)
  Run 1: TestWALProcedureStore.setUp:74 » Runtime hbase-default.xml file seems to be fo...
  Run 2: TestWALProcedureStore.tearDown:88 NullPointer

org.apache.hadoop.hbase.procedure2.store.wal.TestWALProcedureStore.testProcIdHoles(org.apache.hadoop.hbase.procedure2.store.wal.TestWALProcedureStore)
  Run 1: TestWALProcedureStore.setUp:74 » Runtime hbase-default.xml file seems to be fo...
  Run 2: TestWALProcedureStore.tearDown:88 NullPointer

org.apache.hadoop.hbase.procedure2.store.wal.TestWALProcedureStore.testRollAndRemove(org.apache.hadoop.hbase.procedure2.store.wal.TestWALProcedureStore)
  Run 1: TestWALProcedureStore.setUp:74 » Runtime hbase-default.xml file seems to be fo...
  Run 2: TestWALProcedureStore.tearDown:88 NullPointer

org.apache.hadoop.hbase.procedure2.store.wal.TestWALProcedureStore.testWalReplayOrder_ABC_BAD(org.apache.hadoop.hbase.procedure2.store.wal.TestWALProcedureStore)
  Run 1: TestWALProcedureStore.setUp:74 » Runtime hbase-default.xml file seems to be fo...
  Run 2: TestWALProcedureStore.tearDown:88 NullPointer

org.apache.hadoop.hbase.procedure2.store.wal.TestWALProcedureStore.testWalReplayOrder_AB_A(org.apache.hadoop.hbase.procedure2.store.wal.TestWALProcedureStore)
  Run 1: TestWALProcedureStore.setUp:74 » Runtime hbase-default.xml file seems to be fo...
  Run 2: TestWALProcedureStore.tearDown:88 NullPointer


Tests run: 43, Failures: 0, Errors: 34, Skipped: 0

[INFO] ------------------------------------------------------------------------
[INFO] Reactor Summary:
[INFO] 
[INFO] Apache HBase ...................................... SUCCESS [2.725s]
[INFO] Apache HBase - Checkstyle ......................... SUCCESS [0.761s]
[INFO] Apache HBase - Resource Bundle .................... SUCCESS [0.309s]
[INFO] Apache HBase - Annotations ........................ SUCCESS [0.269s]
[INFO] Apache HBase - Protocol ........................... SUCCESS [3.612s]
[INFO] Apache HBase - Common ............................. SUCCESS [1:14.264s]
[INFO] Apache HBase - Procedure .......................... FAILURE [1:08.631s]
[INFO] Apache HBase - Client ............................. SKIPPED
[INFO] Apache HBase - Hadoop Compatibility ............... SKIPPED
[INFO] Apache HBase - Hadoop Two Compatibility ........... SKIPPED
[INFO] Apache HBase - Prefix Tree ........................ SKIPPED
[INFO] Apache HBase - Server ............................. SKIPPED
[INFO] Apache HBase - Testing Util ....................... SKIPPED
[INFO] Apache HBase - Thrift ............................. SKIPPED
[INFO] Apache HBase - RSGroup ............................ SKIPPED
[INFO] Apache HBase - Shell .............................. SKIPPED
[INFO] Apache HBase - Integration Tests .................. SKIPPED
[INFO] Apache HBase - Examples ........................... SKIPPED
[INFO] Apache HBase - Rest ............................... SKIPPED
[INFO] Apache HBase - External Block Cache ............... SKIPPED
[INFO] Apache HBase - Spark .............................. SKIPPED
[INFO] Apache HBase - Assembly ........................... SKIPPED
[INFO] Apache HBase - Shaded ............................. SKIPPED
[INFO] Apache HBase - Shaded - Client .................... SKIPPED
[INFO] Apache HBase - Shaded - Server .................... SKIPPED
[INFO] Apache HBase - Archetypes ......................... SKIPPED
[INFO] Apache HBase - Exemplar for hbase-client archetype  SKIPPED
[INFO] Apache HBase - Exemplar for hbase-shaded-client archetype  SKIPPED
[INFO] Apache HBase - Archetype builder .................. SKIPPED
[INFO] ------------------------------------------------------------------------
[INFO] BUILD FAILURE
[INFO] ------------------------------------------------------------------------
[INFO] Total time: 2:32.483s
[INFO] Finished at: Thu Aug 11 13:44:22 UTC 2016
[INFO] Final Memory: 50M/1272M
[INFO] ------------------------------------------------------------------------
[ERROR] Failed to execute goal org.apache.maven.plugins:maven-surefire-plugin:2.18.1:test
(default-test) on project hbase-procedure: There are test failures.
[ERROR] 
[ERROR] Please refer to <https://builds.apache.org/job/HBase-Trunk_matrix/jdk=JDK%201.7%20(latest),label=yahoo-not-h2/ws/hbase-procedure/target/surefire-reports>
for the individual test results.
[ERROR] -> [Help 1]
[ERROR] 
[ERROR] To see the full stack trace of the errors, re-run Maven with the -e switch.
[ERROR] Re-run Maven using the -X switch to enable full debug logging.
[ERROR] 
[ERROR] For more information about the errors and possible solutions, please read the following
articles:
[ERROR] [Help 1] http://cwiki.apache.org/confluence/display/MAVEN/MojoFailureException
[ERROR] 
[ERROR] After correcting the problems, you can resume the build with the command
[ERROR]   mvn <goals> -rf :hbase-procedure
Build step 'Invoke top-level Maven targets' marked build as failure
Performing Post build task...
Match found for :.* : True
Logical operation result is TRUE
Running script  : # Run zombie detector script
./dev-support/zombie-detector.sh --jenkins ${BUILD_ID}
[yahoo-not-h2] $ /bin/bash -xe /tmp/hudson7971138455805412648.sh
+ ./dev-support/zombie-detector.sh --jenkins 1396
Thu Aug 11 13:44:23 UTC 2016 We're ok: there is no zombie test


    {color:green}+1 zombies{color}. No zombie tests found running at the end of the build.
POST BUILD TASK : SUCCESS
END OF POST BUILD TASK : 0
Archiving artifacts
No prior successful build to compare, so performing full copy of artifacts
Recording test results
[FINDBUGS] Skipping publisher since build result is FAILURE
[CHECKSTYLE] Skipping publisher since build result is FAILURE

Mime
View raw message