hbase-builds mailing list archives

Site index · List index
Message view « Date » · « Thread »
Top « Date » · « Thread »
From Apache Jenkins Server <jenk...@builds.apache.org>
Subject Build failed in Jenkins: HBase-1.2-IT » IntegrationTestBigLinkedList,JDK 1.8 (latest),yahoo-not-h2 #576
Date Wed, 10 Aug 2016 19:33:53 GMT
See <https://builds.apache.org/job/HBase-1.2-IT/it.test=IntegrationTestBigLinkedList,jdk=JDK%201.8%20(latest),label=yahoo-not-h2/576/changes>

Changes:

[appy] HBASE-14345 Consolidate printUsage in IntegrationTestLoadAndVerify (Reid

[esteban] HBASE-16379 [replication] Minor improvement to

------------------------------------------
[...truncated 2389 lines...]
     bool UseCompilerSafepoints                     = true                               
{product}
     bool UseCompressedClassPointers               := true                               
{lp64_product}
     bool UseCompressedOops                        := true                               
{lp64_product}
     bool UseConcMarkSweepGC                        = false                              
{product}
     bool UseCondCardMark                           = false                              
{C2 product}
     bool UseCountLeadingZerosInstruction           = false                              
{ARCH product}
     bool UseCountTrailingZerosInstruction          = false                              
{ARCH product}
     bool UseCountedLoopSafepoints                  = false                              
{C2 product}
     bool UseCounterDecay                           = true                               
{product}
     bool UseDivMod                                 = true                               
{C2 product}
     bool UseDynamicNumberOfGCThreads               = false                              
{product}
     bool UseFPUForSpilling                         = true                               
{C2 product}
     bool UseFastAccessorMethods                    = false                              
{product}
     bool UseFastEmptyMethods                       = false                              
{product}
     bool UseFastJNIAccessors                       = true                               
{product}
     bool UseFastStosb                              = false                              
{ARCH product}
     bool UseG1GC                                   = false                              
{product}
     bool UseGCLogFileRotation                      = false                              
{product}
     bool UseGCOverheadLimit                        = true                               
{product}
     bool UseGCTaskAffinity                         = false                              
{product}
     bool UseHeavyMonitors                          = false                              
{product}
     bool UseHugeTLBFS                              = false                              
{product}
     bool UseInlineCaches                           = true                               
{product}
     bool UseInterpreter                            = true                               
{product}
     bool UseJumpTables                             = true                               
{C2 product}
     bool UseLWPSynchronization                     = true                               
{product}
     bool UseLargePages                             = false                              
{pd product}
     bool UseLargePagesInMetaspace                  = false                              
{product}
     bool UseLargePagesIndividualAllocation         = false                              
{pd product}
     bool UseLinuxPosixThreadCPUClocks              = true                               
{product}
     bool UseLockedTracing                          = false                              
{product}
     bool UseLoopCounter                            = true                               
{product}
     bool UseLoopInvariantCodeMotion                = true                               
{C1 product}
     bool UseLoopPredicate                          = true                               
{C2 product}
     bool UseMathExactIntrinsics                    = true                               
{C2 product}
     bool UseMaximumCompactionOnSystemGC            = true                               
{product}
     bool UseMembar                                 = false                              
{pd product}
     bool UseMontgomeryMultiplyIntrinsic            = false                              
{C2 product}
     bool UseMontgomerySquareIntrinsic              = false                              
{C2 product}
     bool UseMulAddIntrinsic                        = false                              
{C2 product}
     bool UseMultiplyToLenIntrinsic                 = true                               
{C2 product}
     bool UseNUMA                                   = false                              
{product}
     bool UseNUMAInterleaving                       = false                              
{product}
     bool UseNewLongLShift                          = false                              
{ARCH product}
     bool UseOSErrorReporting                       = false                              
{pd product}
     bool UseOldInlining                            = true                               
{C2 product}
     bool UseOnStackReplacement                     = true                               
{pd product}
     bool UseOnlyInlinedBimorphic                   = true                               
{C2 product}
     bool UseOprofile                               = false                              
{product}
     bool UseOptoBiasInlining                       = true                               
{C2 product}
     bool UsePSAdaptiveSurvivorSizePolicy           = true                               
{product}
     bool UseParNewGC                               = false                              
{product}
     bool UseParallelGC                            := true                               
{product}
     bool UseParallelOldGC                          = true                               
{product}
     bool UsePerfData                               = true                               
{product}
     bool UsePopCountInstruction                    = true                               
{product}
     bool UseRDPCForConstantTableBase               = false                              
{C2 product}
     bool UseRTMDeopt                               = false                              
{ARCH product}
     bool UseRTMLocking                             = false                              
{ARCH product}
     bool UseSHA                                    = false                              
{product}
     bool UseSHA1Intrinsics                         = false                              
{product}
     bool UseSHA256Intrinsics                       = false                              
{product}
     bool UseSHA512Intrinsics                       = false                              
{product}
     bool UseSHM                                    = false                              
{product}
     intx UseSSE                                    = 4                                  
{product}
     bool UseSSE42Intrinsics                        = true                               
{product}
     bool UseSerialGC                               = false                              
{product}
     bool UseSharedSpaces                           = false                              
{product}
     bool UseSignalChaining                         = true                               
{product}
     bool UseSquareToLenIntrinsic                   = false                              
{C2 product}
     bool UseStoreImmI16                            = false                              
{ARCH product}
     bool UseStringDeduplication                    = false                              
{product}
     bool UseSuperWord                              = true                               
{C2 product}
     bool UseTLAB                                   = true                               
{pd product}
     bool UseThreadPriorities                       = true                               
{pd product}
     bool UseTransparentHugePages                   = false                              
{product}
     bool UseTypeProfile                            = true                               
{product}
     bool UseTypeSpeculation                        = true                               
{C2 product}
     bool UseUnalignedLoadStores                    = true                               
{ARCH product}
     bool UseVMInterruptibleIO                      = false                              
{product}
     bool UseXMMForArrayCopy                        = true                               
{product}
     bool UseXmmI2D                                 = false                              
{ARCH product}
     bool UseXmmI2F                                 = false                              
{ARCH product}
     bool UseXmmLoadAndClearUpper                   = true                               
{ARCH product}
     bool UseXmmRegToRegMoveAll                     = true                               
{ARCH product}
     bool VMThreadHintNoPreempt                     = false                              
{product}
     intx VMThreadPriority                          = -1                                 
{product}
     intx VMThreadStackSize                         = 1024                               
{pd product}
     intx ValueMapInitialSize                       = 11                                 
{C1 product}
     intx ValueMapMaxLoopSize                       = 8                                  
{C1 product}
     intx ValueSearchLimit                          = 1000                               
{C2 product}
     bool VerifyMergedCPBytecodes                   = true                               
{product}
     bool VerifySharedSpaces                        = false                              
{product}
     intx WorkAroundNPTLTimedWaitHang               = 1                                  
{product}
    uintx YoungGenerationSizeIncrement              = 20                                 
{product}
    uintx YoungGenerationSizeSupplement             = 80                                 
{product}
    uintx YoungGenerationSizeSupplementDecay        = 8                                  
{product}
    uintx YoungPLABSize                             = 4096                               
{product}
     bool ZeroTLAB                                  = false                              
{product}
     intx hashCode                                  = 5                                  
{product}
Running org.apache.hadoop.hbase.test.IntegrationTestBigLinkedList
SUREFIRE-859: [GC (Allocation Failure)  193536K->67720K(741888K), 0.1171940 secs]
SUREFIRE-859: [GC (Metadata GC Threshold)  106249K->43130K(935424K), 0.0198637 secs]
SUREFIRE-859: [Full GC (Metadata GC Threshold)  43130K->7885K(719872K), 0.0519448 secs]
SUREFIRE-859: [GC (Allocation Failure)  394957K->106345K(719872K), 0.1480973 secs]
SUREFIRE-859: [GC (Metadata GC Threshold)  111506K->106634K(1008128K), 0.0365686 secs]
SUREFIRE-859: [Full GC (Metadata GC Threshold)  106634K->94746K(1174016K), 0.0873508 secs]
SUREFIRE-859: [GC (Metadata GC Threshold)  733424K->141837K(1174016K), 0.0670990 secs]
SUREFIRE-859: [Full GC (Metadata GC Threshold)  141837K->137497K(1248256K), 0.2278033 secs]
SUREFIRE-859: [GC (Allocation Failure)  812825K->167684K(1775616K), 0.0414442 secs]
Tests run: 1, Failures: 0, Errors: 1, Skipped: 0, Time elapsed: 272.171 sec <<< FAILURE!
- in org.apache.hadoop.hbase.test.IntegrationTestBigLinkedList
testContinuousIngest(org.apache.hadoop.hbase.test.IntegrationTestBigLinkedList)  Time elapsed:
272.062 sec  <<< ERROR!
java.lang.RuntimeException: Generator failed with return code: 1
	at org.apache.hadoop.hbase.test.IntegrationTestBigLinkedList$Loop.runGenerator(IntegrationTestBigLinkedList.java:1247)
	at org.apache.hadoop.hbase.test.IntegrationTestBigLinkedList$Loop.run(IntegrationTestBigLinkedList.java:1295)
	at org.apache.hadoop.util.ToolRunner.run(ToolRunner.java:70)
	at org.apache.hadoop.hbase.test.IntegrationTestBigLinkedList.testContinuousIngest(IntegrationTestBigLinkedList.java:1578)


Results :

Tests in error: 
  IntegrationTestBigLinkedList.testContinuousIngest:1578 » Runtime Generator fai...

Tests run: 1, Failures: 0, Errors: 1, Skipped: 0

[WARNING] File encoding has not been set, using platform encoding ISO-8859-1, i.e. build is
platform dependent! The file encoding for reports output files should be provided by the POM
property ${project.reporting.outputEncoding}.
[INFO] 
[INFO] --- maven-failsafe-plugin:2.18.1:verify (verify) @ hbase-it ---
[INFO] Failsafe report directory: <https://builds.apache.org/job/HBase-1.2-IT/it.test=IntegrationTestBigLinkedList,jdk=JDK%201.8%20(latest),label=yahoo-not-h2/ws/hbase-it/target/failsafe-reports>
[WARNING] File encoding has not been set, using platform encoding ISO-8859-1, i.e. build is
platform dependent! The file encoding for reports output files should be provided by the POM
property ${project.reporting.outputEncoding}.
[INFO] ------------------------------------------------------------------------
[INFO] Reactor Summary:
[INFO] 
[INFO] Apache HBase ...................................... SUCCESS [2.433s]
[INFO] Apache HBase - Checkstyle ......................... SUCCESS [0.913s]
[INFO] Apache HBase - Resource Bundle .................... SUCCESS [0.257s]
[INFO] Apache HBase - Annotations ........................ SUCCESS [1.102s]
[INFO] Apache HBase - Protocol ........................... SUCCESS [15.260s]
[INFO] Apache HBase - Common ............................. SUCCESS [7.790s]
[INFO] Apache HBase - Procedure .......................... SUCCESS [1.482s]
[INFO] Apache HBase - Client ............................. SUCCESS [5.699s]
[INFO] Apache HBase - Hadoop Compatibility ............... SUCCESS [0.304s]
[INFO] Apache HBase - Hadoop Two Compatibility ........... SUCCESS [1.181s]
[INFO] Apache HBase - Prefix Tree ........................ SUCCESS [1.447s]
[INFO] Apache HBase - Server ............................. SUCCESS [37.194s]
[INFO] Apache HBase - Testing Util ....................... SUCCESS [1.234s]
[INFO] Apache HBase - Thrift ............................. SUCCESS [6.971s]
[INFO] Apache HBase - Rest ............................... SUCCESS [3.134s]
[INFO] Apache HBase - Shell .............................. SUCCESS [1.079s]
[INFO] Apache HBase - Integration Tests .................. FAILURE [4:35.382s]
[INFO] Apache HBase - Examples ........................... SKIPPED
[INFO] Apache HBase - External Block Cache ............... SKIPPED
[INFO] Apache HBase - Assembly ........................... SKIPPED
[INFO] Apache HBase - Shaded ............................. SKIPPED
[INFO] Apache HBase - Shaded - Client .................... SKIPPED
[INFO] Apache HBase - Shaded - Server .................... SKIPPED
[INFO] ------------------------------------------------------------------------
[INFO] BUILD FAILURE
[INFO] ------------------------------------------------------------------------
[INFO] Total time: 6:04.135s
[INFO] Finished at: Wed Aug 10 19:33:47 UTC 2016
[INFO] Final Memory: 191M/3232M
[INFO] ------------------------------------------------------------------------
[ERROR] Failed to execute goal org.apache.maven.plugins:maven-failsafe-plugin:2.18.1:verify
(verify) on project hbase-it: There are test failures.
[ERROR] 
[ERROR] Please refer to <https://builds.apache.org/job/HBase-1.2-IT/it.test=IntegrationTestBigLinkedList,jdk=JDK%201.8%20(latest),label=yahoo-not-h2/ws/hbase-it/target/failsafe-reports>
for the individual test results.
[ERROR] -> [Help 1]
[ERROR] 
[ERROR] To see the full stack trace of the errors, re-run Maven with the -e switch.
[ERROR] Re-run Maven using the -X switch to enable full debug logging.
[ERROR] 
[ERROR] For more information about the errors and possible solutions, please read the following
articles:
[ERROR] [Help 1] http://cwiki.apache.org/confluence/display/MAVEN/MojoFailureException
[ERROR] 
[ERROR] After correcting the problems, you can resume the build with the command
[ERROR]   mvn <goals> -rf :hbase-it
Build step 'Invoke top-level Maven targets' marked build as failure
Performing Post build task...
Match found for :.* : True
Logical operation result is TRUE
Running script  : # Post-build task script. TODO: Check this in and have all builds reference
check-in.
pwd && ls
# NOTE!!!! The below code has been copied and pasted from ./dev-tools/run-test.sh
# Do not change here without syncing there and vice-versa.
ZOMBIE_TESTS_COUNT=`jps -v | grep surefirebooter | grep -e '-Dhbase.test' | wc -l`
if [[ $ZOMBIE_TESTS_COUNT != 0 ]] ; then
 echo "Suspicious java process found - waiting 30s to see if there are just slow to stop"
 sleep 30
 ZOMBIE_TESTS_COUNT=`jps -v | grep surefirebooter | grep -e '-Dhbase.test' | wc -l`
 if [[ $ZOMBIE_TESTS_COUNT != 0 ]] ; then
   echo " {color:red}There appear to be $ZOMBIE_TESTS_COUNT zombie tests{color}, they should
have been killed by surefire but survived"
   jps -v | grep surefirebooter | grep -e '-Dhbase.test'
   jps -v | grep surefirebooter | grep -e '-Dhbase.test' | cut -d ' ' -f 1 | xargs -n 1 jstack
   # Exit with error
   exit 1
 else
   echo "We're ok: there is no zombie test, but some tests took some time to stop"
 fi
else
  echo "We're ok: there is no zombie test"
fi
[yahoo-not-h2] $ /bin/bash -xe /tmp/hudson3963870243072113006.sh
+ pwd
<https://builds.apache.org/job/HBase-1.2-IT/it.test=IntegrationTestBigLinkedList,jdk=JDK%201.8%20(latest),label=yahoo-not-h2/ws/>
+ ls
bin
CHANGES.txt
conf
dev-support
hbase-annotations
hbase-assembly
hbase-checkstyle
hbase-client
hbase-common
hbase-examples
hbase-external-blockcache
hbase-hadoop2-compat
hbase-hadoop-compat
hbase-it
hbase-native-client
hbase-prefix-tree
hbase-procedure
hbase-protocol
hbase-resource-bundle
hbase-rest
hbase-server
hbase-shaded
hbase-shell
hbase-testing-util
hbase-thrift
LICENSE.txt
NOTICE.txt
pom.xml
README.txt
src
target
++ jps -v
++ grep surefirebooter
++ grep -e -Dhbase.test
++ wc -l
+ ZOMBIE_TESTS_COUNT=0
+ [[ 0 != 0 ]]
+ echo 'We'\''re ok: there is no zombie test'
We're ok: there is no zombie test
POST BUILD TASK : SUCCESS
END OF POST BUILD TASK : 0
Archiving artifacts
No prior successful build to compare, so performing full copy of artifacts

Mime
View raw message