hbase-builds mailing list archives

Site index · List index
Message view « Date » · « Thread »
Top « Date » · « Thread »
From Apache Jenkins Server <jenk...@builds.apache.org>
Subject Build failed in Jenkins: HBase-1.3-IT » IntegrationTestImportTsv,JDK 1.7 (latest),yahoo-not-h2 #800
Date Wed, 24 Aug 2016 14:52:21 GMT
See <https://builds.apache.org/job/HBase-1.3-IT/it.test=IntegrationTestImportTsv,jdk=JDK%201.7%20(latest),label=yahoo-not-h2/800/changes>

Changes:

[enis] HBASE-16376 Scan#setBatch(int) javadoc update WRT partial results

[ashishsinghi] HBASE-16471 Region Server metrics context will be wrong when machine

[enis] HBASE-16270 Handle duplicate clearing of snapshot in region replicas

------------------------------------------
[...truncated 50152 lines...]
     bool UseAdaptiveSizePolicyWithSystemGC         = false           {product}          

     bool UseAddressNop                             = true            {ARCH product}     

     bool UseAltSigs                                = false           {product}          

     bool UseAutoGCSelectPolicy                     = false           {product}          

     bool UseBiasedLocking                          = true            {product}          

     bool UseBimorphicInlining                      = true            {C2 product}       

     bool UseBoundThreads                           = true            {product}          

     bool UseCMSBestFit                             = true            {product}          

     bool UseCMSCollectionPassing                   = true            {product}          

     bool UseCMSCompactAtFullCollection             = true            {product}          

     bool UseCMSInitiatingOccupancyOnly             = false           {product}          

     bool UseCodeCacheFlushing                      = true            {product}          

     bool UseCompiler                               = true            {product}          

     bool UseCompilerSafepoints                     = true            {product}          

     bool UseCompressedOops                        := true            {lp64_product}     

     bool UseConcMarkSweepGC                        = false           {product}          

     bool UseCondCardMark                           = false           {C2 product}       

     bool UseCountLeadingZerosInstruction           = false           {ARCH product}     

     bool UseCounterDecay                           = true            {product}          

     bool UseDivMod                                 = true            {C2 product}       

     bool UseDynamicNumberOfGCThreads               = false           {product}          

     bool UseFPUForSpilling                         = false           {C2 product}       

     bool UseFastAccessorMethods                    = false           {product}          

     bool UseFastEmptyMethods                       = false           {product}          

     bool UseFastJNIAccessors                       = true            {product}          

     bool UseFastStosb                              = false           {ARCH product}     

     bool UseG1GC                                   = false           {product}          

     bool UseGCLogFileRotation                      = false           {product}          

     bool UseGCOverheadLimit                        = true            {product}          

     bool UseGCTaskAffinity                         = false           {product}          

     bool UseHeavyMonitors                          = false           {product}          

     bool UseHugeTLBFS                              = false           {product}          

     bool UseInlineCaches                           = true            {product}          

     bool UseInterpreter                            = true            {product}          

     bool UseJumpTables                             = true            {C2 product}       

     bool UseLWPSynchronization                     = true            {product}          

     bool UseLargePages                             = false           {pd product}       

     bool UseLargePagesIndividualAllocation         = false           {pd product}       

     bool UseLinuxPosixThreadCPUClocks              = true            {product}          

     bool UseLockedTracing                          = false           {product}          

     bool UseLoopCounter                            = true            {product}          

     bool UseLoopPredicate                          = true            {C2 product}       

     bool UseMaximumCompactionOnSystemGC            = true            {product}          

     bool UseMembar                                 = false           {pd product}       

     bool UseNUMA                                   = false           {product}          

     bool UseNUMAInterleaving                       = false           {product}          

     bool UseNewLongLShift                          = false           {ARCH product}     

     bool UseOSErrorReporting                       = false           {pd product}       

     bool UseOldInlining                            = true            {C2 product}       

     bool UseOnStackReplacement                     = true            {pd product}       

     bool UseOnlyInlinedBimorphic                   = true            {C2 product}       

     bool UseOprofile                               = false           {product}          

     bool UseOptoBiasInlining                       = true            {C2 product}       

     bool UsePPCLWSYNC                              = true            {product}          

     bool UsePSAdaptiveSurvivorSizePolicy           = true            {product}          

     bool UseParNewGC                               = false           {product}          

     bool UseParallelGC                            := true            {product}          

     bool UseParallelOldGC                          = true            {product}          

     bool UsePerfData                               = true            {product}          

     bool UsePopCountInstruction                    = true            {product}          

     bool UseRDPCForConstantTableBase               = false           {C2 product}       

     bool UseSHM                                    = false           {product}          

     intx UseSSE                                    = 4               {product}          

     bool UseSSE42Intrinsics                        = true            {product}          

     bool UseSerialGC                               = false           {product}          

     bool UseSharedSpaces                           = false           {product}          

     bool UseSignalChaining                         = true            {product}          

     bool UseSplitVerifier                          = true            {product}          

     bool UseStoreImmI16                            = false           {ARCH product}     

     bool UseStringCache                            = false           {product}          

     bool UseSuperWord                              = true            {C2 product}       

     bool UseTLAB                                   = true            {pd product}       

     bool UseThreadPriorities                       = true            {pd product}       

     bool UseTransparentHugePages                   = false           {product}          

     bool UseTypeProfile                            = true            {product}          

     bool UseUnalignedLoadStores                    = true            {ARCH product}     

     bool UseVMInterruptibleIO                      = false           {product}          

     bool UseVectoredExceptions                     = false           {pd product}       

     bool UseXMMForArrayCopy                        = true            {product}          

     bool UseXmmI2D                                 = false           {ARCH product}     

     bool UseXmmI2F                                 = false           {ARCH product}     

     bool UseXmmLoadAndClearUpper                   = true            {ARCH product}     

     bool UseXmmRegToRegMoveAll                     = true            {ARCH product}     

     bool VMThreadHintNoPreempt                     = false           {product}          

     intx VMThreadPriority                          = -1              {product}          

     intx VMThreadStackSize                         = 1024            {pd product}       

     intx ValueMapInitialSize                       = 11              {C1 product}       

     intx ValueMapMaxLoopSize                       = 8               {C1 product}       

     intx ValueSearchLimit                          = 1000            {C2 product}       

     bool VerifyMergedCPBytecodes                   = true            {product}          

     intx WorkAroundNPTLTimedWaitHang               = 1               {product}          

    uintx YoungGenerationSizeIncrement              = 20              {product}          

    uintx YoungGenerationSizeSupplement             = 80              {product}          

    uintx YoungGenerationSizeSupplementDecay        = 8               {product}          

    uintx YoungPLABSize                             = 4096            {product}          

     bool ZeroTLAB                                  = false           {product}          

     intx hashCode                                  = 0               {product}          

Running org.apache.hadoop.hbase.mapreduce.IntegrationTestImportTsv
SUREFIRE-859: [GC 194048K->14097K(740864K), 0.0373030 secs]
SUREFIRE-859: [GC 208145K->71035K(934912K), 0.1979280 secs]
SUREFIRE-859: [GC 459131K->120482K(934912K), 0.1477700 secs]
SUREFIRE-859: [GC 508576K->147285K(1323008K), 0.0859680 secs]
Tests run: 1, Failures: 1, Errors: 0, Skipped: 0, Time elapsed: 75.294 sec <<< FAILURE!
- in org.apache.hadoop.hbase.mapreduce.IntegrationTestImportTsv
testGenerateAndLoad(org.apache.hadoop.hbase.mapreduce.IntegrationTestImportTsv)  Time elapsed:
13.498 sec  <<< FAILURE!
java.lang.AssertionError: expected:<0> but was:<1>
	at org.junit.Assert.fail(Assert.java:88)
	at org.junit.Assert.failNotEquals(Assert.java:834)
	at org.junit.Assert.assertEquals(Assert.java:645)
	at org.junit.Assert.assertEquals(Assert.java:631)
	at org.apache.hadoop.hbase.mapreduce.TestImportTsv.doMROnTableTest(TestImportTsv.java:440)
	at org.apache.hadoop.hbase.mapreduce.TestImportTsv.doMROnTableTest(TestImportTsv.java:393)
	at org.apache.hadoop.hbase.mapreduce.IntegrationTestImportTsv.testGenerateAndLoad(IntegrationTestImportTsv.java:203)


Results :

Failed tests: 
  IntegrationTestImportTsv.testGenerateAndLoad:203 expected:<0> but was:<1>

Tests run: 1, Failures: 1, Errors: 0, Skipped: 0

[WARNING] File encoding has not been set, using platform encoding ISO-8859-1, i.e. build is
platform dependent! The file encoding for reports output files should be provided by the POM
property ${project.reporting.outputEncoding}.
[INFO] 
[INFO] --- maven-failsafe-plugin:2.18.1:verify (verify) @ hbase-it ---
[INFO] Failsafe report directory: <https://builds.apache.org/job/HBase-1.3-IT/it.test=IntegrationTestImportTsv,jdk=JDK%201.7%20(latest),label=yahoo-not-h2/ws/hbase-it/target/failsafe-reports>
[WARNING] File encoding has not been set, using platform encoding ISO-8859-1, i.e. build is
platform dependent! The file encoding for reports output files should be provided by the POM
property ${project.reporting.outputEncoding}.
[INFO] ------------------------------------------------------------------------
[INFO] Reactor Summary:
[INFO] 
[INFO] Apache HBase ...................................... SUCCESS [2:07.742s]
[INFO] Apache HBase - Checkstyle ......................... SUCCESS [9.412s]
[INFO] Apache HBase - Resource Bundle .................... SUCCESS [0.378s]
[INFO] Apache HBase - Annotations ........................ SUCCESS [1.380s]
[INFO] Apache HBase - Protocol ........................... SUCCESS [23.534s]
[INFO] Apache HBase - Common ............................. SUCCESS [1:26.954s]
[INFO] Apache HBase - Procedure .......................... SUCCESS [1.827s]
[INFO] Apache HBase - Client ............................. SUCCESS [13.582s]
[INFO] Apache HBase - Hadoop Compatibility ............... SUCCESS [3.009s]
[INFO] Apache HBase - Hadoop Two Compatibility ........... SUCCESS [4.667s]
[INFO] Apache HBase - Prefix Tree ........................ SUCCESS [1.681s]
[INFO] Apache HBase - Server ............................. SUCCESS [1:44.879s]
[INFO] Apache HBase - Testing Util ....................... SUCCESS [2.675s]
[INFO] Apache HBase - Thrift ............................. SUCCESS [11.373s]
[INFO] Apache HBase - Rest ............................... SUCCESS [3.606s]
[INFO] Apache HBase - Shell .............................. SUCCESS [11.457s]
[INFO] Apache HBase - Integration Tests .................. FAILURE [1:20.959s]
[INFO] Apache HBase - Examples ........................... SKIPPED
[INFO] Apache HBase - External Block Cache ............... SKIPPED
[INFO] Apache HBase - Assembly ........................... SKIPPED
[INFO] Apache HBase - Shaded ............................. SKIPPED
[INFO] Apache HBase - Shaded - Client .................... SKIPPED
[INFO] Apache HBase - Shaded - Server .................... SKIPPED
[INFO] Apache HBase - Archetypes ......................... SKIPPED
[INFO] Apache HBase - Exemplar for hbase-client archetype  SKIPPED
[INFO] Apache HBase - Exemplar for hbase-shaded-client archetype  SKIPPED
[INFO] Apache HBase - Archetype builder .................. SKIPPED
[INFO] ------------------------------------------------------------------------
[INFO] BUILD FAILURE
[INFO] ------------------------------------------------------------------------
[INFO] Total time: 8:50.306s
[INFO] Finished at: Wed Aug 24 14:51:23 UTC 2016
[INFO] Final Memory: 141M/1168M
[INFO] ------------------------------------------------------------------------
[ERROR] Failed to execute goal org.apache.maven.plugins:maven-failsafe-plugin:2.18.1:verify
(verify) on project hbase-it: There are test failures.
[ERROR] 
[ERROR] Please refer to <https://builds.apache.org/job/HBase-1.3-IT/it.test=IntegrationTestImportTsv,jdk=JDK%201.7%20(latest),label=yahoo-not-h2/ws/hbase-it/target/failsafe-reports>
for the individual test results.
[ERROR] -> [Help 1]
[ERROR] 
[ERROR] To see the full stack trace of the errors, re-run Maven with the -e switch.
[ERROR] Re-run Maven using the -X switch to enable full debug logging.
[ERROR] 
[ERROR] For more information about the errors and possible solutions, please read the following
articles:
[ERROR] [Help 1] http://cwiki.apache.org/confluence/display/MAVEN/MojoFailureException
[ERROR] 
[ERROR] After correcting the problems, you can resume the build with the command
[ERROR]   mvn <goals> -rf :hbase-it
Build step 'Invoke top-level Maven targets' marked build as failure
Performing Post build task...
Match found for :.* : True
Logical operation result is TRUE
Running script  : # Post-build task script. TODO: Check this in and have all builds reference
check-in.
pwd && ls
# NOTE!!!! The below code has been copied and pasted from ./dev-tools/run-test.sh
# Do not change here without syncing there and vice-versa.
ZOMBIE_TESTS_COUNT=`jps -v | grep surefirebooter | grep -e '-Dhbase.test' | wc -l`
if [[ $ZOMBIE_TESTS_COUNT != 0 ]] ; then
 echo "Suspicious java process found - waiting 30s to see if there are just slow to stop"
 sleep 30
 ZOMBIE_TESTS_COUNT=`jps -v | grep surefirebooter | grep -e '-Dhbase.test' | wc -l`
 if [[ $ZOMBIE_TESTS_COUNT != 0 ]] ; then
   echo " {color:red}There appear to be $ZOMBIE_TESTS_COUNT zombie tests{color}, they should
have been killed by surefire but survived"
   jps -v | grep surefirebooter | grep -e '-Dhbase.test'
   jps -v | grep surefirebooter | grep -e '-Dhbase.test' | cut -d ' ' -f 1 | xargs -n 1 jstack
   # Exit with error
   exit 1
 else
   echo "We're ok: there is no zombie test, but some tests took some time to stop"
 fi
else
  echo "We're ok: there is no zombie test"
fi
[yahoo-not-h2] $ /bin/bash -xe /tmp/hudson2114777463101598934.sh
+ pwd
<https://builds.apache.org/job/HBase-1.3-IT/it.test=IntegrationTestImportTsv,jdk=JDK%201.7%20(latest),label=yahoo-not-h2/ws/>
+ ls
bin
CHANGES.txt
conf
dev-support
hbase-annotations
hbase-archetypes
hbase-assembly
hbase-checkstyle
hbase-client
hbase-common
hbase-examples
hbase-external-blockcache
hbase-hadoop2-compat
hbase-hadoop-compat
hbase-it
hbase-native-client
hbase-prefix-tree
hbase-procedure
hbase-protocol
hbase-resource-bundle
hbase-rest
hbase-server
hbase-shaded
hbase-shell
hbase-testing-util
hbase-thrift
LICENSE.txt
NOTICE.txt
pom.xml
README.txt
src
target
++ jps -v
++ grep surefirebooter
++ grep -e -Dhbase.test
++ wc -l
+ ZOMBIE_TESTS_COUNT=0
+ [[ 0 != 0 ]]
+ echo 'We'\''re ok: there is no zombie test'
We're ok: there is no zombie test
POST BUILD TASK : SUCCESS
END OF POST BUILD TASK : 0
Archiving artifacts
No prior successful build to compare, so performing full copy of artifacts

Mime
View raw message