hbase-builds mailing list archives

Site index · List index
Message view « Date » · « Thread »
Top « Date » · « Thread »
From Apache Jenkins Server <jenk...@builds.apache.org>
Subject Build failed in Jenkins: HBase-Trunk_matrix » JDK 1.8 (latest),yahoo-not-h2 #1387
Date Wed, 10 Aug 2016 02:18:37 GMT
See <https://builds.apache.org/job/HBase-Trunk_matrix/jdk=JDK%201.8%20(latest),label=yahoo-not-h2/1387/>

------------------------------------------
[...truncated 6165 lines...]
Java HotSpot(TM) 64-Bit Server VM warning: ignoring option MaxPermSize=256m; support was removed
in 8.0
Running org.apache.hadoop.hbase.util.TestBoundedPriorityBlockingQueue
Tests run: 7, Failures: 0, Errors: 0, Skipped: 0, Time elapsed: 2.026 sec - in org.apache.hadoop.hbase.util.TestBoundedPriorityBlockingQueue
Java HotSpot(TM) 64-Bit Server VM warning: ignoring option MaxPermSize=256m; support was removed
in 8.0
Running org.apache.hadoop.hbase.util.TestIncrementingEnvironmentEdge
Tests run: 1, Failures: 0, Errors: 0, Skipped: 0, Time elapsed: 0.497 sec - in org.apache.hadoop.hbase.util.TestIncrementingEnvironmentEdge
Java HotSpot(TM) 64-Bit Server VM warning: ignoring option MaxPermSize=256m; support was removed
in 8.0
Running org.apache.hadoop.hbase.util.TestEncryptionTest
Tests run: 3, Failures: 0, Errors: 0, Skipped: 0, Time elapsed: 2.002 sec - in org.apache.hadoop.hbase.util.TestEncryptionTest
Java HotSpot(TM) 64-Bit Server VM warning: ignoring option MaxPermSize=256m; support was removed
in 8.0
Running org.apache.hadoop.hbase.util.TestRootPath
Tests run: 1, Failures: 0, Errors: 0, Skipped: 0, Time elapsed: 0.321 sec - in org.apache.hadoop.hbase.util.TestRootPath
Java HotSpot(TM) 64-Bit Server VM warning: ignoring option MaxPermSize=256m; support was removed
in 8.0
Running org.apache.hadoop.hbase.util.TestPoolMap$TestRoundRobinPoolType
Tests run: 3, Failures: 0, Errors: 0, Skipped: 0, Time elapsed: 0.638 sec - in org.apache.hadoop.hbase.util.TestPoolMap$TestRoundRobinPoolType
Java HotSpot(TM) 64-Bit Server VM warning: ignoring option MaxPermSize=256m; support was removed
in 8.0
Running org.apache.hadoop.hbase.util.TestPoolMap$TestRoundRobinPoolType
Tests run: 3, Failures: 0, Errors: 0, Skipped: 0, Time elapsed: 0.805 sec - in org.apache.hadoop.hbase.util.TestPoolMap$TestRoundRobinPoolType
Running org.apache.hadoop.hbase.util.TestPoolMap$TestThreadLocalPoolType
Tests run: 3, Failures: 0, Errors: 0, Skipped: 0, Time elapsed: 0.289 sec - in org.apache.hadoop.hbase.util.TestPoolMap$TestThreadLocalPoolType
Running org.apache.hadoop.hbase.util.TestPoolMap$TestReusablePoolType
Tests run: 3, Failures: 0, Errors: 0, Skipped: 0, Time elapsed: 0.38 sec - in org.apache.hadoop.hbase.util.TestPoolMap$TestReusablePoolType
Java HotSpot(TM) 64-Bit Server VM warning: ignoring option MaxPermSize=256m; support was removed
in 8.0
Running org.apache.hadoop.hbase.util.TestPoolMap$TestThreadLocalPoolType
Tests run: 3, Failures: 0, Errors: 0, Skipped: 0, Time elapsed: 0.503 sec - in org.apache.hadoop.hbase.util.TestPoolMap$TestThreadLocalPoolType
Java HotSpot(TM) 64-Bit Server VM warning: ignoring option MaxPermSize=256m; support was removed
in 8.0
Java HotSpot(TM) 64-Bit Server VM warning: ignoring option MaxPermSize=256m; support was removed
in 8.0
Running org.apache.hadoop.hbase.util.TestByteBuffUtils
Tests run: 1, Failures: 0, Errors: 0, Skipped: 0, Time elapsed: 0.504 sec - in org.apache.hadoop.hbase.util.TestByteBuffUtils
Java HotSpot(TM) 64-Bit Server VM warning: ignoring option MaxPermSize=256m; support was removed
in 8.0
Java HotSpot(TM) 64-Bit Server VM warning: ignoring option MaxPermSize=256m; support was removed
in 8.0
Running org.apache.hadoop.hbase.util.TestRegionSplitCalculator
Tests run: 15, Failures: 0, Errors: 0, Skipped: 0, Time elapsed: 1.5 sec - in org.apache.hadoop.hbase.util.TestRegionSplitCalculator
Java HotSpot(TM) 64-Bit Server VM warning: ignoring option MaxPermSize=256m; support was removed
in 8.0
Running org.apache.hadoop.hbase.util.TestBloomFilterChunk
Tests run: 5, Failures: 0, Errors: 0, Skipped: 0, Time elapsed: 2.272 sec - in org.apache.hadoop.hbase.util.TestBloomFilterChunk
Java HotSpot(TM) 64-Bit Server VM warning: ignoring option MaxPermSize=256m; support was removed
in 8.0
Java HotSpot(TM) 64-Bit Server VM warning: ignoring option MaxPermSize=256m; support was removed
in 8.0
Running org.apache.hadoop.hbase.util.TestByteBufferUtils
Tests run: 16, Failures: 0, Errors: 0, Skipped: 0, Time elapsed: 1.841 sec - in org.apache.hadoop.hbase.util.TestByteBufferUtils
Java HotSpot(TM) 64-Bit Server VM warning: ignoring option MaxPermSize=256m; support was removed
in 8.0
Running org.apache.hadoop.hbase.util.TestConfigurationUtil
Tests run: 2, Failures: 0, Errors: 0, Skipped: 0, Time elapsed: 1.002 sec - in org.apache.hadoop.hbase.util.TestConfigurationUtil
Java HotSpot(TM) 64-Bit Server VM warning: ignoring option MaxPermSize=256m; support was removed
in 8.0
Running org.apache.hadoop.hbase.util.TestSortedCopyOnWriteSet
Tests run: 2, Failures: 0, Errors: 0, Skipped: 0, Time elapsed: 0.649 sec - in org.apache.hadoop.hbase.util.TestSortedCopyOnWriteSet
Java HotSpot(TM) 64-Bit Server VM warning: ignoring option MaxPermSize=256m; support was removed
in 8.0
Running org.apache.hadoop.hbase.util.TestStealJobQueue
Tests run: 7, Failures: 0, Errors: 0, Skipped: 0, Time elapsed: 1.172 sec - in org.apache.hadoop.hbase.util.TestStealJobQueue
Java HotSpot(TM) 64-Bit Server VM warning: ignoring option MaxPermSize=256m; support was removed
in 8.0
Running org.apache.hadoop.hbase.util.TestHFileArchiveUtil
Tests run: 4, Failures: 0, Errors: 0, Skipped: 0, Time elapsed: 2.212 sec - in org.apache.hadoop.hbase.util.TestHFileArchiveUtil
Java HotSpot(TM) 64-Bit Server VM warning: ignoring option MaxPermSize=256m; support was removed
in 8.0
Running org.apache.hadoop.hbase.util.TestRegionSizeCalculator
Tests run: 3, Failures: 0, Errors: 0, Skipped: 0, Time elapsed: 1.599 sec - in org.apache.hadoop.hbase.util.TestRegionSizeCalculator
Java HotSpot(TM) 64-Bit Server VM warning: ignoring option MaxPermSize=256m; support was removed
in 8.0
Java HotSpot(TM) 64-Bit Server VM warning: ignoring option MaxPermSize=256m; support was removed
in 8.0
Running org.apache.hadoop.hbase.util.TestHBaseFsckComparator
Tests run: 6, Failures: 0, Errors: 0, Skipped: 0, Time elapsed: 0.7 sec - in org.apache.hadoop.hbase.util.TestHBaseFsckComparator
Java HotSpot(TM) 64-Bit Server VM warning: ignoring option MaxPermSize=256m; support was removed
in 8.0
Java HotSpot(TM) 64-Bit Server VM warning: ignoring option MaxPermSize=256m; support was removed
in 8.0
Running org.apache.hadoop.hbase.util.TestCompressionTest
Tests run: 2, Failures: 0, Errors: 0, Skipped: 0, Time elapsed: 1.057 sec - in org.apache.hadoop.hbase.util.TestCompressionTest
Java HotSpot(TM) 64-Bit Server VM warning: ignoring option MaxPermSize=256m; support was removed
in 8.0
Running org.apache.hadoop.hbase.TestCompare
Tests run: 1, Failures: 0, Errors: 0, Skipped: 0, Time elapsed: 1.272 sec - in org.apache.hadoop.hbase.TestCompare
Java HotSpot(TM) 64-Bit Server VM warning: ignoring option MaxPermSize=256m; support was removed
in 8.0
Java HotSpot(TM) 64-Bit Server VM warning: ignoring option MaxPermSize=256m; support was removed
in 8.0
Running org.apache.hadoop.hbase.executor.TestExecutorService
Tests run: 2, Failures: 0, Errors: 0, Skipped: 0, Time elapsed: 3.668 sec - in org.apache.hadoop.hbase.executor.TestExecutorService
Java HotSpot(TM) 64-Bit Server VM warning: ignoring option MaxPermSize=256m; support was removed
in 8.0
Running org.apache.hadoop.hbase.client.TestPutDeleteEtcCellIteration
Tests run: 6, Failures: 0, Errors: 0, Skipped: 0, Time elapsed: 0.722 sec - in org.apache.hadoop.hbase.client.TestPutDeleteEtcCellIteration
Java HotSpot(TM) 64-Bit Server VM warning: ignoring option MaxPermSize=256m; support was removed
in 8.0
Running org.apache.hadoop.hbase.client.TestHBaseAdminNoCluster
Tests run: 2, Failures: 0, Errors: 0, Skipped: 1, Time elapsed: 7.978 sec - in org.apache.hadoop.hbase.client.TestHBaseAdminNoCluster
Java HotSpot(TM) 64-Bit Server VM warning: ignoring option MaxPermSize=256m; support was removed
in 8.0
Running org.apache.hadoop.hbase.client.TestIntraRowPagination
Tests run: 1, Failures: 0, Errors: 0, Skipped: 0, Time elapsed: 3.538 sec - in org.apache.hadoop.hbase.client.TestIntraRowPagination
Java HotSpot(TM) 64-Bit Server VM warning: ignoring option MaxPermSize=256m; support was removed
in 8.0
Running org.apache.hadoop.hbase.client.TestConnectionUtils
Tests run: 3, Failures: 0, Errors: 0, Skipped: 0, Time elapsed: 0.679 sec - in org.apache.hadoop.hbase.client.TestConnectionUtils
Java HotSpot(TM) 64-Bit Server VM warning: ignoring option MaxPermSize=256m; support was removed
in 8.0
Java HotSpot(TM) 64-Bit Server VM warning: ignoring option MaxPermSize=256m; support was removed
in 8.0
Running org.apache.hadoop.hbase.client.TestResult
Tests run: 9, Failures: 0, Errors: 0, Skipped: 0, Time elapsed: 1.222 sec - in org.apache.hadoop.hbase.client.TestResult
Java HotSpot(TM) 64-Bit Server VM warning: ignoring option MaxPermSize=256m; support was removed
in 8.0
Running org.apache.hadoop.hbase.mob.TestMobFileLink
Tests run: 1, Failures: 0, Errors: 0, Skipped: 0, Time elapsed: 1.967 sec - in org.apache.hadoop.hbase.mob.TestMobFileLink
Java HotSpot(TM) 64-Bit Server VM warning: ignoring option MaxPermSize=256m; support was removed
in 8.0
Running org.apache.hadoop.hbase.mob.compactions.TestPartitionedMobCompactionRequest
Tests run: 2, Failures: 0, Errors: 0, Skipped: 0, Time elapsed: 0.563 sec - in org.apache.hadoop.hbase.mob.compactions.TestPartitionedMobCompactionRequest
Java HotSpot(TM) 64-Bit Server VM warning: ignoring option MaxPermSize=256m; support was removed
in 8.0
Running org.apache.hadoop.hbase.mob.TestCachedMobFile
Tests run: 3, Failures: 0, Errors: 0, Skipped: 0, Time elapsed: 1.671 sec - in org.apache.hadoop.hbase.mob.TestCachedMobFile
Java HotSpot(TM) 64-Bit Server VM warning: ignoring option MaxPermSize=256m; support was removed
in 8.0
Running org.apache.hadoop.hbase.mob.TestMobFileCache
Tests run: 1, Failures: 0, Errors: 0, Skipped: 0, Time elapsed: 4.722 sec - in org.apache.hadoop.hbase.mob.TestMobFileCache
Java HotSpot(TM) 64-Bit Server VM warning: ignoring option MaxPermSize=256m; support was removed
in 8.0
Running org.apache.hadoop.hbase.mob.TestMobFile
Tests run: 2, Failures: 0, Errors: 0, Skipped: 0, Time elapsed: 1.654 sec - in org.apache.hadoop.hbase.mob.TestMobFile
Java HotSpot(TM) 64-Bit Server VM warning: ignoring option MaxPermSize=256m; support was removed
in 8.0
Running org.apache.hadoop.hbase.mob.TestMobFileName
Tests run: 4, Failures: 0, Errors: 0, Skipped: 0, Time elapsed: 1.07 sec - in org.apache.hadoop.hbase.mob.TestMobFileName
Java HotSpot(TM) 64-Bit Server VM warning: ignoring option MaxPermSize=256m; support was removed
in 8.0
Running org.apache.hadoop.hbase.master.TestClockSkewDetection
Tests run: 1, Failures: 0, Errors: 0, Skipped: 0, Time elapsed: 1.701 sec - in org.apache.hadoop.hbase.master.TestClockSkewDetection
Java HotSpot(TM) 64-Bit Server VM warning: ignoring option MaxPermSize=256m; support was removed
in 8.0
Running org.apache.hadoop.hbase.master.TestHMasterCommandLine
Tests run: 1, Failures: 0, Errors: 0, Skipped: 0, Time elapsed: 0.397 sec - in org.apache.hadoop.hbase.master.TestHMasterCommandLine
Java HotSpot(TM) 64-Bit Server VM warning: ignoring option MaxPermSize=256m; support was removed
in 8.0
Java HotSpot(TM) 64-Bit Server VM warning: ignoring option MaxPermSize=256m; support was removed
in 8.0
Running org.apache.hadoop.hbase.master.balancer.TestServerAndLoad
Tests run: 1, Failures: 0, Errors: 0, Skipped: 0, Time elapsed: 0.522 sec - in org.apache.hadoop.hbase.master.balancer.TestServerAndLoad
Java HotSpot(TM) 64-Bit Server VM warning: ignoring option MaxPermSize=256m; support was removed
in 8.0
Java HotSpot(TM) 64-Bit Server VM warning: ignoring option MaxPermSize=256m; support was removed
in 8.0
Running org.apache.hadoop.hbase.master.balancer.TestFavoredNodeAssignmentHelper
Tests run: 8, Failures: 0, Errors: 0, Skipped: 8, Time elapsed: 0.004 sec - in org.apache.hadoop.hbase.master.balancer.TestFavoredNodeAssignmentHelper
Java HotSpot(TM) 64-Bit Server VM warning: ignoring option MaxPermSize=256m; support was removed
in 8.0
Java HotSpot(TM) 64-Bit Server VM warning: ignoring option MaxPermSize=256m; support was removed
in 8.0
Running org.apache.hadoop.hbase.master.TestCatalogJanitor
Tests run: 7, Failures: 0, Errors: 0, Skipped: 0, Time elapsed: 15.543 sec - in org.apache.hadoop.hbase.master.TestCatalogJanitor
Java HotSpot(TM) 64-Bit Server VM warning: ignoring option MaxPermSize=256m; support was removed
in 8.0
Java HotSpot(TM) 64-Bit Server VM warning: ignoring option MaxPermSize=256m; support was removed
in 8.0
Java HotSpot(TM) 64-Bit Server VM warning: ignoring option MaxPermSize=256m; support was removed
in 8.0
Running org.apache.hadoop.hbase.master.TestRegionState
Tests run: 1, Failures: 0, Errors: 0, Skipped: 0, Time elapsed: 1.988 sec - in org.apache.hadoop.hbase.master.TestRegionState
Java HotSpot(TM) 64-Bit Server VM warning: ignoring option MaxPermSize=256m; support was removed
in 8.0
Java HotSpot(TM) 64-Bit Server VM warning: ignoring option MaxPermSize=256m; support was removed
in 8.0
Java HotSpot(TM) 64-Bit Server VM warning: ignoring option MaxPermSize=256m; support was removed
in 8.0
Running org.apache.hadoop.hbase.master.normalizer.TestSimpleRegionNormalizer
Tests run: 7, Failures: 0, Errors: 0, Skipped: 0, Time elapsed: 2.255 sec - in org.apache.hadoop.hbase.master.normalizer.TestSimpleRegionNormalizer
Java HotSpot(TM) 64-Bit Server VM warning: ignoring option MaxPermSize=256m; support was removed
in 8.0
Java HotSpot(TM) 64-Bit Server VM warning: ignoring option MaxPermSize=256m; support was removed
in 8.0
Java HotSpot(TM) 64-Bit Server VM warning: ignoring option MaxPermSize=256m; support was removed
in 8.0
Running org.apache.hadoop.hbase.master.cleaner.TestReplicationHFileCleaner
Tests run: 4, Failures: 0, Errors: 0, Skipped: 0, Time elapsed: 1.174 sec - in org.apache.hadoop.hbase.master.cleaner.TestReplicationHFileCleaner
Java HotSpot(TM) 64-Bit Server VM warning: ignoring option MaxPermSize=256m; support was removed
in 8.0
Running org.apache.hadoop.hbase.master.cleaner.TestCleanerChore
Tests run: 6, Failures: 0, Errors: 0, Skipped: 0, Time elapsed: 1.516 sec - in org.apache.hadoop.hbase.master.cleaner.TestCleanerChore
Java HotSpot(TM) 64-Bit Server VM warning: ignoring option MaxPermSize=256m; support was removed
in 8.0
Java HotSpot(TM) 64-Bit Server VM warning: ignoring option MaxPermSize=256m; support was removed
in 8.0
Running org.apache.hadoop.hbase.master.TestRegionPlan
Tests run: 1, Failures: 0, Errors: 0, Skipped: 0, Time elapsed: 0.525 sec - in org.apache.hadoop.hbase.master.TestRegionPlan
Java HotSpot(TM) 64-Bit Server VM warning: ignoring option MaxPermSize=256m; support was removed
in 8.0
Java HotSpot(TM) 64-Bit Server VM warning: ignoring option MaxPermSize=256m; support was removed
in 8.0
Running org.apache.hadoop.hbase.master.TestMasterQosFunction
Tests run: 2, Failures: 0, Errors: 0, Skipped: 0, Time elapsed: 2.487 sec - in org.apache.hadoop.hbase.master.TestMasterQosFunction
Java HotSpot(TM) 64-Bit Server VM warning: ignoring option MaxPermSize=256m; support was removed
in 8.0
Running org.apache.hadoop.hbase.master.TestRegionStates
Tests run: 2, Failures: 0, Errors: 0, Skipped: 0, Time elapsed: 1.778 sec - in org.apache.hadoop.hbase.master.TestRegionStates
Java HotSpot(TM) 64-Bit Server VM warning: ignoring option MaxPermSize=256m; support was removed
in 8.0
Running org.apache.hadoop.hbase.master.snapshot.TestSnapshotHFileCleaner
Tests run: 3, Failures: 0, Errors: 0, Skipped: 0, Time elapsed: 1.828 sec - in org.apache.hadoop.hbase.master.snapshot.TestSnapshotHFileCleaner
Java HotSpot(TM) 64-Bit Server VM warning: ignoring option MaxPermSize=256m; support was removed
in 8.0
Running org.apache.hadoop.hbase.master.snapshot.TestSnapshotManager
Tests run: 2, Failures: 0, Errors: 0, Skipped: 0, Time elapsed: 0.938 sec - in org.apache.hadoop.hbase.master.snapshot.TestSnapshotManager
Java HotSpot(TM) 64-Bit Server VM warning: ignoring option MaxPermSize=256m; support was removed
in 8.0
Running org.apache.hadoop.hbase.TestIPv6NIOServerSocketChannel
Tests run: 2, Failures: 0, Errors: 0, Skipped: 0, Time elapsed: 0.947 sec - in org.apache.hadoop.hbase.TestIPv6NIOServerSocketChannel
Java HotSpot(TM) 64-Bit Server VM warning: ignoring option MaxPermSize=256m; support was removed
in 8.0
Running org.apache.hadoop.hbase.snapshot.TestMobRestoreSnapshotHelper
Tests run: 2, Failures: 0, Errors: 0, Skipped: 0, Time elapsed: 3.713 sec - in org.apache.hadoop.hbase.snapshot.TestMobRestoreSnapshotHelper
Java HotSpot(TM) 64-Bit Server VM warning: ignoring option MaxPermSize=256m; support was removed
in 8.0
Java HotSpot(TM) 64-Bit Server VM warning: ignoring option MaxPermSize=256m; support was removed
in 8.0
Running org.apache.hadoop.hbase.snapshot.TestRestoreSnapshotHelper
Tests run: 2, Failures: 0, Errors: 0, Skipped: 0, Time elapsed: 4.992 sec - in org.apache.hadoop.hbase.snapshot.TestRestoreSnapshotHelper
Java HotSpot(TM) 64-Bit Server VM warning: ignoring option MaxPermSize=256m; support was removed
in 8.0
Running org.apache.hadoop.hbase.snapshot.TestSnapshotManifest
Tests run: 1, Failures: 0, Errors: 0, Skipped: 0, Time elapsed: 14.785 sec - in org.apache.hadoop.hbase.snapshot.TestSnapshotManifest

Results :

Failed tests: 
  TestLruBlockCache.testCacheEvictionThreadSafe:87 expected:<0> but was:<1>

Tests run: 1103, Failures: 1, Errors: 0, Skipped: 21

[INFO] ------------------------------------------------------------------------
[INFO] Reactor Summary:
[INFO] 
[INFO] Apache HBase ...................................... SUCCESS [5.470s]
[INFO] Apache HBase - Checkstyle ......................... SUCCESS [2.191s]
[INFO] Apache HBase - Resource Bundle .................... SUCCESS [0.627s]
[INFO] Apache HBase - Annotations ........................ SUCCESS [0.659s]
[INFO] Apache HBase - Protocol ........................... SUCCESS [4.484s]
[INFO] Apache HBase - Common ............................. SUCCESS [1:49.822s]
[INFO] Apache HBase - Procedure .......................... SUCCESS [2:21.252s]
[INFO] Apache HBase - Client ............................. SUCCESS [1:08.993s]
[INFO] Apache HBase - Hadoop Compatibility ............... SUCCESS [11.615s]
[INFO] Apache HBase - Hadoop Two Compatibility ........... SUCCESS [19.138s]
[INFO] Apache HBase - Prefix Tree ........................ SUCCESS [19.054s]
[INFO] Apache HBase - Server ............................. FAILURE [18:32.159s]
[INFO] Apache HBase - Testing Util ....................... SKIPPED
[INFO] Apache HBase - Thrift ............................. SKIPPED
[INFO] Apache HBase - RSGroup ............................ SKIPPED
[INFO] Apache HBase - Shell .............................. SKIPPED
[INFO] Apache HBase - Integration Tests .................. SKIPPED
[INFO] Apache HBase - Examples ........................... SKIPPED
[INFO] Apache HBase - Rest ............................... SKIPPED
[INFO] Apache HBase - External Block Cache ............... SKIPPED
[INFO] Apache HBase - Spark .............................. SKIPPED
[INFO] Apache HBase - Assembly ........................... SKIPPED
[INFO] Apache HBase - Shaded ............................. SKIPPED
[INFO] Apache HBase - Shaded - Client .................... SKIPPED
[INFO] Apache HBase - Shaded - Server .................... SKIPPED
[INFO] Apache HBase - Archetypes ......................... SKIPPED
[INFO] Apache HBase - Exemplar for hbase-client archetype  SKIPPED
[INFO] Apache HBase - Exemplar for hbase-shaded-client archetype  SKIPPED
[INFO] Apache HBase - Archetype builder .................. SKIPPED
[INFO] ------------------------------------------------------------------------
[INFO] BUILD FAILURE
[INFO] ------------------------------------------------------------------------
[INFO] Total time: 24:58.468s
[INFO] Finished at: Wed Aug 10 02:17:18 UTC 2016
[INFO] Final Memory: 65M/2352M
[INFO] ------------------------------------------------------------------------
[ERROR] Failed to execute goal org.apache.maven.plugins:maven-surefire-plugin:2.18.1:test
(default-test) on project hbase-server: There are test failures.
[ERROR] 
[ERROR] Please refer to <https://builds.apache.org/job/HBase-Trunk_matrix/jdk=JDK%201.8%20(latest),label=yahoo-not-h2/ws/hbase-server/target/surefire-reports>
for the individual test results.
[ERROR] -> [Help 1]
[ERROR] 
[ERROR] To see the full stack trace of the errors, re-run Maven with the -e switch.
[ERROR] Re-run Maven using the -X switch to enable full debug logging.
[ERROR] 
[ERROR] For more information about the errors and possible solutions, please read the following
articles:
[ERROR] [Help 1] http://cwiki.apache.org/confluence/display/MAVEN/MojoFailureException
[ERROR] 
[ERROR] After correcting the problems, you can resume the build with the command
[ERROR]   mvn <goals> -rf :hbase-server
Build step 'Invoke top-level Maven targets' marked build as failure
Performing Post build task...
Match found for :.* : True
Logical operation result is TRUE
Running script  : # Run zombie detector script
./dev-support/zombie-detector.sh --jenkins ${BUILD_ID}
[yahoo-not-h2] $ /bin/bash -xe /tmp/hudson963074033463568114.sh
+ ./dev-support/zombie-detector.sh --jenkins 1387
Wed Aug 10 02:17:21 UTC 2016 We're ok: there is no zombie test


    {color:green}+1 zombies{color}. No zombie tests found running at the end of the build.
POST BUILD TASK : SUCCESS
END OF POST BUILD TASK : 0
Archiving artifacts
No prior successful build to compare, so performing full copy of artifacts
Recording test results
[FINDBUGS] Skipping publisher since build result is FAILURE
[CHECKSTYLE] Skipping publisher since build result is FAILURE

Mime
View raw message