hbase-builds mailing list archives

Site index · List index
Message view « Date » · « Thread »
Top « Date » · « Thread »
From Apache Jenkins Server <jenk...@builds.apache.org>
Subject Build failed in Jenkins: HBase-1.1-JDK8 #1851
Date Wed, 17 Aug 2016 08:22:26 GMT
See <https://builds.apache.org/job/HBase-1.1-JDK8/1851/changes>

Changes:

[stack] HBASE-16420 Fix source incompatibility of Table interface (Phil Yang)

------------------------------------------
[...truncated 3708 lines...]
Java HotSpot(TM) 64-Bit Server VM warning: ignoring option MaxPermSize=256m; support was removed
in 8.0
Running org.apache.hadoop.hbase.io.TestFileLink
Tests run: 28, Failures: 0, Errors: 0, Skipped: 0, Time elapsed: 222.031 sec - in org.apache.hadoop.hbase.io.encoding.TestDataBlockEncoders
Java HotSpot(TM) 64-Bit Server VM warning: ignoring option MaxPermSize=256m; support was removed
in 8.0
Java HotSpot(TM) 64-Bit Server VM warning: ignoring option MaxPermSize=256m; support was removed
in 8.0
Java HotSpot(TM) 64-Bit Server VM warning: ignoring option MaxPermSize=256m; support was removed
in 8.0
Tests run: 5, Failures: 0, Errors: 0, Skipped: 0, Time elapsed: 23.309 sec - in org.apache.hadoop.hbase.io.TestFileLink
Java HotSpot(TM) 64-Bit Server VM warning: ignoring option MaxPermSize=256m; support was removed
in 8.0
Tests run: 72, Failures: 0, Errors: 0, Skipped: 0, Time elapsed: 201.622 sec - in org.apache.hadoop.hbase.io.hfile.TestCacheOnWrite
Java HotSpot(TM) 64-Bit Server VM warning: ignoring option MaxPermSize=256m; support was removed
in 8.0
Tests run: 6, Failures: 0, Errors: 0, Skipped: 0, Time elapsed: 64.801 sec - in org.apache.hadoop.hbase.io.hfile.TestScannerSelectionUsingTTL
Java HotSpot(TM) 64-Bit Server VM warning: ignoring option MaxPermSize=256m; support was removed
in 8.0
Running org.apache.hadoop.hbase.security.access.TestAccessController
Running org.apache.hadoop.hbase.security.access.TestCellACLs
Running org.apache.hadoop.hbase.security.access.TestTablePermissions
Running org.apache.hadoop.hbase.security.access.TestAccessControlFilter
Tests run: 1, Failures: 0, Errors: 0, Skipped: 0, Time elapsed: 9.911 sec - in org.apache.hadoop.hbase.security.access.TestAccessControlFilter
Java HotSpot(TM) 64-Bit Server VM warning: ignoring option MaxPermSize=256m; support was removed
in 8.0
Tests run: 2, Failures: 0, Errors: 0, Skipped: 0, Time elapsed: 43.369 sec - in org.apache.hadoop.hbase.security.access.TestCellACLs
Java HotSpot(TM) 64-Bit Server VM warning: ignoring option MaxPermSize=256m; support was removed
in 8.0
Running org.apache.hadoop.hbase.security.access.TestNamespaceCommands
Tests run: 7, Failures: 0, Errors: 0, Skipped: 0, Time elapsed: 57.666 sec - in org.apache.hadoop.hbase.security.access.TestTablePermissions
Java HotSpot(TM) 64-Bit Server VM warning: ignoring option MaxPermSize=256m; support was removed
in 8.0
Running org.apache.hadoop.hbase.security.access.TestCellACLWithMultipleVersions
Running org.apache.hadoop.hbase.security.access.TestAccessController2
Tests run: 7, Failures: 0, Errors: 0, Skipped: 0, Time elapsed: 33.092 sec - in org.apache.hadoop.hbase.security.access.TestNamespaceCommands
Java HotSpot(TM) 64-Bit Server VM warning: ignoring option MaxPermSize=256m; support was removed
in 8.0
Running org.apache.hadoop.hbase.security.access.TestZKPermissionsWatcher
Tests run: 1, Failures: 0, Errors: 0, Skipped: 0, Time elapsed: 4.5 sec - in org.apache.hadoop.hbase.security.access.TestZKPermissionsWatcher
Java HotSpot(TM) 64-Bit Server VM warning: ignoring option MaxPermSize=256m; support was removed
in 8.0
Running org.apache.hadoop.hbase.security.access.TestWithDisabledAuthorization
Tests run: 3, Failures: 0, Errors: 0, Skipped: 0, Time elapsed: 413.574 sec - in org.apache.hadoop.hbase.io.encoding.TestChangingEncoding
Java HotSpot(TM) 64-Bit Server VM warning: ignoring option MaxPermSize=256m; support was removed
in 8.0
Running org.apache.hadoop.hbase.security.access.TestScanEarlyTermination
Tests run: 8, Failures: 0, Errors: 0, Skipped: 0, Time elapsed: 133.49 sec - in org.apache.hadoop.hbase.security.access.TestCellACLWithMultipleVersions
Java HotSpot(TM) 64-Bit Server VM warning: ignoring option MaxPermSize=256m; support was removed
in 8.0
Tests run: 1, Failures: 0, Errors: 0, Skipped: 0, Time elapsed: 15.735 sec - in org.apache.hadoop.hbase.security.access.TestScanEarlyTermination
Java HotSpot(TM) 64-Bit Server VM warning: ignoring option MaxPermSize=256m; support was removed
in 8.0
Tests run: 6, Failures: 0, Errors: 0, Skipped: 0, Time elapsed: 134.272 sec - in org.apache.hadoop.hbase.security.access.TestAccessController2
Java HotSpot(TM) 64-Bit Server VM warning: ignoring option MaxPermSize=256m; support was removed
in 8.0
Running org.apache.hadoop.hbase.security.visibility.TestVisibilityLablesWithGroups
Tests run: 1, Failures: 0, Errors: 0, Skipped: 0, Time elapsed: 8.75 sec - in org.apache.hadoop.hbase.security.visibility.TestVisibilityLablesWithGroups
Java HotSpot(TM) 64-Bit Server VM warning: ignoring option MaxPermSize=256m; support was removed
in 8.0
Running org.apache.hadoop.hbase.security.visibility.TestVisibilityLabelsWithDeletes
Tests run: 57, Failures: 0, Errors: 0, Skipped: 0, Time elapsed: 236.378 sec - in org.apache.hadoop.hbase.security.access.TestAccessController
Java HotSpot(TM) 64-Bit Server VM warning: ignoring option MaxPermSize=256m; support was removed
in 8.0
Java HotSpot(TM) 64-Bit Server VM warning: ignoring option MaxPermSize=256m; support was removed
in 8.0
Running org.apache.hadoop.hbase.security.visibility.TestVisibilityLabelsWithDefaultVisLabelService
Running org.apache.hadoop.hbase.security.visibility.TestVisibilityLabelsWithCustomVisLabService
Running org.apache.hadoop.hbase.security.visibility.TestDefaultScanLabelGeneratorStack
Tests run: 1, Failures: 0, Errors: 0, Skipped: 0, Time elapsed: 7.095 sec - in org.apache.hadoop.hbase.security.visibility.TestDefaultScanLabelGeneratorStack
Java HotSpot(TM) 64-Bit Server VM warning: ignoring option MaxPermSize=256m; support was removed
in 8.0
Tests run: 6, Failures: 0, Errors: 0, Skipped: 0, Time elapsed: 136.186 sec - in org.apache.hadoop.hbase.security.access.TestWithDisabledAuthorization
Java HotSpot(TM) 64-Bit Server VM warning: ignoring option MaxPermSize=256m; support was removed
in 8.0
Running org.apache.hadoop.hbase.security.visibility.TestVisibilityWithCheckAuths
Running org.apache.hadoop.hbase.security.visibility.TestVisibilityLabelsOpWithDifferentUsersNoACL
Tests run: 1, Failures: 0, Errors: 0, Skipped: 0, Time elapsed: 3.089 sec - in org.apache.hadoop.hbase.security.visibility.TestVisibilityLabelsOpWithDifferentUsersNoACL
Java HotSpot(TM) 64-Bit Server VM warning: ignoring option MaxPermSize=256m; support was removed
in 8.0
Tests run: 2, Failures: 0, Errors: 0, Skipped: 0, Time elapsed: 13.797 sec - in org.apache.hadoop.hbase.security.visibility.TestVisibilityWithCheckAuths
Java HotSpot(TM) 64-Bit Server VM warning: ignoring option MaxPermSize=256m; support was removed
in 8.0
Running org.apache.hadoop.hbase.security.visibility.TestVisibilityLabelsWithSLGStack
Running org.apache.hadoop.hbase.security.visibility.TestEnforcingScanLabelGenerator
Tests run: 1, Failures: 0, Errors: 0, Skipped: 0, Time elapsed: 6.96 sec - in org.apache.hadoop.hbase.security.visibility.TestVisibilityLabelsWithSLGStack
Java HotSpot(TM) 64-Bit Server VM warning: ignoring option MaxPermSize=256m; support was removed
in 8.0
Running org.apache.hadoop.hbase.security.visibility.TestVisibilityLabelsReplication
Tests run: 1, Failures: 0, Errors: 0, Skipped: 0, Time elapsed: 6.965 sec - in org.apache.hadoop.hbase.security.visibility.TestEnforcingScanLabelGenerator
Java HotSpot(TM) 64-Bit Server VM warning: ignoring option MaxPermSize=256m; support was removed
in 8.0
Running org.apache.hadoop.hbase.security.visibility.TestVisibilityLabelReplicationWithExpAsString
Tests run: 24, Failures: 0, Errors: 0, Skipped: 0, Time elapsed: 102.721 sec - in org.apache.hadoop.hbase.security.visibility.TestVisibilityLabelsWithDefaultVisLabelService
Java HotSpot(TM) 64-Bit Server VM warning: ignoring option MaxPermSize=256m; support was removed
in 8.0
Java HotSpot(TM) 64-Bit Server VM warning: ignoring option MaxPermSize=256m; support was removed
in 8.0
Tests run: 19, Failures: 0, Errors: 0, Skipped: 0, Time elapsed: 90.972 sec - in org.apache.hadoop.hbase.security.visibility.TestVisibilityLabelsWithCustomVisLabService
Java HotSpot(TM) 64-Bit Server VM warning: ignoring option MaxPermSize=256m; support was removed
in 8.0
Running org.apache.hadoop.hbase.security.visibility.TestWithDisabledAuthorization
Running org.apache.hadoop.hbase.security.visibility.TestVisibilityLabelsWithACL
Tests run: 2, Failures: 0, Errors: 0, Skipped: 0, Time elapsed: 8.839 sec - in org.apache.hadoop.hbase.security.visibility.TestWithDisabledAuthorization
Java HotSpot(TM) 64-Bit Server VM warning: ignoring option MaxPermSize=256m; support was removed
in 8.0
Running org.apache.hadoop.hbase.security.token.TestZKSecretWatcher
Tests run: 1, Failures: 0, Errors: 0, Skipped: 0, Time elapsed: 46.544 sec - in org.apache.hadoop.hbase.security.visibility.TestVisibilityLabelReplicationWithExpAsString
Tests run: 1, Failures: 0, Errors: 0, Skipped: 0, Time elapsed: 49.432 sec - in org.apache.hadoop.hbase.security.visibility.TestVisibilityLabelsReplication
Java HotSpot(TM) 64-Bit Server VM warning: ignoring option MaxPermSize=256m; support was removed
in 8.0
Java HotSpot(TM) 64-Bit Server VM warning: ignoring option MaxPermSize=256m; support was removed
in 8.0
Running org.apache.hadoop.hbase.security.token.TestTokenAuthentication
Tests run: 3, Failures: 0, Errors: 0, Skipped: 0, Time elapsed: 0.664 sec - in org.apache.hadoop.hbase.security.token.TestTokenAuthentication
Java HotSpot(TM) 64-Bit Server VM warning: ignoring option MaxPermSize=256m; support was removed
in 8.0
Java HotSpot(TM) 64-Bit Server VM warning: ignoring option MaxPermSize=256m; support was removed
in 8.0
Java HotSpot(TM) 64-Bit Server VM warning: ignoring option MaxPermSize=256m; support was removed
in 8.0
Java HotSpot(TM) 64-Bit Server VM warning: ignoring option MaxPermSize=256m; support was removed
in 8.0
Java HotSpot(TM) 64-Bit Server VM warning: ignoring option MaxPermSize=256m; support was removed
in 8.0
Running org.apache.hadoop.hbase.TestHBaseOnOtherDfsCluster
Tests run: 1, Failures: 0, Errors: 0, Skipped: 0, Time elapsed: 14.258 sec - in org.apache.hadoop.hbase.security.token.TestZKSecretWatcher
Tests run: 5, Failures: 0, Errors: 0, Skipped: 0, Time elapsed: 26.463 sec - in org.apache.hadoop.hbase.security.visibility.TestVisibilityLabelsWithACL
Tests run: 1, Failures: 0, Errors: 0, Skipped: 0, Time elapsed: 25.372 sec - in org.apache.hadoop.hbase.TestHBaseOnOtherDfsCluster
Running org.apache.hadoop.hbase.security.token.TestGenerateDelegationToken
Tests run: 1, Failures: 0, Errors: 0, Skipped: 0, Time elapsed: 19.453 sec - in org.apache.hadoop.hbase.security.token.TestGenerateDelegationToken
Tests run: 44, Failures: 0, Errors: 0, Skipped: 0, Time elapsed: 289.003 sec - in org.apache.hadoop.hbase.security.visibility.TestVisibilityLabelsWithDeletes

Results :

Tests in error: 
org.apache.hadoop.hbase.mapreduce.TestSecureLoadIncrementalHFiles.testRegionCrossingHFileSplit(org.apache.hadoop.hbase.mapreduce.TestSecureLoadIncrementalHFiles)
  Run 1: TestSecureLoadIncrementalHFiles>TestLoadIncrementalHFiles.testRegionCrossingHFileSplit:184->TestLoadIncrementalHFiles.testRegionCrossingHFileSplit:206->TestLoadIncrementalHFiles.runTest:242->TestLoadIncrementalHFiles.runTest:248->TestLoadIncrementalHFiles.runTest:301
» TestTimedOut
  Run 2: TestSecureLoadIncrementalHFiles>TestLoadIncrementalHFiles.testRegionCrossingHFileSplit:184->TestLoadIncrementalHFiles.testRegionCrossingHFileSplit:206->TestLoadIncrementalHFiles.runTest:242->TestLoadIncrementalHFiles.runTest:248->TestLoadIncrementalHFiles.runTest:301->Object.wait:-2
» TestTimedOut

org.apache.hadoop.hbase.mapreduce.TestSecureLoadIncrementalHFiles.testRegionCrossingHFileSplitRowBloom(org.apache.hadoop.hbase.mapreduce.TestSecureLoadIncrementalHFiles)
  Run 1: TestSecureLoadIncrementalHFiles>TestLoadIncrementalHFiles.testRegionCrossingHFileSplitRowBloom:193->TestLoadIncrementalHFiles.testRegionCrossingHFileSplit:206->TestLoadIncrementalHFiles.runTest:242->TestLoadIncrementalHFiles.runTest:248->TestLoadIncrementalHFiles.runTest:270
» TestTimedOut
  Run 2: TestSecureLoadIncrementalHFiles>TestLoadIncrementalHFiles.testRegionCrossingHFileSplitRowBloom:193->TestLoadIncrementalHFiles.testRegionCrossingHFileSplit:206->TestLoadIncrementalHFiles.runTest:242->TestLoadIncrementalHFiles.runTest:248->TestLoadIncrementalHFiles.runTest:301
» TestTimedOut

org.apache.hadoop.hbase.mapreduce.TestSecureLoadIncrementalHFiles.testRegionCrossingHFileSplitRowColBloom(org.apache.hadoop.hbase.mapreduce.TestSecureLoadIncrementalHFiles)
  Run 1: TestSecureLoadIncrementalHFiles>TestLoadIncrementalHFiles.testRegionCrossingHFileSplitRowColBloom:202->TestLoadIncrementalHFiles.testRegionCrossingHFileSplit:206->TestLoadIncrementalHFiles.runTest:242->TestLoadIncrementalHFiles.runTest:248->TestLoadIncrementalHFiles.runTest:301
» TestTimedOut
  Run 2: TestSecureLoadIncrementalHFiles>TestLoadIncrementalHFiles.testRegionCrossingHFileSplitRowColBloom:202->TestLoadIncrementalHFiles.testRegionCrossingHFileSplit:206->TestLoadIncrementalHFiles.runTest:242->TestLoadIncrementalHFiles.runTest:248->TestLoadIncrementalHFiles.runTest:301
» TestTimedOut

org.apache.hadoop.hbase.mapreduce.TestSecureLoadIncrementalHFiles.testSimpleHFileSplit(org.apache.hadoop.hbase.mapreduce.TestSecureLoadIncrementalHFiles)
  Run 1: TestSecureLoadIncrementalHFiles>TestLoadIncrementalHFiles.testSimpleHFileSplit:166->TestLoadIncrementalHFiles.runTest:242->TestLoadIncrementalHFiles.runTest:248->TestLoadIncrementalHFiles.runTest:270
» TestTimedOut
  Run 2: TestSecureLoadIncrementalHFiles>TestLoadIncrementalHFiles.testSimpleHFileSplit:166->TestLoadIncrementalHFiles.runTest:242->TestLoadIncrementalHFiles.runTest:248->TestLoadIncrementalHFiles.runTest:287
» TestTimedOut

  TestRegionReplicaFailover.testLotsOfRegionReplicas:371 » TestTimedOut test tim...
  TestRegionReplicaFailover.testLotsOfRegionReplicas:371 » TestTimedOut test tim...
org.apache.hadoop.hbase.regionserver.TestWALLockup.testLockupWhenSyncInMiddleOfZigZagSetup(org.apache.hadoop.hbase.regionserver.TestWALLockup)
  Run 1: TestWALLockup.testLockupWhenSyncInMiddleOfZigZagSetup » DamagedWAL Append sequ...
  Run 2: TestWALLockup.testLockupWhenSyncInMiddleOfZigZagSetup » DamagedWAL Append sequ...
  Run 3: TestWALLockup.testLockupWhenSyncInMiddleOfZigZagSetup:261 » TestTimedOut test ...

Flaked tests: 
org.apache.hadoop.hbase.mapreduce.TestLoadIncrementalHFilesUseSecurityEndPoint.testSimpleHFileSplit(org.apache.hadoop.hbase.mapreduce.TestLoadIncrementalHFilesUseSecurityEndPoint)
  Run 1: TestLoadIncrementalHFilesUseSecurityEndPoint>TestLoadIncrementalHFiles.testSimpleHFileSplit:166->TestLoadIncrementalHFiles.runTest:242->TestLoadIncrementalHFiles.runTest:248->TestLoadIncrementalHFiles.runTest:301
» TestTimedOut
  Run 2: PASS

org.apache.hadoop.hbase.replication.TestMasterReplication.testCyclicReplication2(org.apache.hadoop.hbase.replication.TestMasterReplication)
  Run 1: TestMasterReplication.testCyclicReplication2:209->wait:421 Waited too much time
for replication. Row:row4. IsDeleteReplication:true
  Run 2: PASS


Tests run: 2469, Failures: 0, Errors: 7, Skipped: 19, Flakes: 2

[INFO] ------------------------------------------------------------------------
[INFO] Reactor Summary:
[INFO] 
[INFO] Apache HBase ....................................... SUCCESS [  6.399 s]
[INFO] Apache HBase - Checkstyle .......................... SUCCESS [  1.661 s]
[INFO] Apache HBase - Resource Bundle ..................... SUCCESS [  0.561 s]
[INFO] Apache HBase - Annotations ......................... SUCCESS [  1.269 s]
[INFO] Apache HBase - Protocol ............................ SUCCESS [ 17.764 s]
[INFO] Apache HBase - Common .............................. SUCCESS [01:34 min]
[INFO] Apache HBase - Procedure ........................... SUCCESS [03:18 min]
[INFO] Apache HBase - Client .............................. SUCCESS [01:26 min]
[INFO] Apache HBase - Hadoop Compatibility ................ SUCCESS [  8.555 s]
[INFO] Apache HBase - Hadoop Two Compatibility ............ SUCCESS [  9.184 s]
[INFO] Apache HBase - Prefix Tree ......................... SUCCESS [ 10.543 s]
[INFO] Apache HBase - Server .............................. FAILURE [  02:24 h]
[INFO] Apache HBase - Testing Util ........................ SKIPPED
[INFO] Apache HBase - Thrift .............................. SKIPPED
[INFO] Apache HBase - Rest ................................ SKIPPED
[INFO] Apache HBase - Shell ............................... SKIPPED
[INFO] Apache HBase - Integration Tests ................... SKIPPED
[INFO] Apache HBase - Examples ............................ SKIPPED
[INFO] Apache HBase - Assembly ............................ SKIPPED
[INFO] Apache HBase - Shaded .............................. SKIPPED
[INFO] Apache HBase - Shaded - Client ..................... SKIPPED
[INFO] Apache HBase - Shaded - Server ..................... SKIPPED
[INFO] ------------------------------------------------------------------------
[INFO] BUILD FAILURE
[INFO] ------------------------------------------------------------------------
[INFO] Total time: 02:31 h
[INFO] Finished at: 2016-08-17T08:17:48+00:00
[INFO] Final Memory: 60M/1036M
[INFO] ------------------------------------------------------------------------
[ERROR] Failed to execute goal org.apache.maven.plugins:maven-surefire-plugin:2.18.1:test
(secondPartTestsExecution) on project hbase-server: There was a timeout or other error in
the fork -> [Help 1]
[ERROR] 
[ERROR] To see the full stack trace of the errors, re-run Maven with the -e switch.
[ERROR] Re-run Maven using the -X switch to enable full debug logging.
[ERROR] 
[ERROR] For more information about the errors and possible solutions, please read the following
articles:
[ERROR] [Help 1] http://cwiki.apache.org/confluence/display/MAVEN/MojoFailureException
[ERROR] 
[ERROR] After correcting the problems, you can resume the build with the command
[ERROR]   mvn <goals> -rf :hbase-server
Build step 'Invoke top-level Maven targets' marked build as failure
Performing Post build task...
Match found for :.* : True
Logical operation result is TRUE
Running script  : # Post-build task script. TODO: Check this in and have all builds reference
check-in.
pwd && ls
# NOTE!!!! The below code has been copied and pasted from ./dev-tools/run-test.sh
# Do not change here without syncing there and vice-versa.
ZOMBIE_TESTS_COUNT=`jps -v | grep surefirebooter | grep -e '-Dhbase.test' | wc -l`
if [[ $ZOMBIE_TESTS_COUNT != 0 ]] ; then
 echo "Suspicious java process found - waiting 30s to see if there are just slow to stop"
 sleep 30
 ZOMBIE_TESTS_COUNT=`jps -v | grep surefirebooter | grep -e '-Dhbase.test' | wc -l`
 if [[ $ZOMBIE_TESTS_COUNT != 0 ]] ; then
   echo " {color:red}There appear to be $ZOMBIE_TESTS_COUNT zombie tests{color}, they should
have been killed by surefire but survived"
   jps -v | grep surefirebooter | grep -e '-Dhbase.test'
   jps -v | grep surefirebooter | grep -e '-Dhbase.test' | cut -d ' ' -f 1 | xargs -n 1 jstack
   # Exit with error
   exit 1
 else
   echo "We're ok: there is no zombie test, but some tests took some time to stop"
 fi
else
  echo "We're ok: there is no zombie test"
fi
[HBase-1.1-JDK8] $ /bin/bash -xe /tmp/hudson4022056403850443823.sh
+ pwd
<https://builds.apache.org/job/HBase-1.1-JDK8/ws/>
+ ls
bin
CHANGES.txt
conf
dev-support
hbase-annotations
hbase-assembly
hbase-checkstyle
hbase-client
hbase-common
hbase-examples
hbase-hadoop2-compat
hbase-hadoop-compat
hbase-it
hbase-native-client
hbase-prefix-tree
hbase-procedure
hbase-protocol
hbase-resource-bundle
hbase-rest
hbase-server
hbase-shaded
hbase-shell
hbase-testing-util
hbase-thrift
LICENSE.txt
NOTICE.txt
pom.xml
README.txt
src
target
++ jps -v
++ grep surefirebooter
++ grep -e -Dhbase.test
++ wc -l
+ ZOMBIE_TESTS_COUNT=0
+ [[ 0 != 0 ]]
+ echo 'We'\''re ok: there is no zombie test'
We're ok: there is no zombie test
POST BUILD TASK : SUCCESS
END OF POST BUILD TASK : 0
Archiving artifacts
Recording test results
Updating HBASE-16420

Mime
View raw message