hbase-builds mailing list archives

Site index · List index
Message view « Date » · « Thread »
Top « Date » · « Thread »
From Apache Jenkins Server <jenk...@builds.apache.org>
Subject Build failed in Jenkins: HBase-Trunk_matrix » JDK 1.8 (latest),yahoo-not-h2 #1418
Date Mon, 15 Aug 2016 09:46:18 GMT
See <https://builds.apache.org/job/HBase-Trunk_matrix/jdk=JDK%201.8%20(latest),label=yahoo-not-h2/1418/>

------------------------------------------
[...truncated 5021 lines...]
	at org.apache.hadoop.hbase.HBaseConfiguration.addHbaseResources(HBaseConfiguration.java:83)
	at org.apache.hadoop.hbase.HBaseConfiguration.create(HBaseConfiguration.java:98)
	at org.apache.hadoop.hbase.zookeeper.TestZKConfig.testZKConfigLoading(TestZKConfig.java:39)

testGetZooKeeperClusterKey(org.apache.hadoop.hbase.zookeeper.TestZKConfig)  Time elapsed:
0.043 sec  <<< ERROR!
java.lang.RuntimeException: hbase-default.xml file seems to be for an older version of HBase
(2.0.0-SNAPSHOT), this version is Unknown
	at org.apache.hadoop.hbase.HBaseConfiguration.checkDefaultsVersion(HBaseConfiguration.java:73)
	at org.apache.hadoop.hbase.HBaseConfiguration.addHbaseResources(HBaseConfiguration.java:83)
	at org.apache.hadoop.hbase.HBaseConfiguration.create(HBaseConfiguration.java:98)
	at org.apache.hadoop.hbase.zookeeper.TestZKConfig.testGetZooKeeperClusterKey(TestZKConfig.java:51)

testClusterKeyWithMultiplePorts(org.apache.hadoop.hbase.zookeeper.TestZKConfig)  Time elapsed:
0.066 sec  <<< ERROR!
java.lang.RuntimeException: hbase-default.xml file seems to be for an older version of HBase
(2.0.0-SNAPSHOT), this version is Unknown
	at org.apache.hadoop.hbase.HBaseConfiguration.checkDefaultsVersion(HBaseConfiguration.java:73)
	at org.apache.hadoop.hbase.HBaseConfiguration.addHbaseResources(HBaseConfiguration.java:83)
	at org.apache.hadoop.hbase.HBaseConfiguration.create(HBaseConfiguration.java:98)
	at org.apache.hadoop.hbase.HBaseConfiguration.create(HBaseConfiguration.java:107)
	at org.apache.hadoop.hbase.HBaseConfiguration.createClusterConf(HBaseConfiguration.java:283)
	at org.apache.hadoop.hbase.HBaseConfiguration.createClusterConf(HBaseConfiguration.java:266)
	at org.apache.hadoop.hbase.zookeeper.TestZKConfig.testKey(TestZKConfig.java:111)
	at org.apache.hadoop.hbase.zookeeper.TestZKConfig.testClusterKeyWithMultiplePorts(TestZKConfig.java:74)

Java HotSpot(TM) 64-Bit Server VM warning: ignoring option MaxPermSize=256m; support was removed
in 8.0
Running org.apache.hadoop.hbase.TestCompoundConfiguration
Tests run: 6, Failures: 0, Errors: 0, Skipped: 0, Time elapsed: 0.785 sec - in org.apache.hadoop.hbase.TestCompoundConfiguration
Java HotSpot(TM) 64-Bit Server VM warning: ignoring option MaxPermSize=256m; support was removed
in 8.0
Running org.apache.hadoop.hbase.TestHBaseConfiguration
Tests run: 4, Failures: 0, Errors: 4, Skipped: 0, Time elapsed: 0.118 sec <<< FAILURE!
- in org.apache.hadoop.hbase.TestHBaseConfiguration
testGetPassword(org.apache.hadoop.hbase.TestHBaseConfiguration)  Time elapsed: 0.031 sec 
<<< ERROR!
java.lang.ExceptionInInitializerError: null
	at org.apache.hadoop.hbase.HBaseConfiguration.checkDefaultsVersion(HBaseConfiguration.java:73)
	at org.apache.hadoop.hbase.HBaseConfiguration.addHbaseResources(HBaseConfiguration.java:83)
	at org.apache.hadoop.hbase.HBaseConfiguration.create(HBaseConfiguration.java:98)
	at org.apache.hadoop.hbase.HBaseCommonTestingUtility.<init>(HBaseCommonTestingUtility.java:46)
	at org.apache.hadoop.hbase.TestHBaseConfiguration.<clinit>(TestHBaseConfiguration.java:47)

testGetIntDeprecated(org.apache.hadoop.hbase.TestHBaseConfiguration)  Time elapsed: 0.017
sec  <<< ERROR!
java.lang.NoClassDefFoundError: Could not initialize class org.apache.hadoop.hbase.TestHBaseConfiguration
	at sun.reflect.NativeConstructorAccessorImpl.newInstance0(Native Method)
	at sun.reflect.NativeConstructorAccessorImpl.newInstance(NativeConstructorAccessorImpl.java:62)
	at sun.reflect.DelegatingConstructorAccessorImpl.newInstance(DelegatingConstructorAccessorImpl.java:45)
	at java.lang.reflect.Constructor.newInstance(Constructor.java:423)
	at org.junit.runners.BlockJUnit4ClassRunner.createTest(BlockJUnit4ClassRunner.java:217)
	at org.junit.runners.BlockJUnit4ClassRunner$1.runReflectiveCall(BlockJUnit4ClassRunner.java:266)
	at org.junit.internal.runners.model.ReflectiveCallable.run(ReflectiveCallable.java:12)
	at org.junit.runners.BlockJUnit4ClassRunner.methodBlock(BlockJUnit4ClassRunner.java:263)
	at org.junit.runners.BlockJUnit4ClassRunner.runChild(BlockJUnit4ClassRunner.java:78)
	at org.junit.runners.BlockJUnit4ClassRunner.runChild(BlockJUnit4ClassRunner.java:57)
	at org.junit.runners.ParentRunner$3.run(ParentRunner.java:290)
	at org.junit.runners.ParentRunner$1.schedule(ParentRunner.java:71)
	at org.junit.runners.ParentRunner.runChildren(ParentRunner.java:288)
	at org.junit.runners.ParentRunner.access$000(ParentRunner.java:58)
	at org.junit.runners.ParentRunner$2.evaluate(ParentRunner.java:268)
	at org.junit.internal.runners.statements.RunAfters.evaluate(RunAfters.java:27)
	at org.junit.runners.ParentRunner.run(ParentRunner.java:363)
	at org.junit.runners.Suite.runChild(Suite.java:128)
	at org.junit.runners.Suite.runChild(Suite.java:27)
	at org.junit.runners.ParentRunner$3.run(ParentRunner.java:290)
	at org.junit.runners.ParentRunner$1.schedule(ParentRunner.java:71)
	at org.junit.runners.ParentRunner.runChildren(ParentRunner.java:288)
	at org.junit.runners.ParentRunner.access$000(ParentRunner.java:58)
	at org.junit.runners.ParentRunner$2.evaluate(ParentRunner.java:268)
	at org.junit.runners.ParentRunner.run(ParentRunner.java:363)
	at org.junit.runner.JUnitCore.run(JUnitCore.java:137)
	at org.junit.runner.JUnitCore.run(JUnitCore.java:115)
	at org.apache.maven.surefire.junitcore.JUnitCoreWrapper.createRequestAndRun(JUnitCoreWrapper.java:108)
	at org.apache.maven.surefire.junitcore.JUnitCoreWrapper.executeEager(JUnitCoreWrapper.java:78)
	at org.apache.maven.surefire.junitcore.JUnitCoreWrapper.execute(JUnitCoreWrapper.java:54)
	at org.apache.maven.surefire.junitcore.JUnitCoreProvider.invoke(JUnitCoreProvider.java:144)
	at org.apache.maven.surefire.booter.ForkedBooter.invokeProviderInSameClassLoader(ForkedBooter.java:203)
	at org.apache.maven.surefire.booter.ForkedBooter.runSuitesInProcess(ForkedBooter.java:155)
	at org.apache.maven.surefire.booter.ForkedBooter.main(ForkedBooter.java:103)

testSubset(org.apache.hadoop.hbase.TestHBaseConfiguration)  Time elapsed: 0.018 sec  <<<
ERROR!
java.lang.NoClassDefFoundError: Could not initialize class org.apache.hadoop.hbase.TestHBaseConfiguration
	at sun.reflect.NativeConstructorAccessorImpl.newInstance0(Native Method)
	at sun.reflect.NativeConstructorAccessorImpl.newInstance(NativeConstructorAccessorImpl.java:62)
	at sun.reflect.DelegatingConstructorAccessorImpl.newInstance(DelegatingConstructorAccessorImpl.java:45)
	at java.lang.reflect.Constructor.newInstance(Constructor.java:423)
	at org.junit.runners.BlockJUnit4ClassRunner.createTest(BlockJUnit4ClassRunner.java:217)
	at org.junit.runners.BlockJUnit4ClassRunner$1.runReflectiveCall(BlockJUnit4ClassRunner.java:266)
	at org.junit.internal.runners.model.ReflectiveCallable.run(ReflectiveCallable.java:12)
	at org.junit.runners.BlockJUnit4ClassRunner.methodBlock(BlockJUnit4ClassRunner.java:263)
	at org.junit.runners.BlockJUnit4ClassRunner.runChild(BlockJUnit4ClassRunner.java:78)
	at org.junit.runners.BlockJUnit4ClassRunner.runChild(BlockJUnit4ClassRunner.java:57)
	at org.junit.runners.ParentRunner$3.run(ParentRunner.java:290)
	at org.junit.runners.ParentRunner$1.schedule(ParentRunner.java:71)
	at org.junit.runners.ParentRunner.runChildren(ParentRunner.java:288)
	at org.junit.runners.ParentRunner.access$000(ParentRunner.java:58)
	at org.junit.runners.ParentRunner$2.evaluate(ParentRunner.java:268)
	at org.junit.internal.runners.statements.RunAfters.evaluate(RunAfters.java:27)
	at org.junit.runners.ParentRunner.run(ParentRunner.java:363)
	at org.junit.runners.Suite.runChild(Suite.java:128)
	at org.junit.runners.Suite.runChild(Suite.java:27)
	at org.junit.runners.ParentRunner$3.run(ParentRunner.java:290)
	at org.junit.runners.ParentRunner$1.schedule(ParentRunner.java:71)
	at org.junit.runners.ParentRunner.runChildren(ParentRunner.java:288)
	at org.junit.runners.ParentRunner.access$000(ParentRunner.java:58)
	at org.junit.runners.ParentRunner$2.evaluate(ParentRunner.java:268)
	at org.junit.runners.ParentRunner.run(ParentRunner.java:363)
	at org.junit.runner.JUnitCore.run(JUnitCore.java:137)
	at org.junit.runner.JUnitCore.run(JUnitCore.java:115)
	at org.apache.maven.surefire.junitcore.JUnitCoreWrapper.createRequestAndRun(JUnitCoreWrapper.java:108)
	at org.apache.maven.surefire.junitcore.JUnitCoreWrapper.executeEager(JUnitCoreWrapper.java:78)
	at org.apache.maven.surefire.junitcore.JUnitCoreWrapper.execute(JUnitCoreWrapper.java:54)
	at org.apache.maven.surefire.junitcore.JUnitCoreProvider.invoke(JUnitCoreProvider.java:144)
	at org.apache.maven.surefire.booter.ForkedBooter.invokeProviderInSameClassLoader(ForkedBooter.java:203)
	at org.apache.maven.surefire.booter.ForkedBooter.runSuitesInProcess(ForkedBooter.java:155)
	at org.apache.maven.surefire.booter.ForkedBooter.main(ForkedBooter.java:103)

org.apache.hadoop.hbase.TestHBaseConfiguration  Time elapsed: 0.036 sec  <<< ERROR!
java.lang.NoClassDefFoundError: Could not initialize class org.apache.hadoop.hbase.TestHBaseConfiguration
	at sun.reflect.NativeMethodAccessorImpl.invoke0(Native Method)
	at sun.reflect.NativeMethodAccessorImpl.invoke(NativeMethodAccessorImpl.java:62)
	at sun.reflect.DelegatingMethodAccessorImpl.invoke(DelegatingMethodAccessorImpl.java:43)
	at java.lang.reflect.Method.invoke(Method.java:498)
	at org.junit.runners.model.FrameworkMethod$1.runReflectiveCall(FrameworkMethod.java:50)
	at org.junit.internal.runners.model.ReflectiveCallable.run(ReflectiveCallable.java:12)
	at org.junit.runners.model.FrameworkMethod.invokeExplosively(FrameworkMethod.java:47)
	at org.junit.internal.runners.statements.RunAfters.evaluate(RunAfters.java:33)
	at org.junit.runners.ParentRunner.run(ParentRunner.java:363)
	at org.junit.runners.Suite.runChild(Suite.java:128)
	at org.junit.runners.Suite.runChild(Suite.java:27)
	at org.junit.runners.ParentRunner$3.run(ParentRunner.java:290)
	at org.junit.runners.ParentRunner$1.schedule(ParentRunner.java:71)
	at org.junit.runners.ParentRunner.runChildren(ParentRunner.java:288)
	at org.junit.runners.ParentRunner.access$000(ParentRunner.java:58)
	at org.junit.runners.ParentRunner$2.evaluate(ParentRunner.java:268)
	at org.junit.runners.ParentRunner.run(ParentRunner.java:363)
	at org.junit.runner.JUnitCore.run(JUnitCore.java:137)
	at org.junit.runner.JUnitCore.run(JUnitCore.java:115)
	at org.apache.maven.surefire.junitcore.JUnitCoreWrapper.createRequestAndRun(JUnitCoreWrapper.java:108)
	at org.apache.maven.surefire.junitcore.JUnitCoreWrapper.executeEager(JUnitCoreWrapper.java:78)
	at org.apache.maven.surefire.junitcore.JUnitCoreWrapper.execute(JUnitCoreWrapper.java:54)
	at org.apache.maven.surefire.junitcore.JUnitCoreProvider.invoke(JUnitCoreProvider.java:144)
	at org.apache.maven.surefire.booter.ForkedBooter.invokeProviderInSameClassLoader(ForkedBooter.java:203)
	at org.apache.maven.surefire.booter.ForkedBooter.runSuitesInProcess(ForkedBooter.java:155)
	at org.apache.maven.surefire.booter.ForkedBooter.main(ForkedBooter.java:103)

Java HotSpot(TM) 64-Bit Server VM warning: ignoring option MaxPermSize=256m; support was removed
in 8.0
Running org.apache.hadoop.hbase.TestChoreService
Tests run: 17, Failures: 0, Errors: 0, Skipped: 0, Time elapsed: 22.268 sec - in org.apache.hadoop.hbase.TestChoreService

Results :

Tests in error: 
org.apache.hadoop.hbase.TestClassFinder.org.apache.hadoop.hbase.TestClassFinder
  Run 1: TestClassFinder.org.apache.hadoop.hbase.TestClassFinder » ExceptionInInitializer
  Run 2: TestClassFinder.org.apache.hadoop.hbase.TestClassFinder » NoClassDefFound Coul...

  TestHBaseConfiguration.org.apache.hadoop.hbase.TestHBaseConfiguration » NoClassDefFound
  TestHBaseConfiguration.testGetIntDeprecated » NoClassDefFound Could not initia...
  TestHBaseConfiguration.testGetPassword » ExceptionInInitializer
  TestHBaseConfiguration.testSubset » NoClassDefFound Could not initialize class...
  TestCipherProvider.testCustomProvider:128 » Runtime hbase-default.xml file see...
  TestCipherProvider.testDefaultProvider:142 » Runtime hbase-default.xml file se...
  TestEncryption.testLargeBlocks:62->checkTransformSymmetry:92 » Runtime hbase-d...
  TestEncryption.testOddSizedBlocks:73->checkTransformSymmetry:92 » Runtime hbas...
  TestEncryption.testSmallBlocks:51->checkTransformSymmetry:92 » Runtime hbase-d...
  TestEncryption.testTypicalHFileBlocks:84->checkTransformSymmetry:92 » Runtime ...
  TestKeyProvider.testTestProvider:39 » Runtime hbase-default.xml file seems to ...
  TestKeyStoreKeyProvider.org.apache.hadoop.hbase.io.crypto.TestKeyStoreKeyProvider » ExceptionInInitializer
  TestAES.testAESAlgorithm:56 » Runtime hbase-default.xml file seems to be for a...
  TestAES.testAlternateRNG:91 » Runtime hbase-default.xml file seems to be for a...
  TestCoprocessorClassLoader.testCleanupOldJars » NoClassDefFound Could not init...
  TestCoprocessorClassLoader.testDirectoryAndWildcard » NoClassDefFound Could no...
  TestCoprocessorClassLoader.testLibJarName » NoClassDefFound Could not initiali...
  TestCoprocessorClassLoader.testRelativeLibJarName » ExceptionInInitializer
  TestDynamicClassLoader.testLoadClassFromAnotherPath » ExceptionInInitializer
  TestDynamicClassLoader.testLoadClassFromLocalPath » NoClassDefFound Could not ...
  TestDynamicClassLoader.testLoadClassFromLocalPathWithDynamicDirOff » NoClassDefFound
  TestZKConfig.testClusterKey:62->testKey:91->testKey:111 » Runtime hbase-defaul...
  TestZKConfig.testClusterKeyWithMultiplePorts:74->testKey:111 » Runtime hbase-d...
  TestZKConfig.testGetZooKeeperClusterKey:51 » Runtime hbase-default.xml file se...
  TestZKConfig.testZKConfigLoading:39 » Runtime hbase-default.xml file seems to ...

Tests run: 236, Failures: 0, Errors: 26, Skipped: 1

[INFO] ------------------------------------------------------------------------
[INFO] Reactor Summary:
[INFO] 
[INFO] Apache HBase ...................................... SUCCESS [3.097s]
[INFO] Apache HBase - Checkstyle ......................... SUCCESS [1.094s]
[INFO] Apache HBase - Resource Bundle .................... SUCCESS [0.352s]
[INFO] Apache HBase - Annotations ........................ SUCCESS [0.405s]
[INFO] Apache HBase - Protocol ........................... SUCCESS [4.574s]
[INFO] Apache HBase - Common ............................. FAILURE [1:38.926s]
[INFO] Apache HBase - Procedure .......................... SKIPPED
[INFO] Apache HBase - Client ............................. SKIPPED
[INFO] Apache HBase - Hadoop Compatibility ............... SKIPPED
[INFO] Apache HBase - Hadoop Two Compatibility ........... SKIPPED
[INFO] Apache HBase - Prefix Tree ........................ SKIPPED
[INFO] Apache HBase - Server ............................. SKIPPED
[INFO] Apache HBase - Testing Util ....................... SKIPPED
[INFO] Apache HBase - Thrift ............................. SKIPPED
[INFO] Apache HBase - RSGroup ............................ SKIPPED
[INFO] Apache HBase - Shell .............................. SKIPPED
[INFO] Apache HBase - Integration Tests .................. SKIPPED
[INFO] Apache HBase - Examples ........................... SKIPPED
[INFO] Apache HBase - Rest ............................... SKIPPED
[INFO] Apache HBase - External Block Cache ............... SKIPPED
[INFO] Apache HBase - Spark .............................. SKIPPED
[INFO] Apache HBase - Assembly ........................... SKIPPED
[INFO] Apache HBase - Shaded ............................. SKIPPED
[INFO] Apache HBase - Shaded - Client .................... SKIPPED
[INFO] Apache HBase - Shaded - Server .................... SKIPPED
[INFO] Apache HBase - Archetypes ......................... SKIPPED
[INFO] Apache HBase - Exemplar for hbase-client archetype  SKIPPED
[INFO] Apache HBase - Exemplar for hbase-shaded-client archetype  SKIPPED
[INFO] Apache HBase - Archetype builder .................. SKIPPED
[INFO] ------------------------------------------------------------------------
[INFO] BUILD FAILURE
[INFO] ------------------------------------------------------------------------
[INFO] Total time: 1:50.324s
[INFO] Finished at: Mon Aug 15 09:45:21 UTC 2016
[INFO] Final Memory: 53M/1115M
[INFO] ------------------------------------------------------------------------
[ERROR] Failed to execute goal org.apache.maven.plugins:maven-surefire-plugin:2.18.1:test
(default-test) on project hbase-common: There are test failures.
[ERROR] 
[ERROR] Please refer to <https://builds.apache.org/job/HBase-Trunk_matrix/jdk=JDK%201.8%20(latest),label=yahoo-not-h2/ws/hbase-common/target/surefire-reports>
for the individual test results.
[ERROR] -> [Help 1]
[ERROR] 
[ERROR] To see the full stack trace of the errors, re-run Maven with the -e switch.
[ERROR] Re-run Maven using the -X switch to enable full debug logging.
[ERROR] 
[ERROR] For more information about the errors and possible solutions, please read the following
articles:
[ERROR] [Help 1] http://cwiki.apache.org/confluence/display/MAVEN/MojoFailureException
[ERROR] 
[ERROR] After correcting the problems, you can resume the build with the command
[ERROR]   mvn <goals> -rf :hbase-common
Build step 'Invoke top-level Maven targets' marked build as failure
Performing Post build task...
Match found for :.* : True
Logical operation result is TRUE
Running script  : # Run zombie detector script
./dev-support/zombie-detector.sh --jenkins ${BUILD_ID}
[yahoo-not-h2] $ /bin/bash -xe /tmp/hudson1612572176806137261.sh
+ ./dev-support/zombie-detector.sh --jenkins 1418
Mon Aug 15 09:45:22 UTC 2016 We're ok: there is no zombie test


    {color:green}+1 zombies{color}. No zombie tests found running at the end of the build.
POST BUILD TASK : SUCCESS
END OF POST BUILD TASK : 0
Archiving artifacts
No prior successful build to compare, so performing full copy of artifacts
Recording test results
[FINDBUGS] Skipping publisher since build result is FAILURE
[CHECKSTYLE] Skipping publisher since build result is FAILURE

Mime
View raw message