hbase-builds mailing list archives

Site index · List index
Message view « Date » · « Thread »
Top « Date » · « Thread »
From Apache Jenkins Server <jenk...@builds.apache.org>
Subject Build failed in Jenkins: HBase-Trunk_matrix » latest1.7,yahoo-not-h2 #1341
Date Tue, 02 Aug 2016 15:15:01 GMT
See <https://builds.apache.org/job/HBase-Trunk_matrix/jdk=latest1.7,label=yahoo-not-h2/1341/>

------------------------------------------
[...truncated 5622 lines...]
Running org.apache.hadoop.hbase.master.procedure.TestModifyColumnFamilyProcedure
Running org.apache.hadoop.hbase.master.procedure.TestRestoreSnapshotProcedure
Tests run: 12, Failures: 0, Errors: 0, Skipped: 0, Time elapsed: 32.694 sec - in org.apache.hadoop.hbase.master.procedure.TestMasterProcedureScheduler
Running org.apache.hadoop.hbase.master.procedure.TestModifyTableProcedure
Tests run: 5, Failures: 0, Errors: 0, Skipped: 0, Time elapsed: 27.345 sec - in org.apache.hadoop.hbase.master.procedure.TestModifyColumnFamilyProcedure
Running org.apache.hadoop.hbase.master.procedure.TestWALProcedureStoreOnHDFS
Tests run: 9, Failures: 0, Errors: 0, Skipped: 0, Time elapsed: 50.12 sec - in org.apache.hadoop.hbase.master.procedure.TestCreateTableProcedure
Tests run: 15, Failures: 0, Errors: 0, Skipped: 1, Time elapsed: 149.167 sec - in org.apache.hadoop.hbase.master.TestSplitLogManager
Running org.apache.hadoop.hbase.master.procedure.TestMasterProcedureEvents
Running org.apache.hadoop.hbase.master.procedure.TestDisableTableProcedure
Tests run: 2, Failures: 0, Errors: 0, Skipped: 0, Time elapsed: 12.564 sec - in org.apache.hadoop.hbase.master.procedure.TestMasterProcedureEvents
Tests run: 8, Failures: 0, Errors: 0, Skipped: 0, Time elapsed: 52.33 sec - in org.apache.hadoop.hbase.master.procedure.TestModifyTableProcedure
Tests run: 4, Failures: 0, Errors: 0, Skipped: 0, Time elapsed: 19.807 sec - in org.apache.hadoop.hbase.master.procedure.TestDisableTableProcedure
Tests run: 3, Failures: 0, Errors: 0, Skipped: 0, Time elapsed: 45.328 sec - in org.apache.hadoop.hbase.master.procedure.TestWALProcedureStoreOnHDFS
Running org.apache.hadoop.hbase.master.procedure.TestDeleteColumnFamilyProcedureFromClient
Running org.apache.hadoop.hbase.master.procedure.TestDeleteTableProcedure
Running org.apache.hadoop.hbase.master.procedure.TestTruncateTableProcedure
Running org.apache.hadoop.hbase.master.procedure.TestCreateNamespaceProcedure
Tests run: 8, Failures: 0, Errors: 0, Skipped: 0, Time elapsed: 11.3 sec - in org.apache.hadoop.hbase.master.procedure.TestCreateNamespaceProcedure
Tests run: 2, Failures: 0, Errors: 0, Skipped: 0, Time elapsed: 30.121 sec - in org.apache.hadoop.hbase.master.procedure.TestDeleteColumnFamilyProcedureFromClient
Running org.apache.hadoop.hbase.master.procedure.TestServerCrashProcedure
Tests run: 7, Failures: 0, Errors: 0, Skipped: 0, Time elapsed: 20.138 sec - in org.apache.hadoop.hbase.master.procedure.TestDeleteTableProcedure
Running org.apache.hadoop.hbase.master.procedure.TestCloneSnapshotProcedure
Running org.apache.hadoop.hbase.master.procedure.TestDeleteColumnFamilyProcedure
Tests run: 6, Failures: 0, Errors: 0, Skipped: 0, Time elapsed: 40.208 sec - in org.apache.hadoop.hbase.master.procedure.TestTruncateTableProcedure
Tests run: 1, Failures: 0, Errors: 0, Skipped: 0, Time elapsed: 26.268 sec - in org.apache.hadoop.hbase.master.procedure.TestServerCrashProcedure
Running org.apache.hadoop.hbase.master.TestMasterStatusServlet
Tests run: 5, Failures: 0, Errors: 0, Skipped: 0, Time elapsed: 23.398 sec - in org.apache.hadoop.hbase.master.procedure.TestCloneSnapshotProcedure
Tests run: 4, Failures: 0, Errors: 0, Skipped: 0, Time elapsed: 1.782 sec - in org.apache.hadoop.hbase.master.TestMasterStatusServlet
Running org.apache.hadoop.hbase.master.TestMasterNoCluster
Running org.apache.hadoop.hbase.master.procedure.TestProcedureAdmin
Running org.apache.hadoop.hbase.master.normalizer.TestSimpleRegionNormalizerOnCluster
Tests run: 3, Failures: 0, Errors: 0, Skipped: 0, Time elapsed: 16.584 sec - in org.apache.hadoop.hbase.master.TestMasterNoCluster
Tests run: 5, Failures: 0, Errors: 0, Skipped: 0, Time elapsed: 14.719 sec - in org.apache.hadoop.hbase.master.procedure.TestProcedureAdmin
Running org.apache.hadoop.hbase.master.TestGetLastFlushedSequenceId
Tests run: 8, Failures: 0, Errors: 0, Skipped: 0, Time elapsed: 37.512 sec - in org.apache.hadoop.hbase.master.procedure.TestDeleteColumnFamilyProcedure
Running org.apache.hadoop.hbase.master.snapshot.TestSnapshotFileCache
Running org.apache.hadoop.hbase.master.TestMaster
Tests run: 1, Failures: 0, Errors: 0, Skipped: 0, Time elapsed: 24.398 sec - in org.apache.hadoop.hbase.master.TestGetLastFlushedSequenceId
Tests run: 4, Failures: 0, Errors: 0, Skipped: 0, Time elapsed: 18.968 sec - in org.apache.hadoop.hbase.master.TestMaster
Running org.apache.hadoop.hbase.master.TestAssignmentManagerMetrics
Tests run: 2, Failures: 0, Errors: 0, Skipped: 0, Time elapsed: 50.163 sec - in org.apache.hadoop.hbase.master.normalizer.TestSimpleRegionNormalizerOnCluster
Running org.apache.hadoop.hbase.master.TestMetaShutdownHandler
Running org.apache.hadoop.hbase.master.TestMasterFailoverBalancerPersistence
Tests run: 1, Failures: 0, Errors: 0, Skipped: 0, Time elapsed: 10.32 sec - in org.apache.hadoop.hbase.master.TestAssignmentManagerMetrics
Tests run: 4, Failures: 0, Errors: 0, Skipped: 0, Time elapsed: 47.644 sec - in org.apache.hadoop.hbase.master.snapshot.TestSnapshotFileCache
Tests run: 5, Failures: 0, Errors: 1, Skipped: 0, Time elapsed: 219.271 sec <<< FAILURE!
- in org.apache.hadoop.hbase.master.procedure.TestRestoreSnapshotProcedure
testRestoreSnapshotToEnabledTable(org.apache.hadoop.hbase.master.procedure.TestRestoreSnapshotProcedure)
 Time elapsed: 80.287 sec  <<< ERROR!
org.junit.runners.model.TestTimedOutException: test timed out after 60000 milliseconds
	at java.lang.Thread.sleep(Native Method)
	at org.apache.hadoop.hbase.client.HBaseAdmin$ProcedureFuture.waitProcedureResult(HBaseAdmin.java:3381)
	at org.apache.hadoop.hbase.client.HBaseAdmin$ProcedureFuture.get(HBaseAdmin.java:3311)
	at org.apache.hadoop.hbase.client.HBaseAdmin.get(HBaseAdmin.java:1975)
	at org.apache.hadoop.hbase.client.HBaseAdmin.enableTable(HBaseAdmin.java:697)
	at org.apache.hadoop.hbase.master.procedure.TestRestoreSnapshotProcedure.testRestoreSnapshotToEnabledTable(TestRestoreSnapshotProcedure.java:235)

Running org.apache.hadoop.hbase.master.TestRollingRestart
Running org.apache.hadoop.hbase.master.TestGetInfoPort
Tests run: 1, Failures: 0, Errors: 0, Skipped: 0, Time elapsed: 17.882 sec - in org.apache.hadoop.hbase.master.TestMasterFailoverBalancerPersistence
Running org.apache.hadoop.hbase.master.TestMasterMetrics
Running org.apache.hadoop.hbase.master.TestMasterShutdown
Tests run: 3, Failures: 0, Errors: 0, Skipped: 0, Time elapsed: 1.833 sec - in org.apache.hadoop.hbase.master.TestMasterMetrics
Running org.apache.hadoop.hbase.master.TestRestartCluster
Tests run: 1, Failures: 0, Errors: 0, Skipped: 0, Time elapsed: 15.044 sec - in org.apache.hadoop.hbase.master.TestGetInfoPort
Tests run: 1, Failures: 0, Errors: 0, Skipped: 0, Time elapsed: 32.422 sec - in org.apache.hadoop.hbase.master.TestMetaShutdownHandler
Running org.apache.hadoop.hbase.master.cleaner.TestLogsCleaner
Tests run: 2, Failures: 0, Errors: 0, Skipped: 0, Time elapsed: 22.049 sec - in org.apache.hadoop.hbase.master.TestMasterShutdown
Running org.apache.hadoop.hbase.master.cleaner.TestHFileLinkCleaner
Tests run: 3, Failures: 0, Errors: 0, Skipped: 0, Time elapsed: 12.105 sec - in org.apache.hadoop.hbase.master.cleaner.TestLogsCleaner
Running org.apache.hadoop.hbase.master.cleaner.TestSnapshotFromMaster
Running org.apache.hadoop.hbase.master.cleaner.TestHFileCleaner
Tests run: 1, Failures: 0, Errors: 0, Skipped: 0, Time elapsed: 38.016 sec - in org.apache.hadoop.hbase.master.TestRollingRestart
Tests run: 3, Failures: 0, Errors: 0, Skipped: 0, Time elapsed: 1.276 sec - in org.apache.hadoop.hbase.master.cleaner.TestHFileCleaner
Tests run: 1, Failures: 0, Errors: 0, Skipped: 0, Time elapsed: 10.882 sec - in org.apache.hadoop.hbase.master.cleaner.TestHFileLinkCleaner
Running org.apache.hadoop.hbase.master.TestMasterTransitions
Tests run: 3, Failures: 0, Errors: 0, Skipped: 3, Time elapsed: 0.001 sec - in org.apache.hadoop.hbase.master.TestMasterTransitions
Running org.apache.hadoop.hbase.master.TestClusterStatusPublisher
Tests run: 3, Failures: 0, Errors: 0, Skipped: 0, Time elapsed: 0.294 sec - in org.apache.hadoop.hbase.master.TestClusterStatusPublisher
Running org.apache.hadoop.hbase.master.TestHMasterRPCException
Tests run: 1, Failures: 0, Errors: 0, Skipped: 0, Time elapsed: 5.427 sec - in org.apache.hadoop.hbase.master.TestHMasterRPCException
Running org.apache.hadoop.hbase.master.TestTableLockManager
Running org.apache.hadoop.hbase.master.TestAssignmentListener
Running org.apache.hadoop.hbase.master.TestMasterMetricsWrapper
Tests run: 1, Failures: 0, Errors: 0, Skipped: 0, Time elapsed: 2.742 sec - in org.apache.hadoop.hbase.master.TestMasterMetricsWrapper
Tests run: 2, Failures: 0, Errors: 0, Skipped: 0, Time elapsed: 59 sec - in org.apache.hadoop.hbase.master.TestRestartCluster
Tests run: 2, Failures: 0, Errors: 0, Skipped: 0, Time elapsed: 12.125 sec - in org.apache.hadoop.hbase.master.TestAssignmentListener
Running org.apache.hadoop.hbase.master.balancer.TestDefaultLoadBalancer
Running org.apache.hadoop.hbase.master.balancer.TestStochasticLoadBalancer
Tests run: 1, Failures: 0, Errors: 0, Skipped: 0, Time elapsed: 4.513 sec - in org.apache.hadoop.hbase.master.balancer.TestDefaultLoadBalancer
Running org.apache.hadoop.hbase.master.TestWarmupRegion
Running org.apache.hadoop.hbase.master.balancer.TestBaseLoadBalancer
Tests run: 6, Failures: 0, Errors: 0, Skipped: 0, Time elapsed: 0.743 sec - in org.apache.hadoop.hbase.master.balancer.TestBaseLoadBalancer
Running org.apache.hadoop.hbase.master.balancer.TestStochasticLoadBalancer2
Tests run: 4, Failures: 0, Errors: 0, Skipped: 0, Time elapsed: 49.684 sec - in org.apache.hadoop.hbase.master.cleaner.TestSnapshotFromMaster
Running org.apache.hadoop.hbase.master.TestTableStateManager
Tests run: 1, Failures: 0, Errors: 0, Skipped: 0, Time elapsed: 23.265 sec - in org.apache.hadoop.hbase.master.TestTableStateManager
Running org.apache.hadoop.hbase.master.TestMasterRestartAfterDisablingTable
Tests run: 1, Failures: 0, Errors: 0, Skipped: 0, Time elapsed: 39.238 sec - in org.apache.hadoop.hbase.master.TestWarmupRegion
Running org.apache.hadoop.hbase.master.TestMasterWalManager
Tests run: 1, Failures: 0, Errors: 0, Skipped: 0, Time elapsed: 1.898 sec - in org.apache.hadoop.hbase.master.TestMasterWalManager
Tests run: 1, Failures: 0, Errors: 0, Skipped: 0, Time elapsed: 25.619 sec - in org.apache.hadoop.hbase.master.TestMasterRestartAfterDisablingTable
Running org.apache.hadoop.hbase.TestMetaTableAccessorNoCluster
Running org.apache.hadoop.hbase.master.TestDistributedLogSplitting
Tests run: 2, Failures: 0, Errors: 0, Skipped: 0, Time elapsed: 2.496 sec - in org.apache.hadoop.hbase.TestMetaTableAccessorNoCluster
Running org.apache.hadoop.hbase.mapred.TestTableSnapshotInputFormat
Tests run: 4, Failures: 0, Errors: 0, Skipped: 0, Time elapsed: 104.096 sec - in org.apache.hadoop.hbase.master.TestTableLockManager
Running org.apache.hadoop.hbase.mapred.TestMultiTableSnapshotInputFormat
Tests run: 18, Failures: 0, Errors: 0, Skipped: 15, Time elapsed: 50.479 sec - in org.apache.hadoop.hbase.master.TestDistributedLogSplitting
Running org.apache.hadoop.hbase.mapred.TestTableMapReduceUtil
Tests run: 4, Failures: 0, Errors: 0, Skipped: 0, Time elapsed: 16.87 sec - in org.apache.hadoop.hbase.mapred.TestTableMapReduceUtil
Tests run: 4, Failures: 0, Errors: 0, Skipped: 0, Time elapsed: 55.431 sec - in org.apache.hadoop.hbase.mapred.TestMultiTableSnapshotInputFormat
Running org.apache.hadoop.hbase.mapred.TestTableOutputFormatConnectionExhaust
Running org.apache.hadoop.hbase.mapred.TestTableInputFormat
Tests run: 1, Failures: 0, Errors: 0, Skipped: 0, Time elapsed: 13.684 sec - in org.apache.hadoop.hbase.mapred.TestTableOutputFormatConnectionExhaust
Tests run: 8, Failures: 0, Errors: 0, Skipped: 0, Time elapsed: 26.834 sec - in org.apache.hadoop.hbase.mapred.TestTableInputFormat
Running org.apache.hadoop.hbase.TestIOFencing
Running org.apache.hadoop.hbase.mapred.TestTableMapReduce
Tests run: 7, Failures: 0, Errors: 0, Skipped: 0, Time elapsed: 161.004 sec - in org.apache.hadoop.hbase.mapred.TestTableSnapshotInputFormat
Running org.apache.hadoop.hbase.TestMetaTableLocator
Tests run: 7, Failures: 0, Errors: 0, Skipped: 0, Time elapsed: 5.59 sec - in org.apache.hadoop.hbase.TestMetaTableLocator
Tests run: 2, Failures: 0, Errors: 0, Skipped: 0, Time elapsed: 27.481 sec - in org.apache.hadoop.hbase.mapred.TestTableMapReduce
Running org.apache.hadoop.hbase.util.TestHBaseFsckMOB
Running org.apache.hadoop.hbase.util.TestRegionSplitter
Tests run: 6, Failures: 0, Errors: 0, Skipped: 0, Time elapsed: 8.527 sec - in org.apache.hadoop.hbase.util.TestRegionSplitter
Tests run: 1, Failures: 0, Errors: 0, Skipped: 0, Time elapsed: 14.55 sec - in org.apache.hadoop.hbase.util.TestHBaseFsckMOB
Running org.apache.hadoop.hbase.util.TestFSHDFSUtils
Tests run: 3, Failures: 0, Errors: 0, Skipped: 0, Time elapsed: 8.021 sec - in org.apache.hadoop.hbase.util.TestFSHDFSUtils
Running org.apache.hadoop.hbase.util.TestFSVisitor
Running org.apache.hadoop.hbase.util.TestRegionMover
Tests run: 1, Failures: 0, Errors: 0, Skipped: 0, Time elapsed: 1.799 sec - in org.apache.hadoop.hbase.util.TestFSVisitor
Tests run: 2, Failures: 0, Errors: 0, Skipped: 0, Time elapsed: 73.837 sec - in org.apache.hadoop.hbase.TestIOFencing
Running org.apache.hadoop.hbase.util.TestIdReadWriteLock
Running org.apache.hadoop.hbase.util.TestHBaseFsckTwoRS
Tests run: 1, Failures: 0, Errors: 0, Skipped: 0, Time elapsed: 15.399 sec - in org.apache.hadoop.hbase.util.TestIdReadWriteLock
Running org.apache.hadoop.hbase.util.hbck.TestOfflineMetaRebuildOverlap
Tests run: 5, Failures: 0, Errors: 0, Skipped: 0, Time elapsed: 41.576 sec - in org.apache.hadoop.hbase.util.TestRegionMover
Running org.apache.hadoop.hbase.util.hbck.TestOfflineMetaRebuildHole
Tests run: 1, Failures: 0, Errors: 0, Skipped: 0, Time elapsed: 30.07 sec - in org.apache.hadoop.hbase.util.hbck.TestOfflineMetaRebuildOverlap
Running org.apache.hadoop.hbase.util.hbck.TestOfflineMetaRebuildBase
Tests run: 1, Failures: 0, Errors: 0, Skipped: 0, Time elapsed: 31.063 sec - in org.apache.hadoop.hbase.util.hbck.TestOfflineMetaRebuildHole
Running org.apache.hadoop.hbase.util.TestConnectionCache
Tests run: 21, Failures: 0, Errors: 0, Skipped: 1, Time elapsed: 366.602 sec - in org.apache.hadoop.hbase.master.balancer.TestStochasticLoadBalancer
Tests run: 1, Failures: 0, Errors: 0, Skipped: 0, Time elapsed: 28.562 sec - in org.apache.hadoop.hbase.util.hbck.TestOfflineMetaRebuildBase
Running org.apache.hadoop.hbase.util.TestFSTableDescriptors
Running org.apache.hadoop.hbase.util.TestDefaultEnvironmentEdge
Tests run: 1, Failures: 0, Errors: 0, Skipped: 0, Time elapsed: 0.164 sec - in org.apache.hadoop.hbase.util.TestDefaultEnvironmentEdge
Running org.apache.hadoop.hbase.util.TestTableName
Tests run: 16, Failures: 0, Errors: 0, Skipped: 0, Time elapsed: 2.575 sec - in org.apache.hadoop.hbase.util.TestFSTableDescriptors
Tests run: 6, Failures: 0, Errors: 0, Skipped: 0, Time elapsed: 0.365 sec - in org.apache.hadoop.hbase.util.TestTableName
Running org.apache.hadoop.hbase.util.TestIdLock
Running org.apache.hadoop.hbase.util.TestMiniClusterLoadSequential
Tests run: 1, Failures: 0, Errors: 0, Skipped: 0, Time elapsed: 20.598 sec - in org.apache.hadoop.hbase.util.TestConnectionCache
Tests run: 1, Failures: 0, Errors: 0, Skipped: 0, Time elapsed: 15.207 sec - in org.apache.hadoop.hbase.util.TestIdLock
Running org.apache.hadoop.hbase.util.TestFSUtils
Tests run: 9, Failures: 0, Errors: 0, Skipped: 0, Time elapsed: 88.166 sec - in org.apache.hadoop.hbase.util.TestHBaseFsckTwoRS
Running org.apache.hadoop.hbase.util.TestMergeTool
Running org.apache.hadoop.hbase.util.TestCoprocessorScanPolicy
Tests run: 1, Failures: 0, Errors: 0, Skipped: 0, Time elapsed: 20.175 sec - in org.apache.hadoop.hbase.util.TestMergeTool
Tests run: 4, Failures: 0, Errors: 0, Skipped: 0, Time elapsed: 19.387 sec - in org.apache.hadoop.hbase.util.TestCoprocessorScanPolicy
Tests run: 11, Failures: 0, Errors: 0, Skipped: 0, Time elapsed: 28.379 sec - in org.apache.hadoop.hbase.util.TestFSUtils
Running org.apache.hadoop.hbase.util.TestMergeTable
Running org.apache.hadoop.hbase.util.TestHBaseFsckEncryption
Running org.apache.hadoop.hbase.TestMetaTableAccessor
Tests run: 1, Failures: 0, Errors: 0, Skipped: 0, Time elapsed: 20.716 sec - in org.apache.hadoop.hbase.util.TestHBaseFsckEncryption
Tests run: 4, Failures: 0, Errors: 0, Skipped: 0, Time elapsed: 67.507 sec - in org.apache.hadoop.hbase.util.TestMiniClusterLoadSequential
Tests run: 1, Failures: 0, Errors: 0, Skipped: 0, Time elapsed: 28.193 sec - in org.apache.hadoop.hbase.util.TestMergeTable
Tests run: 15, Failures: 0, Errors: 0, Skipped: 0, Time elapsed: 30.69 sec - in org.apache.hadoop.hbase.TestMetaTableAccessor
Tests run: 4, Failures: 0, Errors: 0, Skipped: 0, Time elapsed: 499.17 sec - in org.apache.hadoop.hbase.master.balancer.TestStochasticLoadBalancer2

Results :

Failed tests: 
  TestReplicationKillMasterRSCompressedWithMultipleWAL>TestReplicationKillMasterRS.killOneMasterRS:34->TestReplicationKillRS.loadTableAndKillRS:88
Waited too much time for queueFailover replication. Waited 13427ms.
Tests in error: 
  TestRestoreSnapshotProcedure.testRestoreSnapshotToEnabledTable:235 » TestTimedOut
  TestVisibilityLabelsWithCustomVisLabService>TestVisibilityLabels.testVisibilityLabelsOnRSRestart:378->TestVisibilityLabels.createTableAndWriteDataWithLabels:863->Object.wait:461->Object.wait:-2
» TestTimedOut

Tests run: 2291, Failures: 1, Errors: 2, Skipped: 46

[INFO] ------------------------------------------------------------------------
[INFO] Reactor Summary:
[INFO] 
[INFO] Apache HBase ...................................... SUCCESS [  2.869 s]
[INFO] Apache HBase - Checkstyle ......................... SUCCESS [  0.715 s]
[INFO] Apache HBase - Resource Bundle .................... SUCCESS [  0.281 s]
[INFO] Apache HBase - Annotations ........................ SUCCESS [  0.234 s]
[INFO] Apache HBase - Protocol ........................... SUCCESS [  3.700 s]
[INFO] Apache HBase - Common ............................. SUCCESS [01:35 min]
[INFO] Apache HBase - Procedure .......................... SUCCESS [01:42 min]
[INFO] Apache HBase - Client ............................. SUCCESS [ 43.160 s]
[INFO] Apache HBase - Hadoop Compatibility ............... SUCCESS [  7.746 s]
[INFO] Apache HBase - Hadoop Two Compatibility ........... SUCCESS [ 10.059 s]
[INFO] Apache HBase - Prefix Tree ........................ SUCCESS [ 11.346 s]
[INFO] Apache HBase - Server ............................. FAILURE [  01:26 h]
[INFO] Apache HBase - Testing Util ....................... SKIPPED
[INFO] Apache HBase - Thrift ............................. SKIPPED
[INFO] Apache HBase - RSGroup ............................ SKIPPED
[INFO] Apache HBase - Shell .............................. SKIPPED
[INFO] Apache HBase - Integration Tests .................. SKIPPED
[INFO] Apache HBase - Examples ........................... SKIPPED
[INFO] Apache HBase - Rest ............................... SKIPPED
[INFO] Apache HBase - External Block Cache ............... SKIPPED
[INFO] Apache HBase - Spark .............................. SKIPPED
[INFO] Apache HBase - Assembly ........................... SKIPPED
[INFO] Apache HBase - Shaded ............................. SKIPPED
[INFO] Apache HBase - Shaded - Client .................... SKIPPED
[INFO] Apache HBase - Shaded - Server .................... SKIPPED
[INFO] Apache HBase - Archetypes ......................... SKIPPED
[INFO] Apache HBase - Exemplar for hbase-client archetype  SKIPPED
[INFO] Apache HBase - Exemplar for hbase-shaded-client archetype  SKIPPED
[INFO] Apache HBase - Archetype builder .................. SKIPPED
[INFO] ------------------------------------------------------------------------
[INFO] BUILD FAILURE
[INFO] ------------------------------------------------------------------------
[INFO] Total time: 01:30 h
[INFO] Finished at: 2016-08-02T15:13:18+00:00
[INFO] Final Memory: 70M/587M
[INFO] ------------------------------------------------------------------------
[ERROR] Failed to execute goal org.apache.maven.plugins:maven-surefire-plugin:2.18.1:test
(secondPartTestsExecution) on project hbase-server: There are test failures.
[ERROR] 
[ERROR] Please refer to <https://builds.apache.org/job/HBase-Trunk_matrix/jdk=latest1.7,label=yahoo-not-h2/ws/hbase-server/target/surefire-reports>
for the individual test results.
[ERROR] -> [Help 1]
[ERROR] 
[ERROR] To see the full stack trace of the errors, re-run Maven with the -e switch.
[ERROR] Re-run Maven using the -X switch to enable full debug logging.
[ERROR] 
[ERROR] For more information about the errors and possible solutions, please read the following
articles:
[ERROR] [Help 1] http://cwiki.apache.org/confluence/display/MAVEN/MojoFailureException
[ERROR] 
[ERROR] After correcting the problems, you can resume the build with the command
[ERROR]   mvn <goals> -rf :hbase-server
Build step 'Invoke top-level Maven targets' marked build as failure
Performing Post build task...
Match found for :.* : True
Logical operation result is TRUE
Running script  : # Run zombie detector script
./dev-support/zombie-detector.sh --jenkins ${BUILD_ID}
[yahoo-not-h2] $ /bin/bash -xe /tmp/hudson3837249084952190646.sh
+ ./dev-support/zombie-detector.sh --jenkins 1341
Tue Aug  2 15:13:19 UTC 2016 We're ok: there is no zombie test


    {color:green}+1 zombies{color}. No zombie tests found running at the end of the build.
POST BUILD TASK : SUCCESS
END OF POST BUILD TASK : 0
Archiving artifacts
Recording test results
[FINDBUGS] Skipping publisher since build result is FAILURE
[CHECKSTYLE] Skipping publisher since build result is FAILURE

Mime
View raw message