hbase-builds mailing list archives

Site index · List index
Message view « Date » · « Thread »
Top « Date » · « Thread »
From Apache Jenkins Server <jenk...@builds.apache.org>
Subject Build failed in Jenkins: HBase-0.98-matrix » JDK 1.7 (latest),yahoo-not-h2 #394
Date Wed, 31 Aug 2016 12:54:09 GMT
See <https://builds.apache.org/job/HBase-0.98-matrix/jdk=JDK%201.7%20(latest),label=yahoo-not-h2/394/changes>

Changes:

[zhangduo] HBASE-16535 Use regex to exclude generated classes for findbugs

------------------------------------------
[...truncated 29183 lines...]
	at org.apache.hadoop.hbase.io.crypto.TestEncryption.checkTransformSymmetry(TestEncryption.java:90)
	at org.apache.hadoop.hbase.io.crypto.TestEncryption.testOddSizedBlocks(TestEncryption.java:71)

testLargeBlocks(org.apache.hadoop.hbase.io.crypto.TestEncryption)  Time elapsed: 0.122 sec
 <<< ERROR!
java.lang.RuntimeException: hbase-default.xml file seems to be for and old version of HBase
(0.98.22-SNAPSHOT), this version is Unknown
	at org.apache.hadoop.hbase.HBaseConfiguration.checkDefaultsVersion(HBaseConfiguration.java:74)
	at org.apache.hadoop.hbase.HBaseConfiguration.addHbaseResources(HBaseConfiguration.java:106)
	at org.apache.hadoop.hbase.HBaseConfiguration.create(HBaseConfiguration.java:121)
	at org.apache.hadoop.hbase.io.crypto.TestEncryption.checkTransformSymmetry(TestEncryption.java:90)
	at org.apache.hadoop.hbase.io.crypto.TestEncryption.testLargeBlocks(TestEncryption.java:60)

Running org.apache.hadoop.hbase.io.crypto.TestKeyProvider
Tests run: 1, Failures: 0, Errors: 1, Skipped: 0, Time elapsed: 0.362 sec <<< FAILURE!
- in org.apache.hadoop.hbase.io.crypto.TestKeyProvider
testTestProvider(org.apache.hadoop.hbase.io.crypto.TestKeyProvider)  Time elapsed: 0.34 sec
 <<< ERROR!
java.lang.RuntimeException: hbase-default.xml file seems to be for and old version of HBase
(0.98.22-SNAPSHOT), this version is Unknown
	at org.apache.hadoop.hbase.HBaseConfiguration.checkDefaultsVersion(HBaseConfiguration.java:74)
	at org.apache.hadoop.hbase.HBaseConfiguration.addHbaseResources(HBaseConfiguration.java:106)
	at org.apache.hadoop.hbase.HBaseConfiguration.create(HBaseConfiguration.java:121)
	at org.apache.hadoop.hbase.io.crypto.TestKeyProvider.testTestProvider(TestKeyProvider.java:39)

Running org.apache.hadoop.hbase.TestClassFinder
Tests run: 2, Failures: 0, Errors: 2, Skipped: 0, Time elapsed: 0.009 sec <<< FAILURE!
- in org.apache.hadoop.hbase.TestClassFinder
org.apache.hadoop.hbase.TestClassFinder  Time elapsed: 0.007 sec  <<< ERROR!
java.lang.ExceptionInInitializerError: null
	at org.apache.hadoop.hbase.HBaseConfiguration.checkDefaultsVersion(HBaseConfiguration.java:74)
	at org.apache.hadoop.hbase.HBaseConfiguration.addHbaseResources(HBaseConfiguration.java:106)
	at org.apache.hadoop.hbase.HBaseConfiguration.create(HBaseConfiguration.java:121)
	at org.apache.hadoop.hbase.HBaseCommonTestingUtility.<init>(HBaseCommonTestingUtility.java:46)
	at org.apache.hadoop.hbase.TestClassFinder.<clinit>(TestClassFinder.java:57)

org.apache.hadoop.hbase.TestClassFinder  Time elapsed: 0.008 sec  <<< ERROR!
java.lang.NoClassDefFoundError: Could not initialize class org.apache.hadoop.hbase.TestClassFinder
	at sun.reflect.NativeMethodAccessorImpl.invoke0(Native Method)
	at sun.reflect.NativeMethodAccessorImpl.invoke(NativeMethodAccessorImpl.java:57)
	at sun.reflect.DelegatingMethodAccessorImpl.invoke(DelegatingMethodAccessorImpl.java:43)
	at java.lang.reflect.Method.invoke(Method.java:606)
	at org.junit.runners.model.FrameworkMethod$1.runReflectiveCall(FrameworkMethod.java:47)
	at org.junit.internal.runners.model.ReflectiveCallable.run(ReflectiveCallable.java:12)
	at org.junit.runners.model.FrameworkMethod.invokeExplosively(FrameworkMethod.java:44)
	at org.junit.internal.runners.statements.RunAfters.evaluate(RunAfters.java:33)
	at org.junit.runners.ParentRunner.run(ParentRunner.java:309)
	at org.junit.runners.Suite.runChild(Suite.java:127)
	at org.junit.runners.Suite.runChild(Suite.java:26)
	at org.junit.runners.ParentRunner$3.run(ParentRunner.java:238)
	at org.junit.runners.ParentRunner$1.schedule(ParentRunner.java:63)
	at org.junit.runners.ParentRunner.runChildren(ParentRunner.java:236)
	at org.junit.runners.ParentRunner.access$000(ParentRunner.java:53)
	at org.junit.runners.ParentRunner$2.evaluate(ParentRunner.java:229)
	at org.junit.runners.ParentRunner.run(ParentRunner.java:309)
	at org.junit.runner.JUnitCore.run(JUnitCore.java:160)
	at org.junit.runner.JUnitCore.run(JUnitCore.java:138)
	at org.apache.maven.surefire.junitcore.JUnitCoreWrapper.createRequestAndRun(JUnitCoreWrapper.java:108)
	at org.apache.maven.surefire.junitcore.JUnitCoreWrapper.executeEager(JUnitCoreWrapper.java:78)
	at org.apache.maven.surefire.junitcore.JUnitCoreWrapper.execute(JUnitCoreWrapper.java:54)
	at org.apache.maven.surefire.junitcore.JUnitCoreProvider.invoke(JUnitCoreProvider.java:144)
	at org.apache.maven.surefire.booter.ForkedBooter.invokeProviderInSameClassLoader(ForkedBooter.java:203)
	at org.apache.maven.surefire.booter.ForkedBooter.runSuitesInProcess(ForkedBooter.java:155)
	at org.apache.maven.surefire.booter.ForkedBooter.main(ForkedBooter.java:103)

Running org.apache.hadoop.hbase.TestCellUtil
Tests run: 2, Failures: 0, Errors: 0, Skipped: 0, Time elapsed: 0.276 sec - in org.apache.hadoop.hbase.TestCellUtil
Running org.apache.hadoop.hbase.TestCompoundConfiguration
Tests run: 6, Failures: 0, Errors: 0, Skipped: 0, Time elapsed: 0.699 sec - in org.apache.hadoop.hbase.TestCompoundConfiguration
Running org.apache.hadoop.hbase.zookeeper.TestZKConfig
Tests run: 4, Failures: 0, Errors: 4, Skipped: 0, Time elapsed: 0.606 sec <<< FAILURE!
- in org.apache.hadoop.hbase.zookeeper.TestZKConfig
testClusterKey(org.apache.hadoop.hbase.zookeeper.TestZKConfig)  Time elapsed: 0.282 sec  <<<
ERROR!
java.lang.RuntimeException: hbase-default.xml file seems to be for and old version of HBase
(0.98.22-SNAPSHOT), this version is Unknown
	at org.apache.hadoop.hbase.HBaseConfiguration.checkDefaultsVersion(HBaseConfiguration.java:74)
	at org.apache.hadoop.hbase.HBaseConfiguration.addHbaseResources(HBaseConfiguration.java:106)
	at org.apache.hadoop.hbase.HBaseConfiguration.create(HBaseConfiguration.java:121)
	at org.apache.hadoop.hbase.HBaseConfiguration.create(HBaseConfiguration.java:130)
	at org.apache.hadoop.hbase.HBaseConfiguration.createClusterConf(HBaseConfiguration.java:306)
	at org.apache.hadoop.hbase.HBaseConfiguration.createClusterConf(HBaseConfiguration.java:289)
	at org.apache.hadoop.hbase.zookeeper.TestZKConfig.testKey(TestZKConfig.java:112)
	at org.apache.hadoop.hbase.zookeeper.TestZKConfig.testKey(TestZKConfig.java:92)
	at org.apache.hadoop.hbase.zookeeper.TestZKConfig.testClusterKey(TestZKConfig.java:63)

testZKConfigLoading(org.apache.hadoop.hbase.zookeeper.TestZKConfig)  Time elapsed: 0.104 sec
 <<< ERROR!
java.lang.RuntimeException: hbase-default.xml file seems to be for and old version of HBase
(0.98.22-SNAPSHOT), this version is Unknown
	at org.apache.hadoop.hbase.HBaseConfiguration.checkDefaultsVersion(HBaseConfiguration.java:74)
	at org.apache.hadoop.hbase.HBaseConfiguration.addHbaseResources(HBaseConfiguration.java:106)
	at org.apache.hadoop.hbase.HBaseConfiguration.create(HBaseConfiguration.java:121)
	at org.apache.hadoop.hbase.zookeeper.TestZKConfig.testZKConfigLoading(TestZKConfig.java:40)

testGetZooKeeperClusterKey(org.apache.hadoop.hbase.zookeeper.TestZKConfig)  Time elapsed:
0.09 sec  <<< ERROR!
java.lang.RuntimeException: hbase-default.xml file seems to be for and old version of HBase
(0.98.22-SNAPSHOT), this version is Unknown
	at org.apache.hadoop.hbase.HBaseConfiguration.checkDefaultsVersion(HBaseConfiguration.java:74)
	at org.apache.hadoop.hbase.HBaseConfiguration.addHbaseResources(HBaseConfiguration.java:106)
	at org.apache.hadoop.hbase.HBaseConfiguration.create(HBaseConfiguration.java:121)
	at org.apache.hadoop.hbase.zookeeper.TestZKConfig.testGetZooKeeperClusterKey(TestZKConfig.java:52)

testClusterKeyWithMultiplePorts(org.apache.hadoop.hbase.zookeeper.TestZKConfig)  Time elapsed:
0.06 sec  <<< ERROR!
java.lang.RuntimeException: hbase-default.xml file seems to be for and old version of HBase
(0.98.22-SNAPSHOT), this version is Unknown
	at org.apache.hadoop.hbase.HBaseConfiguration.checkDefaultsVersion(HBaseConfiguration.java:74)
	at org.apache.hadoop.hbase.HBaseConfiguration.addHbaseResources(HBaseConfiguration.java:106)
	at org.apache.hadoop.hbase.HBaseConfiguration.create(HBaseConfiguration.java:121)
	at org.apache.hadoop.hbase.HBaseConfiguration.create(HBaseConfiguration.java:130)
	at org.apache.hadoop.hbase.HBaseConfiguration.createClusterConf(HBaseConfiguration.java:306)
	at org.apache.hadoop.hbase.HBaseConfiguration.createClusterConf(HBaseConfiguration.java:289)
	at org.apache.hadoop.hbase.zookeeper.TestZKConfig.testKey(TestZKConfig.java:112)
	at org.apache.hadoop.hbase.zookeeper.TestZKConfig.testClusterKeyWithMultiplePorts(TestZKConfig.java:75)


Results :

Tests in error: 
org.apache.hadoop.hbase.TestClassFinder.org.apache.hadoop.hbase.TestClassFinder
  Run 1: TestClassFinder.org.apache.hadoop.hbase.TestClassFinder » ExceptionInInitializer
  Run 2: TestClassFinder.org.apache.hadoop.hbase.TestClassFinder » NoClassDefFound Coul...

  TestHBaseConfiguration.org.apache.hadoop.hbase.TestHBaseConfiguration » NoClassDefFound
  TestHBaseConfiguration.testGetIntDeprecated » NoClassDefFound Could not initia...
  TestHBaseConfiguration.testGetPassword » ExceptionInInitializer
  TestHBaseConfiguration.testSubset » NoClassDefFound Could not initialize class...
  TestCipherProvider.testCustomProvider:126 » Runtime hbase-default.xml file see...
  TestCipherProvider.testDefaultProvider:140 » Runtime hbase-default.xml file se...
  TestEncryption.testLargeBlocks:60->checkTransformSymmetry:90 » Runtime hbase-d...
  TestEncryption.testOddSizedBlocks:71->checkTransformSymmetry:90 » Runtime hbas...
  TestEncryption.testSmallBlocks:49->checkTransformSymmetry:90 » Runtime hbase-d...
  TestEncryption.testTypicalHFileBlocks:82->checkTransformSymmetry:90 » Runtime ...
  TestKeyProvider.testTestProvider:39 » Runtime hbase-default.xml file seems to ...
  TestKeyStoreKeyProvider.org.apache.hadoop.hbase.io.crypto.TestKeyStoreKeyProvider » ExceptionInInitializer
  TestAES.testAESAlgorithm:54 » Runtime hbase-default.xml file seems to be for a...
  TestAES.testAlternateRNG:89 » Runtime hbase-default.xml file seems to be for a...
  TestCoprocessorClassLoader.testCleanupOldJars » NoClassDefFound Could not init...
  TestCoprocessorClassLoader.testDirectoryAndWildcard » NoClassDefFound Could no...
  TestCoprocessorClassLoader.testLibJarName » NoClassDefFound Could not initiali...
  TestCoprocessorClassLoader.testRelativeLibJarName » ExceptionInInitializer
  TestDynamicClassLoader.testLoadClassFromAnotherPath » ExceptionInInitializer
  TestDynamicClassLoader.testLoadClassFromLocalPath » NoClassDefFound Could not ...
  TestDynamicClassLoader.testLoadClassFromLocalPathWithDynamicDirOff » NoClassDefFound
  TestZKConfig.testClusterKey:63->testKey:92->testKey:112 » Runtime hbase-defaul...
  TestZKConfig.testClusterKeyWithMultiplePorts:75->testKey:112 » Runtime hbase-d...
  TestZKConfig.testGetZooKeeperClusterKey:52 » Runtime hbase-default.xml file se...
  TestZKConfig.testZKConfigLoading:40 » Runtime hbase-default.xml file seems to ...

Tests run: 170, Failures: 0, Errors: 26, Skipped: 0

[INFO] ------------------------------------------------------------------------
[INFO] Reactor Summary:
[INFO] 
[INFO] Apache HBase ...................................... SUCCESS [1:32.598s]
[INFO] Apache HBase - Checkstyle ......................... SUCCESS [9.628s]
[INFO] Apache HBase - Resource Bundle .................... SUCCESS [0.249s]
[INFO] Apache HBase - Annotations ........................ SUCCESS [1.185s]
[INFO] Apache HBase - Common ............................. FAILURE [2:44.003s]
[INFO] Apache HBase - Protocol ........................... SKIPPED
[INFO] Apache HBase - Client ............................. SKIPPED
[INFO] Apache HBase - Hadoop Compatibility ............... SKIPPED
[INFO] Apache HBase - Hadoop Two Compatibility ........... SKIPPED
[INFO] Apache HBase - Prefix Tree ........................ SKIPPED
[INFO] Apache HBase - Server ............................. SKIPPED
[INFO] Apache HBase - Testing Util ....................... SKIPPED
[INFO] Apache HBase - Thrift ............................. SKIPPED
[INFO] Apache HBase - Rest ............................... SKIPPED
[INFO] Apache HBase - Shell .............................. SKIPPED
[INFO] Apache HBase - Integration Tests .................. SKIPPED
[INFO] Apache HBase - Examples ........................... SKIPPED
[INFO] Apache HBase - Assembly ........................... SKIPPED
[INFO] ------------------------------------------------------------------------
[INFO] BUILD FAILURE
[INFO] ------------------------------------------------------------------------
[INFO] Total time: 4:56.590s
[INFO] Finished at: Wed Aug 31 12:53:43 UTC 2016
[INFO] Final Memory: 43M/633M
[INFO] ------------------------------------------------------------------------
[ERROR] Failed to execute goal org.apache.maven.plugins:maven-surefire-plugin:2.18.1:test
(default-test) on project hbase-common: There are test failures.
[ERROR] 
[ERROR] Please refer to <https://builds.apache.org/job/HBase-0.98-matrix/jdk=JDK%201.7%20(latest),label=yahoo-not-h2/ws/hbase-common/target/surefire-reports>
for the individual test results.
[ERROR] -> [Help 1]
[ERROR] 
[ERROR] To see the full stack trace of the errors, re-run Maven with the -e switch.
[ERROR] Re-run Maven using the -X switch to enable full debug logging.
[ERROR] 
[ERROR] For more information about the errors and possible solutions, please read the following
articles:
[ERROR] [Help 1] http://cwiki.apache.org/confluence/display/MAVEN/MojoFailureException
[ERROR] 
[ERROR] After correcting the problems, you can resume the build with the command
[ERROR]   mvn <goals> -rf :hbase-common
Build step 'Invoke top-level Maven targets' marked build as failure
Performing Post build task...
Match found for :.* : True
Logical operation result is TRUE
Running script  : # Post-build task script. TODO: Check this in and have all builds reference
check-in.
pwd && ls
# NOTE!!!! The below code has been copied and pasted from ./dev-tools/run-test.sh
# Do not change here without syncing there and vice-versa.
ZOMBIE_TESTS_COUNT=`jps -v | grep surefirebooter | grep -e '-Dhbase.test' | wc -l`
if [[ $ZOMBIE_TESTS_COUNT != 0 ]] ; then
 echo "Suspicious java process found - waiting 30s to see if there are just slow to stop"
 sleep 30
 ZOMBIE_TESTS_COUNT=`jps -v | grep surefirebooter | grep -e '-Dhbase.test' | wc -l`
 if [[ $ZOMBIE_TESTS_COUNT != 0 ]] ; then
   echo " {color:red}There appear to be $ZOMBIE_TESTS_COUNT zombie tests{color}, they should
have been killed by surefire but survived"
   jps -v | grep surefirebooter | grep -e '-Dhbase.test'
   jps -v | grep surefirebooter | grep -e '-Dhbase.test' | cut -d ' ' -f 1 | xargs -n 1 jstack
   # Exit with error
   exit 1
 else
   echo "We're ok: there is no zombie test, but some tests took some time to stop"
 fi
else
  echo "We're ok: there is no zombie test"
fi
[yahoo-not-h2] $ /bin/bash -xe /tmp/hudson1413466090217633005.sh
+ pwd
<https://builds.apache.org/job/HBase-0.98-matrix/jdk=JDK%201.7%20(latest),label=yahoo-not-h2/ws/>
+ ls
bin
CHANGES.txt
conf
dev-support
hbase-annotations
hbase-assembly
hbase-checkstyle
hbase-client
hbase-common
hbase-examples
hbase-hadoop1-compat
hbase-hadoop2-compat
hbase-hadoop-compat
hbase-it
hbase-prefix-tree
hbase-protocol
hbase-resource-bundle
hbase-rest
hbase-server
hbase-shell
hbase-testing-util
hbase-thrift
LICENSE.txt
NOTICE.txt
pom.xml
README.txt
src
target
++ jps -v
++ grep surefirebooter
++ wc -l
++ grep -e -Dhbase.test
+ ZOMBIE_TESTS_COUNT=0
+ [[ 0 != 0 ]]
+ echo 'We'\''re ok: there is no zombie test'
We're ok: there is no zombie test
POST BUILD TASK : SUCCESS
END OF POST BUILD TASK : 0
Archiving artifacts
No prior successful build to compare, so performing full copy of artifacts
Recording test results

Mime
View raw message