hbase-builds mailing list archives

Site index · List index
Message view « Date » · « Thread »
Top « Date » · « Thread »
From Apache Jenkins Server <jenk...@builds.apache.org>
Subject Build failed in Jenkins: HBase-1.2 » latest1.8,yahoo-not-h2 #690
Date Wed, 03 Aug 2016 01:51:19 GMT
See <https://builds.apache.org/job/HBase-1.2/jdk=latest1.8,label=yahoo-not-h2/690/changes>

Changes:

[jerryjch] HBASE-16284 Unauthorized client can shutdown the cluster (Deokwoo Han)

[enis] HBASE-16315 RegionSizeCalculator prints region names as binary without

------------------------------------------
[...truncated 49305 lines...]
  Run 2: TestCacheOnWrite.testStoreFileCacheOnWrite:453->testStoreFileCacheOnWriteInternals:240->readStoreFile:316
expected:<...INTERMEDIATE_INDEX=3[4]}> but was:<...INTERMEDIATE_INDEX=3[2]}>
  Run 3: TestCacheOnWrite.testStoreFileCacheOnWrite:453->testStoreFileCacheOnWriteInternals:240->readStoreFile:316
expected:<...INTERMEDIATE_INDEX=3[4]}> but was:<...INTERMEDIATE_INDEX=3[2]}>

org.apache.hadoop.hbase.io.hfile.TestCacheOnWrite.testStoreFileCacheOnWrite[1](org.apache.hadoop.hbase.io.hfile.TestCacheOnWrite)
  Run 1: TestCacheOnWrite.testStoreFileCacheOnWrite:453->testStoreFileCacheOnWriteInternals:240->readStoreFile:316
expected:<...INTERMEDIATE_INDEX=3[4]}> but was:<...INTERMEDIATE_INDEX=3[2]}>
  Run 2: TestCacheOnWrite.testStoreFileCacheOnWrite:453->testStoreFileCacheOnWriteInternals:240->readStoreFile:316
expected:<...INTERMEDIATE_INDEX=3[4]}> but was:<...INTERMEDIATE_INDEX=3[2]}>
  Run 3: TestCacheOnWrite.testStoreFileCacheOnWrite:453->testStoreFileCacheOnWriteInternals:240->readStoreFile:316
expected:<...INTERMEDIATE_INDEX=3[4]}> but was:<...INTERMEDIATE_INDEX=3[2]}>

org.apache.hadoop.hbase.io.hfile.TestCacheOnWrite.testStoreFileCacheOnWrite[20](org.apache.hadoop.hbase.io.hfile.TestCacheOnWrite)
  Run 1: TestCacheOnWrite.testStoreFileCacheOnWrite:453->testStoreFileCacheOnWriteInternals:240->readStoreFile:316
expected:<...INTERMEDIATE_INDEX=3[4]}> but was:<...INTERMEDIATE_INDEX=3[2]}>
  Run 2: TestCacheOnWrite.testStoreFileCacheOnWrite:453->testStoreFileCacheOnWriteInternals:240->readStoreFile:316
expected:<...INTERMEDIATE_INDEX=3[4]}> but was:<...INTERMEDIATE_INDEX=3[2]}>
  Run 3: TestCacheOnWrite.testStoreFileCacheOnWrite:453->testStoreFileCacheOnWriteInternals:240->readStoreFile:316
expected:<...INTERMEDIATE_INDEX=3[4]}> but was:<...INTERMEDIATE_INDEX=3[2]}>

org.apache.hadoop.hbase.io.hfile.TestCacheOnWrite.testStoreFileCacheOnWrite[21](org.apache.hadoop.hbase.io.hfile.TestCacheOnWrite)
  Run 1: TestCacheOnWrite.testStoreFileCacheOnWrite:453->testStoreFileCacheOnWriteInternals:240->readStoreFile:316
expected:<...INTERMEDIATE_INDEX=3[4]}> but was:<...INTERMEDIATE_INDEX=3[2]}>
  Run 2: TestCacheOnWrite.testStoreFileCacheOnWrite:453->testStoreFileCacheOnWriteInternals:240->readStoreFile:316
expected:<...INTERMEDIATE_INDEX=3[4]}> but was:<...INTERMEDIATE_INDEX=3[2]}>
  Run 3: TestCacheOnWrite.testStoreFileCacheOnWrite:453->testStoreFileCacheOnWriteInternals:240->readStoreFile:316
expected:<...INTERMEDIATE_INDEX=3[4]}> but was:<...INTERMEDIATE_INDEX=3[2]}>

org.apache.hadoop.hbase.io.hfile.TestCacheOnWrite.testStoreFileCacheOnWrite[22](org.apache.hadoop.hbase.io.hfile.TestCacheOnWrite)
  Run 1: TestCacheOnWrite.testStoreFileCacheOnWrite:453->testStoreFileCacheOnWriteInternals:240->readStoreFile:316
expected:<...INTERMEDIATE_INDEX=3[4]}> but was:<...INTERMEDIATE_INDEX=3[2]}>
  Run 2: TestCacheOnWrite.testStoreFileCacheOnWrite:453->testStoreFileCacheOnWriteInternals:240->readStoreFile:316
expected:<...INTERMEDIATE_INDEX=3[4]}> but was:<...INTERMEDIATE_INDEX=3[2]}>
  Run 3: TestCacheOnWrite.testStoreFileCacheOnWrite:453->testStoreFileCacheOnWriteInternals:240->readStoreFile:316
expected:<...INTERMEDIATE_INDEX=3[4]}> but was:<...INTERMEDIATE_INDEX=3[2]}>

org.apache.hadoop.hbase.io.hfile.TestCacheOnWrite.testStoreFileCacheOnWrite[23](org.apache.hadoop.hbase.io.hfile.TestCacheOnWrite)
  Run 1: TestCacheOnWrite.testStoreFileCacheOnWrite:453->testStoreFileCacheOnWriteInternals:240->readStoreFile:316
expected:<...INTERMEDIATE_INDEX=3[4]}> but was:<...INTERMEDIATE_INDEX=3[2]}>
  Run 2: TestCacheOnWrite.testStoreFileCacheOnWrite:453->testStoreFileCacheOnWriteInternals:240->readStoreFile:316
expected:<...INTERMEDIATE_INDEX=3[4]}> but was:<...INTERMEDIATE_INDEX=3[2]}>
  Run 3: TestCacheOnWrite.testStoreFileCacheOnWrite:453->testStoreFileCacheOnWriteInternals:240->readStoreFile:316
expected:<...INTERMEDIATE_INDEX=3[4]}> but was:<...INTERMEDIATE_INDEX=3[2]}>

org.apache.hadoop.hbase.io.hfile.TestCacheOnWrite.testStoreFileCacheOnWrite[24](org.apache.hadoop.hbase.io.hfile.TestCacheOnWrite)
  Run 1: TestCacheOnWrite.testStoreFileCacheOnWrite:453->testStoreFileCacheOnWriteInternals:240->readStoreFile:316
expected:<...INTERMEDIATE_INDEX=3[4]}> but was:<...INTERMEDIATE_INDEX=3[2]}>
  Run 2: TestCacheOnWrite.testStoreFileCacheOnWrite:453->testStoreFileCacheOnWriteInternals:240->readStoreFile:316
expected:<...INTERMEDIATE_INDEX=3[4]}> but was:<...INTERMEDIATE_INDEX=3[2]}>
  Run 3: TestCacheOnWrite.testStoreFileCacheOnWrite:453->testStoreFileCacheOnWriteInternals:240->readStoreFile:316
expected:<...INTERMEDIATE_INDEX=3[4]}> but was:<...INTERMEDIATE_INDEX=3[2]}>

org.apache.hadoop.hbase.io.hfile.TestCacheOnWrite.testStoreFileCacheOnWrite[25](org.apache.hadoop.hbase.io.hfile.TestCacheOnWrite)
  Run 1: TestCacheOnWrite.testStoreFileCacheOnWrite:453->testStoreFileCacheOnWriteInternals:240->readStoreFile:316
expected:<...INTERMEDIATE_INDEX=3[4]}> but was:<...INTERMEDIATE_INDEX=3[2]}>
  Run 2: TestCacheOnWrite.testStoreFileCacheOnWrite:453->testStoreFileCacheOnWriteInternals:240->readStoreFile:316
expected:<...INTERMEDIATE_INDEX=3[4]}> but was:<...INTERMEDIATE_INDEX=3[2]}>
  Run 3: TestCacheOnWrite.testStoreFileCacheOnWrite:453->testStoreFileCacheOnWriteInternals:240->readStoreFile:316
expected:<...INTERMEDIATE_INDEX=3[4]}> but was:<...INTERMEDIATE_INDEX=3[2]}>

org.apache.hadoop.hbase.io.hfile.TestCacheOnWrite.testStoreFileCacheOnWrite[26](org.apache.hadoop.hbase.io.hfile.TestCacheOnWrite)
  Run 1: TestCacheOnWrite.testStoreFileCacheOnWrite:453->testStoreFileCacheOnWriteInternals:240->readStoreFile:316
expected:<...INTERMEDIATE_INDEX=3[4]}> but was:<...INTERMEDIATE_INDEX=3[2]}>
  Run 2: TestCacheOnWrite.testStoreFileCacheOnWrite:453->testStoreFileCacheOnWriteInternals:240->readStoreFile:316
expected:<...INTERMEDIATE_INDEX=3[4]}> but was:<...INTERMEDIATE_INDEX=3[2]}>
  Run 3: TestCacheOnWrite.testStoreFileCacheOnWrite:453->testStoreFileCacheOnWriteInternals:240->readStoreFile:316
expected:<...INTERMEDIATE_INDEX=3[4]}> but was:<...INTERMEDIATE_INDEX=3[2]}>

org.apache.hadoop.hbase.io.hfile.TestCacheOnWrite.testStoreFileCacheOnWrite[27](org.apache.hadoop.hbase.io.hfile.TestCacheOnWrite)
  Run 1: TestCacheOnWrite.testStoreFileCacheOnWrite:453->testStoreFileCacheOnWriteInternals:240->readStoreFile:316
expected:<...INTERMEDIATE_INDEX=3[4]}> but was:<...INTERMEDIATE_INDEX=3[2]}>
  Run 2: TestCacheOnWrite.testStoreFileCacheOnWrite:453->testStoreFileCacheOnWriteInternals:240->readStoreFile:316
expected:<...INTERMEDIATE_INDEX=3[4]}> but was:<...INTERMEDIATE_INDEX=3[2]}>
  Run 3: TestCacheOnWrite.testStoreFileCacheOnWrite:453->testStoreFileCacheOnWriteInternals:240->readStoreFile:316
expected:<...INTERMEDIATE_INDEX=3[4]}> but was:<...INTERMEDIATE_INDEX=3[2]}>

org.apache.hadoop.hbase.io.hfile.TestCacheOnWrite.testStoreFileCacheOnWrite[28](org.apache.hadoop.hbase.io.hfile.TestCacheOnWrite)
  Run 1: TestCacheOnWrite.testStoreFileCacheOnWrite:453->testStoreFileCacheOnWriteInternals:240->readStoreFile:316
expected:<...INTERMEDIATE_INDEX=3[4]}> but was:<...INTERMEDIATE_INDEX=3[2]}>
  Run 2: TestCacheOnWrite.testStoreFileCacheOnWrite:453->testStoreFileCacheOnWriteInternals:240->readStoreFile:316
expected:<...INTERMEDIATE_INDEX=3[4]}> but was:<...INTERMEDIATE_INDEX=3[2]}>
  Run 3: TestCacheOnWrite.testStoreFileCacheOnWrite:453->testStoreFileCacheOnWriteInternals:240->readStoreFile:316
expected:<...INTERMEDIATE_INDEX=3[4]}> but was:<...INTERMEDIATE_INDEX=3[2]}>

org.apache.hadoop.hbase.io.hfile.TestCacheOnWrite.testStoreFileCacheOnWrite[29](org.apache.hadoop.hbase.io.hfile.TestCacheOnWrite)
  Run 1: TestCacheOnWrite.testStoreFileCacheOnWrite:453->testStoreFileCacheOnWriteInternals:240->readStoreFile:316
expected:<...INTERMEDIATE_INDEX=3[4]}> but was:<...INTERMEDIATE_INDEX=3[2]}>
  Run 2: TestCacheOnWrite.testStoreFileCacheOnWrite:453->testStoreFileCacheOnWriteInternals:240->readStoreFile:316
expected:<...INTERMEDIATE_INDEX=3[4]}> but was:<...INTERMEDIATE_INDEX=3[2]}>
  Run 3: TestCacheOnWrite.testStoreFileCacheOnWrite:453->testStoreFileCacheOnWriteInternals:240->readStoreFile:316
expected:<...INTERMEDIATE_INDEX=3[4]}> but was:<...INTERMEDIATE_INDEX=3[2]}>

org.apache.hadoop.hbase.io.hfile.TestCacheOnWrite.testStoreFileCacheOnWrite[2](org.apache.hadoop.hbase.io.hfile.TestCacheOnWrite)
  Run 1: TestCacheOnWrite.testStoreFileCacheOnWrite:453->testStoreFileCacheOnWriteInternals:240->readStoreFile:316
expected:<...INTERMEDIATE_INDEX=3[4]}> but was:<...INTERMEDIATE_INDEX=3[2]}>
  Run 2: TestCacheOnWrite.testStoreFileCacheOnWrite:453->testStoreFileCacheOnWriteInternals:240->readStoreFile:316
expected:<...INTERMEDIATE_INDEX=3[4]}> but was:<...INTERMEDIATE_INDEX=3[2]}>
  Run 3: TestCacheOnWrite.testStoreFileCacheOnWrite:453->testStoreFileCacheOnWriteInternals:240->readStoreFile:316
expected:<...INTERMEDIATE_INDEX=3[4]}> but was:<...INTERMEDIATE_INDEX=3[2]}>

org.apache.hadoop.hbase.io.hfile.TestCacheOnWrite.testStoreFileCacheOnWrite[30](org.apache.hadoop.hbase.io.hfile.TestCacheOnWrite)
  Run 1: TestCacheOnWrite.testStoreFileCacheOnWrite:453->testStoreFileCacheOnWriteInternals:240->readStoreFile:316
expected:<...INTERMEDIATE_INDEX=3[4]}> but was:<...INTERMEDIATE_INDEX=3[2]}>
  Run 2: TestCacheOnWrite.testStoreFileCacheOnWrite:453->testStoreFileCacheOnWriteInternals:240->readStoreFile:316
expected:<...INTERMEDIATE_INDEX=3[4]}> but was:<...INTERMEDIATE_INDEX=3[2]}>
  Run 3: TestCacheOnWrite.testStoreFileCacheOnWrite:453->testStoreFileCacheOnWriteInternals:240->readStoreFile:316
expected:<...INTERMEDIATE_INDEX=3[4]}> but was:<...INTERMEDIATE_INDEX=3[2]}>

org.apache.hadoop.hbase.io.hfile.TestCacheOnWrite.testStoreFileCacheOnWrite[31](org.apache.hadoop.hbase.io.hfile.TestCacheOnWrite)
  Run 1: TestCacheOnWrite.testStoreFileCacheOnWrite:453->testStoreFileCacheOnWriteInternals:240->readStoreFile:316
expected:<...INTERMEDIATE_INDEX=3[4]}> but was:<...INTERMEDIATE_INDEX=3[2]}>
  Run 2: TestCacheOnWrite.testStoreFileCacheOnWrite:453->testStoreFileCacheOnWriteInternals:240->readStoreFile:316
expected:<...INTERMEDIATE_INDEX=3[4]}> but was:<...INTERMEDIATE_INDEX=3[2]}>
  Run 3: TestCacheOnWrite.testStoreFileCacheOnWrite:453->testStoreFileCacheOnWriteInternals:240->readStoreFile:316
expected:<...INTERMEDIATE_INDEX=3[4]}> but was:<...INTERMEDIATE_INDEX=3[2]}>

org.apache.hadoop.hbase.io.hfile.TestCacheOnWrite.testStoreFileCacheOnWrite[32](org.apache.hadoop.hbase.io.hfile.TestCacheOnWrite)
  Run 1: TestCacheOnWrite.testStoreFileCacheOnWrite:453->testStoreFileCacheOnWriteInternals:240->readStoreFile:316
expected:<...INTERMEDIATE_INDEX=3[4]}> but was:<...INTERMEDIATE_INDEX=3[2]}>
  Run 2: TestCacheOnWrite.testStoreFileCacheOnWrite:453->testStoreFileCacheOnWriteInternals:240->readStoreFile:316
expected:<...INTERMEDIATE_INDEX=3[4]}> but was:<...INTERMEDIATE_INDEX=3[2]}>
  Run 3: TestCacheOnWrite.testStoreFileCacheOnWrite:453->testStoreFileCacheOnWriteInternals:240->readStoreFile:316
expected:<...INTERMEDIATE_INDEX=3[4]}> but was:<...INTERMEDIATE_INDEX=3[2]}>

org.apache.hadoop.hbase.io.hfile.TestCacheOnWrite.testStoreFileCacheOnWrite[33](org.apache.hadoop.hbase.io.hfile.TestCacheOnWrite)
  Run 1: TestCacheOnWrite.testStoreFileCacheOnWrite:453->testStoreFileCacheOnWriteInternals:240->readStoreFile:316
expected:<...INTERMEDIATE_INDEX=3[4]}> but was:<...INTERMEDIATE_INDEX=3[2]}>
  Run 2: TestCacheOnWrite.testStoreFileCacheOnWrite:453->testStoreFileCacheOnWriteInternals:240->readStoreFile:316
expected:<...INTERMEDIATE_INDEX=3[4]}> but was:<...INTERMEDIATE_INDEX=3[2]}>
  Run 3: TestCacheOnWrite.testStoreFileCacheOnWrite:453->testStoreFileCacheOnWriteInternals:240->readStoreFile:316
expected:<...INTERMEDIATE_INDEX=3[4]}> but was:<...INTERMEDIATE_INDEX=3[2]}>

org.apache.hadoop.hbase.io.hfile.TestCacheOnWrite.testStoreFileCacheOnWrite[34](org.apache.hadoop.hbase.io.hfile.TestCacheOnWrite)
  Run 1: TestCacheOnWrite.testStoreFileCacheOnWrite:453->testStoreFileCacheOnWriteInternals:240->readStoreFile:316
expected:<...INTERMEDIATE_INDEX=3[4]}> but was:<...INTERMEDIATE_INDEX=3[2]}>
  Run 2: TestCacheOnWrite.testStoreFileCacheOnWrite:453->testStoreFileCacheOnWriteInternals:240->readStoreFile:316
expected:<...INTERMEDIATE_INDEX=3[4]}> but was:<...INTERMEDIATE_INDEX=3[2]}>
  Run 3: TestCacheOnWrite.testStoreFileCacheOnWrite:453->testStoreFileCacheOnWriteInternals:240->readStoreFile:316
expected:<...INTERMEDIATE_INDEX=3[4]}> but was:<...INTERMEDIATE_INDEX=3[2]}>

org.apache.hadoop.hbase.io.hfile.TestCacheOnWrite.testStoreFileCacheOnWrite[35](org.apache.hadoop.hbase.io.hfile.TestCacheOnWrite)
  Run 1: TestCacheOnWrite.testStoreFileCacheOnWrite:453->testStoreFileCacheOnWriteInternals:240->readStoreFile:316
expected:<...INTERMEDIATE_INDEX=3[4]}> but was:<...INTERMEDIATE_INDEX=3[2]}>
  Run 2: TestCacheOnWrite.testStoreFileCacheOnWrite:453->testStoreFileCacheOnWriteInternals:240->readStoreFile:316
expected:<...INTERMEDIATE_INDEX=3[4]}> but was:<...INTERMEDIATE_INDEX=3[2]}>
  Run 3: TestCacheOnWrite.testStoreFileCacheOnWrite:453->testStoreFileCacheOnWriteInternals:240->readStoreFile:316
expected:<...INTERMEDIATE_INDEX=3[4]}> but was:<...INTERMEDIATE_INDEX=3[2]}>

org.apache.hadoop.hbase.io.hfile.TestCacheOnWrite.testStoreFileCacheOnWrite[3](org.apache.hadoop.hbase.io.hfile.TestCacheOnWrite)
  Run 1: TestCacheOnWrite.testStoreFileCacheOnWrite:453->testStoreFileCacheOnWriteInternals:240->readStoreFile:316
expected:<...INTERMEDIATE_INDEX=3[4]}> but was:<...INTERMEDIATE_INDEX=3[2]}>
  Run 2: TestCacheOnWrite.testStoreFileCacheOnWrite:453->testStoreFileCacheOnWriteInternals:240->readStoreFile:316
expected:<...INTERMEDIATE_INDEX=3[4]}> but was:<...INTERMEDIATE_INDEX=3[2]}>
  Run 3: TestCacheOnWrite.testStoreFileCacheOnWrite:453->testStoreFileCacheOnWriteInternals:240->readStoreFile:316
expected:<...INTERMEDIATE_INDEX=3[4]}> but was:<...INTERMEDIATE_INDEX=3[2]}>

org.apache.hadoop.hbase.io.hfile.TestCacheOnWrite.testStoreFileCacheOnWrite[4](org.apache.hadoop.hbase.io.hfile.TestCacheOnWrite)
  Run 1: TestCacheOnWrite.testStoreFileCacheOnWrite:453->testStoreFileCacheOnWriteInternals:240->readStoreFile:316
expected:<...INTERMEDIATE_INDEX=3[4]}> but was:<...INTERMEDIATE_INDEX=3[2]}>
  Run 2: TestCacheOnWrite.testStoreFileCacheOnWrite:453->testStoreFileCacheOnWriteInternals:240->readStoreFile:316
expected:<...INTERMEDIATE_INDEX=3[4]}> but was:<...INTERMEDIATE_INDEX=3[2]}>
  Run 3: TestCacheOnWrite.testStoreFileCacheOnWrite:453->testStoreFileCacheOnWriteInternals:240->readStoreFile:316
expected:<...INTERMEDIATE_INDEX=3[4]}> but was:<...INTERMEDIATE_INDEX=3[2]}>

org.apache.hadoop.hbase.io.hfile.TestCacheOnWrite.testStoreFileCacheOnWrite[5](org.apache.hadoop.hbase.io.hfile.TestCacheOnWrite)
  Run 1: TestCacheOnWrite.testStoreFileCacheOnWrite:453->testStoreFileCacheOnWriteInternals:240->readStoreFile:316
expected:<...INTERMEDIATE_INDEX=3[4]}> but was:<...INTERMEDIATE_INDEX=3[2]}>
  Run 2: TestCacheOnWrite.testStoreFileCacheOnWrite:453->testStoreFileCacheOnWriteInternals:240->readStoreFile:316
expected:<...INTERMEDIATE_INDEX=3[4]}> but was:<...INTERMEDIATE_INDEX=3[2]}>
  Run 3: TestCacheOnWrite.testStoreFileCacheOnWrite:453->testStoreFileCacheOnWriteInternals:240->readStoreFile:316
expected:<...INTERMEDIATE_INDEX=3[4]}> but was:<...INTERMEDIATE_INDEX=3[2]}>

org.apache.hadoop.hbase.io.hfile.TestCacheOnWrite.testStoreFileCacheOnWrite[6](org.apache.hadoop.hbase.io.hfile.TestCacheOnWrite)
  Run 1: TestCacheOnWrite.testStoreFileCacheOnWrite:453->testStoreFileCacheOnWriteInternals:240->readStoreFile:316
expected:<...INTERMEDIATE_INDEX=3[4]}> but was:<...INTERMEDIATE_INDEX=3[2]}>
  Run 2: TestCacheOnWrite.testStoreFileCacheOnWrite:453->testStoreFileCacheOnWriteInternals:240->readStoreFile:316
expected:<...INTERMEDIATE_INDEX=3[4]}> but was:<...INTERMEDIATE_INDEX=3[2]}>
  Run 3: TestCacheOnWrite.testStoreFileCacheOnWrite:453->testStoreFileCacheOnWriteInternals:240->readStoreFile:316
expected:<...INTERMEDIATE_INDEX=3[4]}> but was:<...INTERMEDIATE_INDEX=3[2]}>

org.apache.hadoop.hbase.io.hfile.TestCacheOnWrite.testStoreFileCacheOnWrite[7](org.apache.hadoop.hbase.io.hfile.TestCacheOnWrite)
  Run 1: TestCacheOnWrite.testStoreFileCacheOnWrite:453->testStoreFileCacheOnWriteInternals:240->readStoreFile:316
expected:<...INTERMEDIATE_INDEX=3[4]}> but was:<...INTERMEDIATE_INDEX=3[2]}>
  Run 2: TestCacheOnWrite.testStoreFileCacheOnWrite:453->testStoreFileCacheOnWriteInternals:240->readStoreFile:316
expected:<...INTERMEDIATE_INDEX=3[4]}> but was:<...INTERMEDIATE_INDEX=3[2]}>
  Run 3: TestCacheOnWrite.testStoreFileCacheOnWrite:453->testStoreFileCacheOnWriteInternals:240->readStoreFile:316
expected:<...INTERMEDIATE_INDEX=3[4]}> but was:<...INTERMEDIATE_INDEX=3[2]}>

org.apache.hadoop.hbase.io.hfile.TestCacheOnWrite.testStoreFileCacheOnWrite[8](org.apache.hadoop.hbase.io.hfile.TestCacheOnWrite)
  Run 1: TestCacheOnWrite.testStoreFileCacheOnWrite:453->testStoreFileCacheOnWriteInternals:240->readStoreFile:316
expected:<...INTERMEDIATE_INDEX=3[4]}> but was:<...INTERMEDIATE_INDEX=3[2]}>
  Run 2: TestCacheOnWrite.testStoreFileCacheOnWrite:453->testStoreFileCacheOnWriteInternals:240->readStoreFile:316
expected:<...INTERMEDIATE_INDEX=3[4]}> but was:<...INTERMEDIATE_INDEX=3[2]}>
  Run 3: TestCacheOnWrite.testStoreFileCacheOnWrite:453->testStoreFileCacheOnWriteInternals:240->readStoreFile:316
expected:<...INTERMEDIATE_INDEX=3[4]}> but was:<...INTERMEDIATE_INDEX=3[2]}>

org.apache.hadoop.hbase.io.hfile.TestCacheOnWrite.testStoreFileCacheOnWrite[9](org.apache.hadoop.hbase.io.hfile.TestCacheOnWrite)
  Run 1: TestCacheOnWrite.testStoreFileCacheOnWrite:453->testStoreFileCacheOnWriteInternals:240->readStoreFile:316
expected:<...INTERMEDIATE_INDEX=3[4]}> but was:<...INTERMEDIATE_INDEX=3[2]}>
  Run 2: TestCacheOnWrite.testStoreFileCacheOnWrite:453->testStoreFileCacheOnWriteInternals:240->readStoreFile:316
expected:<...INTERMEDIATE_INDEX=3[4]}> but was:<...INTERMEDIATE_INDEX=3[2]}>
  Run 3: TestCacheOnWrite.testStoreFileCacheOnWrite:453->testStoreFileCacheOnWriteInternals:240->readStoreFile:316
expected:<...INTERMEDIATE_INDEX=3[4]}> but was:<...INTERMEDIATE_INDEX=3[2]}>


Tests run: 2452, Failures: 36, Errors: 0, Skipped: 40

[INFO] ------------------------------------------------------------------------
[INFO] Reactor Summary:
[INFO] 
[INFO] Apache HBase ...................................... SUCCESS [2:07.672s]
[INFO] Apache HBase - Checkstyle ......................... SUCCESS [11.309s]
[INFO] Apache HBase - Resource Bundle .................... SUCCESS [0.163s]
[INFO] Apache HBase - Annotations ........................ SUCCESS [1.012s]
[INFO] Apache HBase - Protocol ........................... SUCCESS [17.534s]
[INFO] Apache HBase - Common ............................. SUCCESS [3:22.494s]
[INFO] Apache HBase - Procedure .......................... SUCCESS [3:09.100s]
[INFO] Apache HBase - Client ............................. SUCCESS [1:25.287s]
[INFO] Apache HBase - Hadoop Compatibility ............... SUCCESS [9.724s]
[INFO] Apache HBase - Hadoop Two Compatibility ........... SUCCESS [9.381s]
[INFO] Apache HBase - Prefix Tree ........................ SUCCESS [7.630s]
[INFO] Apache HBase - Server ............................. FAILURE [1:45:07.467s]
[INFO] Apache HBase - Testing Util ....................... SKIPPED
[INFO] Apache HBase - Thrift ............................. SKIPPED
[INFO] Apache HBase - Rest ............................... SKIPPED
[INFO] Apache HBase - Shell .............................. SKIPPED
[INFO] Apache HBase - Integration Tests .................. SKIPPED
[INFO] Apache HBase - Examples ........................... SKIPPED
[INFO] Apache HBase - External Block Cache ............... SKIPPED
[INFO] Apache HBase - Assembly ........................... SKIPPED
[INFO] Apache HBase - Shaded ............................. SKIPPED
[INFO] Apache HBase - Shaded - Client .................... SKIPPED
[INFO] Apache HBase - Shaded - Server .................... SKIPPED
[INFO] ------------------------------------------------------------------------
[INFO] BUILD FAILURE
[INFO] ------------------------------------------------------------------------
[INFO] Total time: 1:56:46.546s
[INFO] Finished at: Wed Aug 03 01:48:12 UTC 2016
[INFO] Final Memory: 96M/692M
[INFO] ------------------------------------------------------------------------
[ERROR] Failed to execute goal org.apache.maven.plugins:maven-surefire-plugin:2.18.1:test
(secondPartTestsExecution) on project hbase-server: There are test failures.
[ERROR] 
[ERROR] Please refer to <https://builds.apache.org/job/HBase-1.2/jdk=latest1.8,label=yahoo-not-h2/ws/hbase-server/target/surefire-reports>
for the individual test results.
[ERROR] -> [Help 1]
[ERROR] 
[ERROR] To see the full stack trace of the errors, re-run Maven with the -e switch.
[ERROR] Re-run Maven using the -X switch to enable full debug logging.
[ERROR] 
[ERROR] For more information about the errors and possible solutions, please read the following
articles:
[ERROR] [Help 1] http://cwiki.apache.org/confluence/display/MAVEN/MojoFailureException
[ERROR] 
[ERROR] After correcting the problems, you can resume the build with the command
[ERROR]   mvn <goals> -rf :hbase-server
Build step 'Invoke top-level Maven targets' marked build as failure
Performing Post build task...
Match found for :.* : True
Logical operation result is TRUE
Running script  : # Post-build task script. TODO: Check this in and have all builds reference
check-in.
pwd && ls
# NOTE!!!! The below code has been copied and pasted from ./dev-tools/run-test.sh
# Do not change here without syncing there and vice-versa.
ZOMBIE_TESTS_COUNT=`jps -v | grep surefirebooter | grep -e '-Dhbase.test' | wc -l`
if [[ $ZOMBIE_TESTS_COUNT != 0 ]] ; then
 echo "Suspicious java process found - waiting 30s to see if there are just slow to stop"
 sleep 30
 ZOMBIE_TESTS_COUNT=`jps -v | grep surefirebooter | grep -e '-Dhbase.test' | wc -l`
 if [[ $ZOMBIE_TESTS_COUNT != 0 ]] ; then
   echo " {color:red}There appear to be $ZOMBIE_TESTS_COUNT zombie tests{color}, they should
have been killed by surefire but survived"
   jps -v | grep surefirebooter | grep -e '-Dhbase.test'
   jps -v | grep surefirebooter | grep -e '-Dhbase.test' | cut -d ' ' -f 1 | xargs -n 1 jstack
   # Exit with error
   exit 1
 else
   echo "We're ok: there is no zombie test, but some tests took some time to stop"
 fi
else
  echo "We're ok: there is no zombie test"
fi
[yahoo-not-h2] $ /bin/bash -xe /tmp/hudson2444104389231916.sh
+ pwd
<https://builds.apache.org/job/HBase-1.2/jdk=latest1.8,label=yahoo-not-h2/ws/>
+ ls
bin
CHANGES.txt
conf
dev-support
hbase-annotations
hbase-assembly
hbase-checkstyle
hbase-client
hbase-common
hbase-examples
hbase-external-blockcache
hbase-hadoop2-compat
hbase-hadoop-compat
hbase-it
hbase-native-client
hbase-prefix-tree
hbase-procedure
hbase-protocol
hbase-resource-bundle
hbase-rest
hbase-server
hbase-shaded
hbase-shell
hbase-testing-util
hbase-thrift
LICENSE.txt
NOTICE.txt
pom.xml
README.txt
src
target
++ jps -v
++ grep surefirebooter
++ grep -e -Dhbase.test
++ wc -l
+ ZOMBIE_TESTS_COUNT=0
+ [[ 0 != 0 ]]
+ echo 'We'\''re ok: there is no zombie test'
We're ok: there is no zombie test
POST BUILD TASK : SUCCESS
END OF POST BUILD TASK : 0
Archiving artifacts
Recording test results

Mime
View raw message