hbase-builds mailing list archives

Site index · List index
Message view « Date » · « Thread »
Top « Date » · « Thread »
From Apache Jenkins Server <jenk...@builds.apache.org>
Subject Build failed in Jenkins: HBase-Trunk_matrix » JDK 1.7 (latest),yahoo-not-h2 #1427
Date Tue, 16 Aug 2016 21:46:51 GMT
See <https://builds.apache.org/job/HBase-Trunk_matrix/jdk=JDK%201.7%20(latest),label=yahoo-not-h2/1427/>

------------------------------------------
[...truncated 4684 lines...]
[INFO] --- maven-jar-plugin:2.4:jar (default-jar) @ hbase-procedure ---
[INFO] Building jar: <https://builds.apache.org/job/HBase-Trunk_matrix/jdk=JDK%201.7%20(latest),label=yahoo-not-h2/ws/hbase-procedure/target/hbase-procedure-2.0.0-SNAPSHOT.jar>
[INFO] 
[INFO] --- maven-install-plugin:2.3.1:install (default-install) @ hbase-procedure ---
[INFO] Installing <https://builds.apache.org/job/HBase-Trunk_matrix/jdk=JDK%201.7%20(latest),label=yahoo-not-h2/ws/hbase-procedure/target/hbase-procedure-2.0.0-SNAPSHOT.jar>
to /home/jenkins/.m2/repository/org/apache/hbase/hbase-procedure/2.0.0-SNAPSHOT/hbase-procedure-2.0.0-SNAPSHOT.jar
[INFO] Installing <https://builds.apache.org/job/HBase-Trunk_matrix/jdk=JDK%201.7%20(latest),label=yahoo-not-h2/1427/artifact/hbase-procedure/pom.xml>
to /home/jenkins/.m2/repository/org/apache/hbase/hbase-procedure/2.0.0-SNAPSHOT/hbase-procedure-2.0.0-SNAPSHOT.pom
[INFO] Installing <https://builds.apache.org/job/HBase-Trunk_matrix/jdk=JDK%201.7%20(latest),label=yahoo-not-h2/ws/hbase-procedure/target/hbase-procedure-2.0.0-SNAPSHOT-sources.jar>
to /home/jenkins/.m2/repository/org/apache/hbase/hbase-procedure/2.0.0-SNAPSHOT/hbase-procedure-2.0.0-SNAPSHOT-sources.jar
[INFO] Installing <https://builds.apache.org/job/HBase-Trunk_matrix/jdk=JDK%201.7%20(latest),label=yahoo-not-h2/ws/hbase-procedure/target/hbase-procedure-2.0.0-SNAPSHOT-tests.jar>
to /home/jenkins/.m2/repository/org/apache/hbase/hbase-procedure/2.0.0-SNAPSHOT/hbase-procedure-2.0.0-SNAPSHOT-tests.jar
[INFO]                                                                         
[INFO] ------------------------------------------------------------------------
[INFO] Building Apache HBase - Client 2.0.0-SNAPSHOT
[INFO] ------------------------------------------------------------------------
[INFO] 
[INFO] --- maven-enforcer-plugin:1.0.1:enforce (min-maven-min-java-banned-xerces) @ hbase-client
---
[INFO] 
[INFO] --- maven-enforcer-plugin:1.0.1:enforce (banned-jsr305) @ hbase-client ---
[INFO] 
[INFO] --- buildnumber-maven-plugin:1.3:create-timestamp (default) @ hbase-client ---
[INFO] 
[INFO] --- maven-remote-resources-plugin:1.5:process (default) @ hbase-client ---
[INFO] 
[INFO] --- maven-resources-plugin:2.6:resources (default-resources) @ hbase-client ---
[INFO] Using 'UTF-8' encoding to copy filtered resources.
[INFO] Copying 1 resource
[INFO] Copying 3 resources
[INFO] 
[INFO] --- maven-compiler-plugin:3.2:compile (default-compile) @ hbase-client ---
[INFO] Compiling 3 source files to <https://builds.apache.org/job/HBase-Trunk_matrix/jdk=JDK%201.7%20(latest),label=yahoo-not-h2/ws/hbase-client/target/classes>
[INFO] 
[INFO] --- maven-resources-plugin:2.6:testResources (default-testResources) @ hbase-client
---
[INFO] Using 'UTF-8' encoding to copy filtered resources.
[INFO] Copying 2 resources
[INFO] Copying 3 resources
[INFO] 
[INFO] --- maven-compiler-plugin:3.2:testCompile (default-testCompile) @ hbase-client ---
[INFO] Nothing to compile - all classes are up to date
[INFO] 
[INFO] --- maven-surefire-plugin:2.18.1:test (default-test) @ hbase-client ---
[INFO] Surefire report directory: <https://builds.apache.org/job/HBase-Trunk_matrix/jdk=JDK%201.7%20(latest),label=yahoo-not-h2/ws/hbase-client/target/surefire-reports>
[INFO] Using configured provider org.apache.maven.surefire.junitcore.JUnitCoreProvider
[INFO] parallel='none', perCoreThreadCount=true, threadCount=0, useUnlimitedThreads=false,
threadCountSuites=0, threadCountClasses=0, threadCountMethods=0, parallelOptimized=true

-------------------------------------------------------
 T E S T S
-------------------------------------------------------
Running org.apache.hadoop.hbase.TestHColumnDescriptor
Tests run: 6, Failures: 0, Errors: 0, Skipped: 0, Time elapsed: 1.065 sec - in org.apache.hadoop.hbase.TestHColumnDescriptor
Running org.apache.hadoop.hbase.zookeeper.TestZKUtil
Tests run: 1, Failures: 0, Errors: 0, Skipped: 0, Time elapsed: 0.425 sec - in org.apache.hadoop.hbase.zookeeper.TestZKUtil
Running org.apache.hadoop.hbase.zookeeper.TestInstancePending
Tests run: 1, Failures: 0, Errors: 0, Skipped: 0, Time elapsed: 0.209 sec - in org.apache.hadoop.hbase.zookeeper.TestInstancePending
Running org.apache.hadoop.hbase.zookeeper.TestZooKeeperWatcher
Tests run: 1, Failures: 0, Errors: 0, Skipped: 0, Time elapsed: 0.539 sec - in org.apache.hadoop.hbase.zookeeper.TestZooKeeperWatcher
Running org.apache.hadoop.hbase.TestRegionLocations
Tests run: 8, Failures: 0, Errors: 0, Skipped: 0, Time elapsed: 0.01 sec - in org.apache.hadoop.hbase.TestRegionLocations
Running org.apache.hadoop.hbase.quotas.TestQuotaFilter
Tests run: 1, Failures: 0, Errors: 0, Skipped: 0, Time elapsed: 0.005 sec - in org.apache.hadoop.hbase.quotas.TestQuotaFilter
Running org.apache.hadoop.hbase.security.TestEncryptionUtil
Tests run: 3, Failures: 0, Errors: 0, Skipped: 0, Time elapsed: 1.184 sec - in org.apache.hadoop.hbase.security.TestEncryptionUtil
Running org.apache.hadoop.hbase.security.TestHBaseSaslRpcClient
Tests run: 5, Failures: 0, Errors: 0, Skipped: 0, Time elapsed: 0.425 sec - in org.apache.hadoop.hbase.security.TestHBaseSaslRpcClient
Running org.apache.hadoop.hbase.security.TestSaslUtil
Tests run: 1, Failures: 0, Errors: 0, Skipped: 0, Time elapsed: 0.121 sec - in org.apache.hadoop.hbase.security.TestSaslUtil
Running org.apache.hadoop.hbase.TestHTableDescriptor
Tests run: 18, Failures: 0, Errors: 0, Skipped: 0, Time elapsed: 0.983 sec - in org.apache.hadoop.hbase.TestHTableDescriptor
Running org.apache.hadoop.hbase.TestInterfaceAudienceAnnotations
Tests run: 5, Failures: 0, Errors: 5, Skipped: 0, Time elapsed: 0.043 sec <<< FAILURE!
- in org.apache.hadoop.hbase.TestInterfaceAudienceAnnotations
testProtosInParamTypes(org.apache.hadoop.hbase.TestInterfaceAudienceAnnotations)  Time elapsed:
0.022 sec  <<< ERROR!
java.io.FileNotFoundException: /home/jenkins/jenkins-slave/workspace/HBase-Trunk_matrix/jdk/JDK%201.7%20(latest)/label/yahoo-not-h2/hbase-annotations/target/hbase-annotations-2.0.0-SNAPSHOT.jar
(No such file or directory)
	at java.io.FileInputStream.open(Native Method)
	at java.io.FileInputStream.<init>(FileInputStream.java:146)
	at java.io.FileInputStream.<init>(FileInputStream.java:101)
	at org.apache.hadoop.hbase.ClassFinder.findClassesFromJar(ClassFinder.java:186)
	at org.apache.hadoop.hbase.ClassFinder.findClasses(ClassFinder.java:176)
	at org.apache.hadoop.hbase.ClassFinder.findClasses(ClassFinder.java:136)
	at org.apache.hadoop.hbase.TestInterfaceAudienceAnnotations.findPublicClasses(TestInterfaceAudienceAnnotations.java:359)
	at org.apache.hadoop.hbase.TestInterfaceAudienceAnnotations.testProtosInParamTypes(TestInterfaceAudienceAnnotations.java:365)

testInterfaceStabilityAnnotation(org.apache.hadoop.hbase.TestInterfaceAudienceAnnotations)
 Time elapsed: 0.019 sec  <<< ERROR!
java.io.FileNotFoundException: /home/jenkins/jenkins-slave/workspace/HBase-Trunk_matrix/jdk/JDK%201.7%20(latest)/label/yahoo-not-h2/hbase-annotations/target/hbase-annotations-2.0.0-SNAPSHOT.jar
(No such file or directory)
	at java.io.FileInputStream.open(Native Method)
	at java.io.FileInputStream.<init>(FileInputStream.java:146)
	at java.io.FileInputStream.<init>(FileInputStream.java:101)
	at org.apache.hadoop.hbase.ClassFinder.findClassesFromJar(ClassFinder.java:186)
	at org.apache.hadoop.hbase.ClassFinder.findClasses(ClassFinder.java:176)
	at org.apache.hadoop.hbase.ClassFinder.findClasses(ClassFinder.java:136)
	at org.apache.hadoop.hbase.TestInterfaceAudienceAnnotations.testInterfaceStabilityAnnotation(TestInterfaceAudienceAnnotations.java:320)

testProtosInConstructors(org.apache.hadoop.hbase.TestInterfaceAudienceAnnotations)  Time elapsed:
0 sec  <<< ERROR!
java.io.FileNotFoundException: /home/jenkins/jenkins-slave/workspace/HBase-Trunk_matrix/jdk/JDK%201.7%20(latest)/label/yahoo-not-h2/hbase-annotations/target/hbase-annotations-2.0.0-SNAPSHOT.jar
(No such file or directory)
	at java.io.FileInputStream.open(Native Method)
	at java.io.FileInputStream.<init>(FileInputStream.java:146)
	at java.io.FileInputStream.<init>(FileInputStream.java:101)
	at org.apache.hadoop.hbase.ClassFinder.findClassesFromJar(ClassFinder.java:186)
	at org.apache.hadoop.hbase.ClassFinder.findClasses(ClassFinder.java:176)
	at org.apache.hadoop.hbase.ClassFinder.findClasses(ClassFinder.java:136)
	at org.apache.hadoop.hbase.TestInterfaceAudienceAnnotations.findPublicClasses(TestInterfaceAudienceAnnotations.java:359)
	at org.apache.hadoop.hbase.TestInterfaceAudienceAnnotations.testProtosInConstructors(TestInterfaceAudienceAnnotations.java:386)

testProtosInReturnTypes(org.apache.hadoop.hbase.TestInterfaceAudienceAnnotations)  Time elapsed:
0 sec  <<< ERROR!
java.io.FileNotFoundException: /home/jenkins/jenkins-slave/workspace/HBase-Trunk_matrix/jdk/JDK%201.7%20(latest)/label/yahoo-not-h2/hbase-annotations/target/hbase-annotations-2.0.0-SNAPSHOT.jar
(No such file or directory)
	at java.io.FileInputStream.open(Native Method)
	at java.io.FileInputStream.<init>(FileInputStream.java:146)
	at java.io.FileInputStream.<init>(FileInputStream.java:101)
	at org.apache.hadoop.hbase.ClassFinder.findClassesFromJar(ClassFinder.java:186)
	at org.apache.hadoop.hbase.ClassFinder.findClasses(ClassFinder.java:176)
	at org.apache.hadoop.hbase.ClassFinder.findClasses(ClassFinder.java:136)
	at org.apache.hadoop.hbase.TestInterfaceAudienceAnnotations.findPublicClasses(TestInterfaceAudienceAnnotations.java:359)
	at org.apache.hadoop.hbase.TestInterfaceAudienceAnnotations.testProtosInReturnTypes(TestInterfaceAudienceAnnotations.java:334)

testInterfaceAudienceAnnotation(org.apache.hadoop.hbase.TestInterfaceAudienceAnnotations)
 Time elapsed: 0 sec  <<< ERROR!
java.io.FileNotFoundException: /home/jenkins/jenkins-slave/workspace/HBase-Trunk_matrix/jdk/JDK%201.7%20(latest)/label/yahoo-not-h2/hbase-annotations/target/hbase-annotations-2.0.0-SNAPSHOT.jar
(No such file or directory)
	at java.io.FileInputStream.open(Native Method)
	at java.io.FileInputStream.<init>(FileInputStream.java:146)
	at java.io.FileInputStream.<init>(FileInputStream.java:101)
	at org.apache.hadoop.hbase.ClassFinder.findClassesFromJar(ClassFinder.java:186)
	at org.apache.hadoop.hbase.ClassFinder.findClasses(ClassFinder.java:176)
	at org.apache.hadoop.hbase.ClassFinder.findClasses(ClassFinder.java:136)
	at org.apache.hadoop.hbase.TestInterfaceAudienceAnnotations.testInterfaceAudienceAnnotation(TestInterfaceAudienceAnnotations.java:281)

Running org.apache.hadoop.hbase.client.TestUnmodifyableHTableDescriptor
Tests run: 1, Failures: 0, Errors: 0, Skipped: 0, Time elapsed: 0.014 sec - in org.apache.hadoop.hbase.client.TestUnmodifyableHTableDescriptor
Running org.apache.hadoop.hbase.client.TestGet
Tests run: 5, Failures: 0, Errors: 0, Skipped: 0, Time elapsed: 0.989 sec - in org.apache.hadoop.hbase.client.TestGet
Running org.apache.hadoop.hbase.client.TestScan
Tests run: 4, Failures: 0, Errors: 0, Skipped: 0, Time elapsed: 0.809 sec - in org.apache.hadoop.hbase.client.TestScan
Running org.apache.hadoop.hbase.client.TestClientExponentialBackoff
Tests run: 5, Failures: 0, Errors: 0, Skipped: 0, Time elapsed: 0.634 sec - in org.apache.hadoop.hbase.client.TestClientExponentialBackoff
Running org.apache.hadoop.hbase.client.TestClientScanner
Tests run: 6, Failures: 0, Errors: 0, Skipped: 0, Time elapsed: 0.898 sec - in org.apache.hadoop.hbase.client.TestClientScanner
Running org.apache.hadoop.hbase.client.TestSnapshotFromAdmin
Tests run: 2, Failures: 0, Errors: 0, Skipped: 0, Time elapsed: 4.91 sec - in org.apache.hadoop.hbase.client.TestSnapshotFromAdmin
Running org.apache.hadoop.hbase.client.TestMetricsConnection
Tests run: 1, Failures: 0, Errors: 0, Skipped: 0, Time elapsed: 0.716 sec - in org.apache.hadoop.hbase.client.TestMetricsConnection
Running org.apache.hadoop.hbase.client.TestAttributes
Tests run: 7, Failures: 0, Errors: 0, Skipped: 0, Time elapsed: 0.168 sec - in org.apache.hadoop.hbase.client.TestAttributes
Running org.apache.hadoop.hbase.client.TestClientSmallScanner
Tests run: 4, Failures: 0, Errors: 0, Skipped: 0, Time elapsed: 0.886 sec - in org.apache.hadoop.hbase.client.TestClientSmallScanner
Running org.apache.hadoop.hbase.client.TestDeleteTimeStamp
Tests run: 1, Failures: 0, Errors: 0, Skipped: 0, Time elapsed: 0.042 sec - in org.apache.hadoop.hbase.client.TestDeleteTimeStamp
Running org.apache.hadoop.hbase.client.TestPutDotHas
Tests run: 4, Failures: 0, Errors: 0, Skipped: 0, Time elapsed: 0.024 sec - in org.apache.hadoop.hbase.client.TestPutDotHas
Running org.apache.hadoop.hbase.client.TestHTableMultiplexerViaMocks
Tests run: 2, Failures: 0, Errors: 0, Skipped: 0, Time elapsed: 0.365 sec - in org.apache.hadoop.hbase.client.TestHTableMultiplexerViaMocks
Running org.apache.hadoop.hbase.client.TestIncrement
Tests run: 1, Failures: 0, Errors: 0, Skipped: 0, Time elapsed: 0.149 sec - in org.apache.hadoop.hbase.client.TestIncrement
Running org.apache.hadoop.hbase.client.TestProcedureFuture
Tests run: 4, Failures: 0, Errors: 0, Skipped: 0, Time elapsed: 0.458 sec - in org.apache.hadoop.hbase.client.TestProcedureFuture
Running org.apache.hadoop.hbase.client.TestClientSmallReversedScanner
Tests run: 4, Failures: 0, Errors: 0, Skipped: 0, Time elapsed: 0.777 sec - in org.apache.hadoop.hbase.client.TestClientSmallReversedScanner
Running org.apache.hadoop.hbase.client.TestOperation
Tests run: 3, Failures: 0, Errors: 0, Skipped: 0, Time elapsed: 0.167 sec - in org.apache.hadoop.hbase.client.TestOperation
Running org.apache.hadoop.hbase.client.TestClientNoCluster
Tests run: 5, Failures: 0, Errors: 0, Skipped: 1, Time elapsed: 1.77 sec - in org.apache.hadoop.hbase.client.TestClientNoCluster
Running org.apache.hadoop.hbase.client.TestDelayingRunner
Tests run: 1, Failures: 0, Errors: 0, Skipped: 0, Time elapsed: 1.021 sec - in org.apache.hadoop.hbase.client.TestDelayingRunner
Running org.apache.hadoop.hbase.ipc.TestPayloadCarryingRpcController
Tests run: 1, Failures: 0, Errors: 0, Skipped: 0, Time elapsed: 0.126 sec - in org.apache.hadoop.hbase.ipc.TestPayloadCarryingRpcController
Running org.apache.hadoop.hbase.ipc.TestIPCUtil
Tests run: 1, Failures: 0, Errors: 0, Skipped: 0, Time elapsed: 0.302 sec - in org.apache.hadoop.hbase.ipc.TestIPCUtil
Running org.apache.hadoop.hbase.filter.TestComparators
Tests run: 1, Failures: 0, Errors: 0, Skipped: 0, Time elapsed: 0.17 sec - in org.apache.hadoop.hbase.filter.TestComparators
Running org.apache.hadoop.hbase.filter.TestLongComparator
Tests run: 1, Failures: 0, Errors: 0, Skipped: 0, Time elapsed: 0.124 sec - in org.apache.hadoop.hbase.filter.TestLongComparator
Running org.apache.hadoop.hbase.replication.TestReplicationPeerConfig
Tests run: 1, Failures: 0, Errors: 0, Skipped: 0, Time elapsed: 0.005 sec - in org.apache.hadoop.hbase.replication.TestReplicationPeerConfig

Results :

Tests in error: 
  TestInterfaceAudienceAnnotations.testInterfaceAudienceAnnotation:281 » FileNotFound
  TestInterfaceAudienceAnnotations.testInterfaceStabilityAnnotation:320 » FileNotFound
  TestInterfaceAudienceAnnotations.testProtosInConstructors:386->findPublicClasses:359
» FileNotFound
  TestInterfaceAudienceAnnotations.testProtosInParamTypes:365->findPublicClasses:359 »
FileNotFound
  TestInterfaceAudienceAnnotations.testProtosInReturnTypes:334->findPublicClasses:359 »
FileNotFound

Tests run: 115, Failures: 0, Errors: 5, Skipped: 1

[INFO] ------------------------------------------------------------------------
[INFO] Reactor Summary:
[INFO] 
[INFO] Apache HBase ...................................... SUCCESS [2.594s]
[INFO] Apache HBase - Checkstyle ......................... SUCCESS [0.691s]
[INFO] Apache HBase - Resource Bundle .................... SUCCESS [0.343s]
[INFO] Apache HBase - Annotations ........................ SUCCESS [0.404s]
[INFO] Apache HBase - Protocol ........................... SUCCESS [5.847s]
[INFO] Apache HBase - Common ............................. SUCCESS [1:22.784s]
[INFO] Apache HBase - Procedure .......................... SUCCESS [1:09.854s]
[INFO] Apache HBase - Client ............................. FAILURE [42.067s]
[INFO] Apache HBase - Hadoop Compatibility ............... SKIPPED
[INFO] Apache HBase - Hadoop Two Compatibility ........... SKIPPED
[INFO] Apache HBase - Prefix Tree ........................ SKIPPED
[INFO] Apache HBase - Server ............................. SKIPPED
[INFO] Apache HBase - Testing Util ....................... SKIPPED
[INFO] Apache HBase - Thrift ............................. SKIPPED
[INFO] Apache HBase - RSGroup ............................ SKIPPED
[INFO] Apache HBase - Shell .............................. SKIPPED
[INFO] Apache HBase - Integration Tests .................. SKIPPED
[INFO] Apache HBase - Examples ........................... SKIPPED
[INFO] Apache HBase - Rest ............................... SKIPPED
[INFO] Apache HBase - External Block Cache ............... SKIPPED
[INFO] Apache HBase - Spark .............................. SKIPPED
[INFO] Apache HBase - Assembly ........................... SKIPPED
[INFO] Apache HBase - Shaded ............................. SKIPPED
[INFO] Apache HBase - Shaded - Client .................... SKIPPED
[INFO] Apache HBase - Shaded - Server .................... SKIPPED
[INFO] Apache HBase - Archetypes ......................... SKIPPED
[INFO] Apache HBase - Exemplar for hbase-client archetype  SKIPPED
[INFO] Apache HBase - Exemplar for hbase-shaded-client archetype  SKIPPED
[INFO] Apache HBase - Archetype builder .................. SKIPPED
[INFO] ------------------------------------------------------------------------
[INFO] BUILD FAILURE
[INFO] ------------------------------------------------------------------------
[INFO] Total time: 3:26.675s
[INFO] Finished at: Tue Aug 16 21:46:45 UTC 2016
[INFO] Final Memory: 56M/1212M
[INFO] ------------------------------------------------------------------------
[ERROR] Failed to execute goal org.apache.maven.plugins:maven-surefire-plugin:2.18.1:test
(default-test) on project hbase-client: There are test failures.
[ERROR] 
[ERROR] Please refer to <https://builds.apache.org/job/HBase-Trunk_matrix/jdk=JDK%201.7%20(latest),label=yahoo-not-h2/ws/hbase-client/target/surefire-reports>
for the individual test results.
[ERROR] -> [Help 1]
[ERROR] 
[ERROR] To see the full stack trace of the errors, re-run Maven with the -e switch.
[ERROR] Re-run Maven using the -X switch to enable full debug logging.
[ERROR] 
[ERROR] For more information about the errors and possible solutions, please read the following
articles:
[ERROR] [Help 1] http://cwiki.apache.org/confluence/display/MAVEN/MojoFailureException
[ERROR] 
[ERROR] After correcting the problems, you can resume the build with the command
[ERROR]   mvn <goals> -rf :hbase-client
Build step 'Invoke top-level Maven targets' marked build as failure
Performing Post build task...
Match found for :.* : True
Logical operation result is TRUE
Running script  : # Run zombie detector script
./dev-support/zombie-detector.sh --jenkins ${BUILD_ID}
[yahoo-not-h2] $ /bin/bash -xe /tmp/hudson1903605643542145796.sh
+ ./dev-support/zombie-detector.sh --jenkins 1427
Tue Aug 16 21:46:46 UTC 2016 We're ok: there is no zombie test


    {color:green}+1 zombies{color}. No zombie tests found running at the end of the build.
POST BUILD TASK : SUCCESS
END OF POST BUILD TASK : 0
Archiving artifacts
No prior successful build to compare, so performing full copy of artifacts
Recording test results
[FINDBUGS] Skipping publisher since build result is FAILURE
[CHECKSTYLE] Skipping publisher since build result is FAILURE

Mime
View raw message