hbase-builds mailing list archives

Site index · List index
Message view « Date » · « Thread »
Top « Date » · « Thread »
From Apache Jenkins Server <jenk...@builds.apache.org>
Subject Build failed in Jenkins: HBase-1.1-JDK7 #1752
Date Sat, 23 Jul 2016 08:40:23 GMT
See <https://builds.apache.org/job/HBase-1.1-JDK7/1752/changes>

Changes:

[matteo.bertozzi] HBASE-16272 Overflow in ServerName's compareTo method (Huaxiang Sun)

------------------------------------------
[...truncated 2593 lines...]
	at sun.net.www.http.HttpClient.openServer(HttpClient.java:432)
	at sun.net.www.http.HttpClient.openServer(HttpClient.java:527)
	at sun.net.www.http.HttpClient.<init>(HttpClient.java:211)
	at sun.net.www.http.HttpClient.New(HttpClient.java:308)
	at sun.net.www.http.HttpClient.New(HttpClient.java:326)
	at sun.net.www.protocol.http.HttpURLConnection.getNewHttpClient(HttpURLConnection.java:997)
	at sun.net.www.protocol.http.HttpURLConnection.plainConnect(HttpURLConnection.java:933)
	at sun.net.www.protocol.http.HttpURLConnection.connect(HttpURLConnection.java:851)
	at org.apache.thrift.transport.THttpClient.flush(THttpClient.java:328)
	... 19 more

	at org.hamcrest.MatcherAssert.assertThat(MatcherAssert.java:20)
	at org.junit.Assert.assertThat(Assert.java:956)
	at org.junit.Assert.assertThat(Assert.java:923)
	at org.junit.rules.ExpectedException.handleException(ExpectedException.java:252)
	at org.junit.rules.ExpectedException.access$000(ExpectedException.java:106)
	at org.junit.rules.ExpectedException$ExpectedExceptionStatement.evaluate(ExpectedException.java:241)
	at org.junit.rules.RunRules.evaluate(RunRules.java:20)
	at org.junit.runners.ParentRunner.runLeaf(ParentRunner.java:325)
	at org.junit.runners.BlockJUnit4ClassRunner.runChild(BlockJUnit4ClassRunner.java:78)
	at org.junit.runners.BlockJUnit4ClassRunner.runChild(BlockJUnit4ClassRunner.java:57)
	at org.junit.runners.ParentRunner$3.run(ParentRunner.java:290)
	at org.junit.runners.ParentRunner$1.schedule(ParentRunner.java:71)
	at org.junit.runners.ParentRunner.runChildren(ParentRunner.java:288)
	at org.junit.runners.ParentRunner.access$000(ParentRunner.java:58)
	at org.junit.runners.ParentRunner$2.evaluate(ParentRunner.java:268)
	at org.junit.internal.runners.statements.RunBefores.evaluate(RunBefores.java:26)
	at org.junit.internal.runners.statements.RunAfters.evaluate(RunAfters.java:27)
	at org.junit.runners.ParentRunner.run(ParentRunner.java:363)
	at org.junit.runners.Suite.runChild(Suite.java:128)
	at org.junit.runners.Suite.runChild(Suite.java:27)
	at org.junit.runners.ParentRunner$3.run(ParentRunner.java:290)
	at org.junit.runners.ParentRunner$1.schedule(ParentRunner.java:71)
	at org.junit.runners.ParentRunner.runChildren(ParentRunner.java:288)
	at org.junit.runners.ParentRunner.access$000(ParentRunner.java:58)
	at org.junit.runners.ParentRunner$2.evaluate(ParentRunner.java:268)
	at org.junit.runners.ParentRunner.run(ParentRunner.java:363)
	at org.junit.runner.JUnitCore.run(JUnitCore.java:137)
	at org.junit.runner.JUnitCore.run(JUnitCore.java:115)
	at org.apache.maven.surefire.junitcore.JUnitCoreWrapper.createRequestAndRun(JUnitCoreWrapper.java:108)
	at org.apache.maven.surefire.junitcore.JUnitCoreWrapper.executeEager(JUnitCoreWrapper.java:78)
	at org.apache.maven.surefire.junitcore.JUnitCoreWrapper.execute(JUnitCoreWrapper.java:54)
	at org.apache.maven.surefire.junitcore.JUnitCoreProvider.invoke(JUnitCoreProvider.java:144)
	at org.apache.maven.surefire.booter.ForkedBooter.invokeProviderInSameClassLoader(ForkedBooter.java:203)
	at org.apache.maven.surefire.booter.ForkedBooter.runSuitesInProcess(ForkedBooter.java:155)
	at org.apache.maven.surefire.booter.ForkedBooter.main(ForkedBooter.java:103)

Tests run: 1, Failures: 1, Errors: 0, Skipped: 0, Time elapsed: 25.404 sec <<< FAILURE!
- in org.apache.hadoop.hbase.thrift.TestThriftHttpServer
testRunThriftServerWithHeaderBufferLength(org.apache.hadoop.hbase.thrift.TestThriftHttpServer)
 Time elapsed: 0.369 sec  <<< FAILURE!
java.lang.AssertionError: null
	at org.junit.Assert.fail(Assert.java:86)
	at org.junit.Assert.assertTrue(Assert.java:41)
	at org.junit.Assert.assertTrue(Assert.java:52)
	at org.apache.hadoop.hbase.thrift.TestThriftServer.checkTableList(TestThriftServer.java:240)
	at org.apache.hadoop.hbase.thrift.TestThriftHttpServer.talkToThriftServer(TestThriftHttpServer.java:187)
	at org.apache.hadoop.hbase.thrift.TestThriftHttpServer.runThriftServer(TestThriftHttpServer.java:147)
	at org.apache.hadoop.hbase.thrift.TestThriftHttpServer.testRunThriftServerWithHeaderBufferLength(TestThriftHttpServer.java:113)

Tests run: 1, Failures: 1, Errors: 0, Skipped: 0, Time elapsed: 42.218 sec <<< FAILURE!
- in org.apache.hadoop.hbase.thrift.TestThriftHttpServer
testRunThriftServerWithHeaderBufferLength(org.apache.hadoop.hbase.thrift.TestThriftHttpServer)
 Time elapsed: 0.379 sec  <<< FAILURE!
java.lang.AssertionError: null
	at org.junit.Assert.fail(Assert.java:86)
	at org.junit.Assert.assertTrue(Assert.java:41)
	at org.junit.Assert.assertTrue(Assert.java:52)
	at org.apache.hadoop.hbase.thrift.TestThriftServer.checkTableList(TestThriftServer.java:240)
	at org.apache.hadoop.hbase.thrift.TestThriftHttpServer.talkToThriftServer(TestThriftHttpServer.java:187)
	at org.apache.hadoop.hbase.thrift.TestThriftHttpServer.runThriftServer(TestThriftHttpServer.java:147)
	at org.apache.hadoop.hbase.thrift.TestThriftHttpServer.testRunThriftServerWithHeaderBufferLength(TestThriftHttpServer.java:113)

Running org.apache.hadoop.hbase.thrift.TestThriftServer
Tests run: 1, Failures: 0, Errors: 0, Skipped: 0, Time elapsed: 107.837 sec - in org.apache.hadoop.hbase.thrift.TestThriftServer
Running org.apache.hadoop.hbase.thrift.TestThriftServerCmdLine
Tests run: 32, Failures: 0, Errors: 0, Skipped: 0, Time elapsed: 58.545 sec - in org.apache.hadoop.hbase.thrift.TestThriftServerCmdLine
Running org.apache.hadoop.hbase.thrift2.TestThriftHBaseServiceHandler
Tests run: 21, Failures: 0, Errors: 0, Skipped: 0, Time elapsed: 6.049 sec - in org.apache.hadoop.hbase.thrift2.TestThriftHBaseServiceHandler
Running org.apache.hadoop.hbase.thrift2.TestThriftHBaseServiceHandlerWithLabels
Tests run: 6, Failures: 0, Errors: 0, Skipped: 0, Time elapsed: 4.699 sec - in org.apache.hadoop.hbase.thrift2.TestThriftHBaseServiceHandlerWithLabels

Results :

Failed tests: 
org.apache.hadoop.hbase.thrift.TestThriftHttpServer.testRunThriftServerWithHeaderBufferLength(org.apache.hadoop.hbase.thrift.TestThriftHttpServer)
  Run 1: TestThriftHttpServer.testRunThriftServerWithHeaderBufferLength 
Expected: (an instance of org.apache.thrift.transport.TTransportException and exception with
message a string containing "HTTP Response code: 413")
     but: exception with message a string containing "HTTP Response code: 413" message was
"java.net.ConnectException: Connection refused"
Stacktrace was: org.apache.thrift.transport.TTransportException: java.net.ConnectException:
Connection refused
	at org.apache.thrift.transport.THttpClient.flush(THttpClient.java:340)
	at org.apache.thrift.TServiceClient.sendBase(TServiceClient.java:65)
	at org.apache.hadoop.hbase.thrift.generated.Hbase$Client.send_getTableNames(Hbase.java:897)
	at org.apache.hadoop.hbase.thrift.generated.Hbase$Client.getTableNames(Hbase.java:890)
	at org.apache.hadoop.hbase.thrift.TestThriftServer.checkTableList(TestThriftServer.java:240)
	at org.apache.hadoop.hbase.thrift.TestThriftHttpServer.talkToThriftServer(TestThriftHttpServer.java:187)
	at org.apache.hadoop.hbase.thrift.TestThriftHttpServer.runThriftServer(TestThriftHttpServer.java:147)
	at org.apache.hadoop.hbase.thrift.TestThriftHttpServer.testRunThriftServerWithHeaderBufferLength(TestThriftHttpServer.java:121)
	at sun.reflect.NativeMethodAccessorImpl.invoke0(Native Method)
	at sun.reflect.NativeMethodAccessorImpl.invoke(NativeMethodAccessorImpl.java:57)
	at sun.reflect.DelegatingMethodAccessorImpl.invoke(DelegatingMethodAccessorImpl.java:43)
	at java.lang.reflect.Method.invoke(Method.java:606)
	at org.junit.runners.model.FrameworkMethod$1.runReflectiveCall(FrameworkMethod.java:50)
	at org.junit.internal.runners.model.ReflectiveCallable.run(ReflectiveCallable.java:12)
	at org.junit.runners.model.FrameworkMethod.invokeExplosively(FrameworkMethod.java:47)
	at org.junit.internal.runners.statements.InvokeMethod.evaluate(InvokeMethod.java:17)
	at org.junit.internal.runners.statements.FailOnTimeout$CallableStatement.call(FailOnTimeout.java:298)
	at org.junit.internal.runners.statements.FailOnTimeout$CallableStatement.call(FailOnTimeout.java:292)
	at java.util.concurrent.FutureTask.run(FutureTask.java:262)
	at java.lang.Thread.run(Thread.java:745)
Caused by: java.net.ConnectException: Connection refused
	at java.net.PlainSocketImpl.socketConnect(Native Method)
	at java.net.AbstractPlainSocketImpl.doConnect(AbstractPlainSocketImpl.java:339)
	at java.net.AbstractPlainSocketImpl.connectToAddress(AbstractPlainSocketImpl.java:200)
	at java.net.AbstractPlainSocketImpl.connect(AbstractPlainSocketImpl.java:182)
	at java.net.SocksSocketImpl.connect(SocksSocketImpl.java:392)
	at java.net.Socket.connect(Socket.java:579)
	at java.net.Socket.connect(Socket.java:528)
	at sun.net.NetworkClient.doConnect(NetworkClient.java:180)
	at sun.net.www.http.HttpClient.openServer(HttpClient.java:432)
	at sun.net.www.http.HttpClient.openServer(HttpClient.java:527)
	at sun.net.www.http.HttpClient.<init>(HttpClient.java:211)
	at sun.net.www.http.HttpClient.New(HttpClient.java:308)
	at sun.net.www.http.HttpClient.New(HttpClient.java:326)
	at sun.net.www.protocol.http.HttpURLConnection.getNewHttpClient(HttpURLConnection.java:997)
	at sun.net.www.protocol.http.HttpURLConnection.plainConnect(HttpURLConnection.java:933)
	at sun.net.www.protocol.http.HttpURLConnection.connect(HttpURLConnection.java:851)
	at org.apache.thrift.transport.THttpClient.flush(THttpClient.java:328)
	... 19 more

  Run 2: TestThriftHttpServer.testRunThriftServerWithHeaderBufferLength:113->runThriftServer:147->talkToThriftServer:187
null
  Run 3: TestThriftHttpServer.testRunThriftServerWithHeaderBufferLength:113->runThriftServer:147->talkToThriftServer:187
null


Tests run: 80, Failures: 1, Errors: 0, Skipped: 0

[INFO] ------------------------------------------------------------------------
[INFO] Reactor Summary:
[INFO] 
[INFO] Apache HBase ....................................... SUCCESS [  3.677 s]
[INFO] Apache HBase - Checkstyle .......................... SUCCESS [  0.815 s]
[INFO] Apache HBase - Resource Bundle ..................... SUCCESS [  0.357 s]
[INFO] Apache HBase - Annotations ......................... SUCCESS [  1.521 s]
[INFO] Apache HBase - Protocol ............................ SUCCESS [ 17.379 s]
[INFO] Apache HBase - Common .............................. SUCCESS [01:48 min]
[INFO] Apache HBase - Procedure ........................... SUCCESS [03:32 min]
[INFO] Apache HBase - Client .............................. SUCCESS [03:49 min]
[INFO] Apache HBase - Hadoop Compatibility ................ SUCCESS [  9.733 s]
[INFO] Apache HBase - Hadoop Two Compatibility ............ SUCCESS [ 14.385 s]
[INFO] Apache HBase - Prefix Tree ......................... SUCCESS [ 16.181 s]
[INFO] Apache HBase - Server .............................. SUCCESS [  02:19 h]
[INFO] Apache HBase - Testing Util ........................ SUCCESS [  2.892 s]
[INFO] Apache HBase - Thrift .............................. FAILURE [05:10 min]
[INFO] Apache HBase - Rest ................................ SKIPPED
[INFO] Apache HBase - Shell ............................... SKIPPED
[INFO] Apache HBase - Integration Tests ................... SKIPPED
[INFO] Apache HBase - Examples ............................ SKIPPED
[INFO] Apache HBase - Assembly ............................ SKIPPED
[INFO] Apache HBase - Shaded .............................. SKIPPED
[INFO] Apache HBase - Shaded - Client ..................... SKIPPED
[INFO] Apache HBase - Shaded - Server ..................... SKIPPED
[INFO] ------------------------------------------------------------------------
[INFO] BUILD FAILURE
[INFO] ------------------------------------------------------------------------
[INFO] Total time: 02:35 h
[INFO] Finished at: 2016-07-23T08:36:45+00:00
[INFO] Final Memory: 72M/585M
[INFO] ------------------------------------------------------------------------
[ERROR] Failed to execute goal org.apache.maven.plugins:maven-surefire-plugin:2.18.1:test
(default-test) on project hbase-thrift: There are test failures.
[ERROR] 
[ERROR] Please refer to <https://builds.apache.org/job/HBase-1.1-JDK7/ws/hbase-thrift/target/surefire-reports>
for the individual test results.
[ERROR] -> [Help 1]
[ERROR] 
[ERROR] To see the full stack trace of the errors, re-run Maven with the -e switch.
[ERROR] Re-run Maven using the -X switch to enable full debug logging.
[ERROR] 
[ERROR] For more information about the errors and possible solutions, please read the following
articles:
[ERROR] [Help 1] http://cwiki.apache.org/confluence/display/MAVEN/MojoFailureException
[ERROR] 
[ERROR] After correcting the problems, you can resume the build with the command
[ERROR]   mvn <goals> -rf :hbase-thrift
Build step 'Invoke top-level Maven targets' marked build as failure
Performing Post build task...
Match found for :.* : True
Logical operation result is TRUE
Running script  : # Post-build task script. TODO: Check this in and have all builds reference
check-in.
pwd && ls
# NOTE!!!! The below code has been copied and pasted from ./dev-tools/run-test.sh
# Do not change here without syncing there and vice-versa.
ZOMBIE_TESTS_COUNT=`jps -v | grep surefirebooter | grep -e '-Dhbase.test' | wc -l`
if [[ $ZOMBIE_TESTS_COUNT != 0 ]] ; then
 echo "Suspicious java process found - waiting 30s to see if there are just slow to stop"
 sleep 30
 ZOMBIE_TESTS_COUNT=`jps -v | grep surefirebooter | grep -e '-Dhbase.test' | wc -l`
 if [[ $ZOMBIE_TESTS_COUNT != 0 ]] ; then
   echo " {color:red}There appear to be $ZOMBIE_TESTS_COUNT zombie tests{color}, they should
have been killed by surefire but survived"
   jps -v | grep surefirebooter | grep -e '-Dhbase.test'
   jps -v | grep surefirebooter | grep -e '-Dhbase.test' | cut -d ' ' -f 1 | xargs -n 1 jstack
   # Exit with error
   exit 1
 else
   echo "We're ok: there is no zombie test, but some tests took some time to stop"
 fi
else
  echo "We're ok: there is no zombie test"
fi
[HBase-1.1-JDK7] $ /bin/bash -xe /tmp/hudson5088841463810279120.sh
+ pwd
<https://builds.apache.org/job/HBase-1.1-JDK7/ws/>
+ ls
bin
CHANGES.txt
conf
dev-support
hbase-annotations
hbase-assembly
hbase-checkstyle
hbase-client
hbase-common
hbase-examples
hbase-hadoop2-compat
hbase-hadoop-compat
hbase-it
hbase-native-client
hbase-prefix-tree
hbase-procedure
hbase-protocol
hbase-resource-bundle
hbase-rest
hbase-server
hbase-shaded
hbase-shell
hbase-testing-util
hbase-thrift
LICENSE.txt
NOTICE.txt
pom.xml
README.txt
src
target
++ wc -l
++ grep -e -Dhbase.test
++ grep surefirebooter
++ jps -v
+ ZOMBIE_TESTS_COUNT=0
+ [[ 0 != 0 ]]
+ echo 'We'\''re ok: there is no zombie test'
We're ok: there is no zombie test
POST BUILD TASK : SUCCESS
END OF POST BUILD TASK : 0
Archiving artifacts
Recording test results
Updating HBASE-16272

Mime
View raw message