hbase-builds mailing list archives

Site index · List index
Message view « Date » · « Thread »
Top « Date » · « Thread »
From Apache Jenkins Server <jenk...@builds.apache.org>
Subject Build failed in Jenkins: HBase-Trunk_matrix » latest1.7,yahoo-not-h2 #1177
Date Wed, 06 Jul 2016 06:56:33 GMT
See <https://builds.apache.org/job/HBase-Trunk_matrix/jdk=latest1.7,label=yahoo-not-h2/1177/>

------------------------------------------
[...truncated 5724 lines...]
Tests run: 6, Failures: 0, Errors: 0, Skipped: 0, Time elapsed: 10.742 sec - in org.apache.hadoop.hbase.client.TestIncrementFromClientSideWithCoprocessor
Running org.apache.hadoop.hbase.client.TestMultipleTimestamps
Tests run: 9, Failures: 0, Errors: 0, Skipped: 0, Time elapsed: 53.654 sec - in org.apache.hadoop.hbase.client.TestSnapshotFromClient
Running org.apache.hadoop.hbase.client.TestClientTimeouts
Tests run: 1, Failures: 0, Errors: 0, Skipped: 0, Time elapsed: 2.474 sec - in org.apache.hadoop.hbase.client.TestClientTimeouts
Running org.apache.hadoop.hbase.client.TestTableSnapshotScanner
Running org.apache.hadoop.hbase.client.TestResultSizeEstimation
Tests run: 2, Failures: 0, Errors: 0, Skipped: 0, Time elapsed: 4.789 sec - in org.apache.hadoop.hbase.client.TestResultSizeEstimation
Running org.apache.hadoop.hbase.client.TestScannersFromClientSide
Tests run: 8, Failures: 0, Errors: 0, Skipped: 0, Time elapsed: 15.575 sec - in org.apache.hadoop.hbase.client.TestMultipleTimestamps
Running org.apache.hadoop.hbase.client.TestMultiRespectsLimits
Running org.apache.hadoop.hbase.client.TestSnapshotMetadata
Tests run: 8, Failures: 0, Errors: 0, Skipped: 0, Time elapsed: 15.707 sec - in org.apache.hadoop.hbase.client.TestScannersFromClientSide
Running org.apache.hadoop.hbase.client.TestMetaCache
Tests run: 2, Failures: 0, Errors: 0, Skipped: 0, Time elapsed: 8.122 sec - in org.apache.hadoop.hbase.client.TestMetaCache
Tests run: 2, Failures: 0, Errors: 0, Skipped: 0, Time elapsed: 26.46 sec - in org.apache.hadoop.hbase.client.TestMultiRespectsLimits
Tests run: 3, Failures: 0, Errors: 0, Skipped: 0, Time elapsed: 51.6 sec - in org.apache.hadoop.hbase.client.TestTableSnapshotScanner
Running org.apache.hadoop.hbase.client.TestTimestampsFilter
Tests run: 4, Failures: 0, Errors: 0, Skipped: 0, Time elapsed: 36.687 sec - in org.apache.hadoop.hbase.client.TestSnapshotMetadata
Running org.apache.hadoop.hbase.client.TestUpdateConfiguration
Tests run: 2, Failures: 0, Errors: 0, Skipped: 0, Time elapsed: 0.339 sec - in org.apache.hadoop.hbase.client.TestUpdateConfiguration
Running org.apache.hadoop.hbase.client.TestSnapshotFromClientWithRegionReplicas
Tests run: 12, Failures: 0, Errors: 0, Skipped: 0, Time elapsed: 136.284 sec - in org.apache.hadoop.hbase.client.TestMetaWithReplicas
Tests run: 3, Failures: 0, Errors: 0, Skipped: 0, Time elapsed: 10.952 sec - in org.apache.hadoop.hbase.client.TestTimestampsFilter
Running org.apache.hadoop.hbase.client.TestSplitOrMergeStatus
Running org.apache.hadoop.hbase.client.TestIncrementsFromClientSide
Running org.apache.hadoop.hbase.client.TestConnectionImplementation
Running org.apache.hadoop.hbase.client.TestMobSnapshotFromClient
Tests run: 2, Failures: 0, Errors: 0, Skipped: 0, Time elapsed: 1.303 sec - in org.apache.hadoop.hbase.client.TestConnectionImplementation
Tests run: 6, Failures: 0, Errors: 0, Skipped: 0, Time elapsed: 9.991 sec - in org.apache.hadoop.hbase.client.TestIncrementsFromClientSide
Running org.apache.hadoop.hbase.client.TestCloneSnapshotFromClientWithRegionReplicas
Tests run: 4, Failures: 0, Errors: 0, Skipped: 0, Time elapsed: 33.786 sec - in org.apache.hadoop.hbase.client.TestSplitOrMergeStatus
Running org.apache.hadoop.hbase.client.TestShortCircuitConnection
Tests run: 1, Failures: 0, Errors: 0, Skipped: 0, Time elapsed: 2.33 sec - in org.apache.hadoop.hbase.client.TestShortCircuitConnection
Tests run: 9, Failures: 0, Errors: 0, Skipped: 0, Time elapsed: 55.632 sec - in org.apache.hadoop.hbase.client.TestSnapshotFromClientWithRegionReplicas
Running org.apache.hadoop.hbase.client.TestFromClientSide3
Running org.apache.hadoop.hbase.client.TestFastFail
Tests run: 2, Failures: 0, Errors: 0, Skipped: 1, Time elapsed: 3.553 sec - in org.apache.hadoop.hbase.client.TestFastFail
Running org.apache.hadoop.hbase.client.TestReplicasClient
Tests run: 9, Failures: 0, Errors: 0, Skipped: 0, Time elapsed: 75.713 sec - in org.apache.hadoop.hbase.client.TestMobSnapshotFromClient
Running org.apache.hadoop.hbase.client.TestAdmin2
Running org.apache.hadoop.hbase.client.TestSizeFailures
Tests run: 9, Failures: 0, Errors: 0, Skipped: 0, Time elapsed: 74.066 sec - in org.apache.hadoop.hbase.client.TestFromClientSide3
Running org.apache.hadoop.hbase.client.TestFromClientSideNoCodec
Tests run: 2, Failures: 0, Errors: 0, Skipped: 0, Time elapsed: 2.328 sec - in org.apache.hadoop.hbase.client.TestFromClientSideNoCodec
Tests run: 5, Failures: 0, Errors: 0, Skipped: 0, Time elapsed: 137.71 sec - in org.apache.hadoop.hbase.client.TestCloneSnapshotFromClientWithRegionReplicas
Running org.apache.hadoop.hbase.TestZooKeeper
Running org.apache.hadoop.hbase.TestStochasticBalancerJmxMetrics
Tests run: 1, Failures: 0, Errors: 0, Skipped: 1, Time elapsed: 0.001 sec - in org.apache.hadoop.hbase.TestStochasticBalancerJmxMetrics
Tests run: 2, Failures: 0, Errors: 0, Skipped: 0, Time elapsed: 49.405 sec - in org.apache.hadoop.hbase.client.TestSizeFailures
Running org.apache.hadoop.hbase.namespace.TestNamespaceAuditor
Running org.apache.hadoop.hbase.trace.TestHTraceHooks
Tests run: 1, Failures: 0, Errors: 0, Skipped: 0, Time elapsed: 2.618 sec - in org.apache.hadoop.hbase.trace.TestHTraceHooks
Running org.apache.hadoop.hbase.TestHBaseTestingUtility
Tests run: 26, Failures: 0, Errors: 0, Skipped: 0, Time elapsed: 96.479 sec - in org.apache.hadoop.hbase.client.TestAdmin2
Running org.apache.hadoop.hbase.zookeeper.TestHQuorumPeer
Tests run: 3, Failures: 0, Errors: 0, Skipped: 0, Time elapsed: 0.79 sec - in org.apache.hadoop.hbase.zookeeper.TestHQuorumPeer
Running org.apache.hadoop.hbase.zookeeper.TestRecoverableZooKeeper
Tests run: 1, Failures: 0, Errors: 0, Skipped: 0, Time elapsed: 1.184 sec - in org.apache.hadoop.hbase.zookeeper.TestRecoverableZooKeeper
Running org.apache.hadoop.hbase.zookeeper.TestZooKeeperNodeTracker
Tests run: 3, Failures: 0, Errors: 0, Skipped: 0, Time elapsed: 0.914 sec - in org.apache.hadoop.hbase.zookeeper.TestZooKeeperNodeTracker
Running org.apache.hadoop.hbase.zookeeper.TestZKMulti
Tests run: 12, Failures: 0, Errors: 0, Skipped: 0, Time elapsed: 1.535 sec - in org.apache.hadoop.hbase.zookeeper.TestZKMulti
Running org.apache.hadoop.hbase.zookeeper.TestZKLeaderManager
Tests run: 1, Failures: 0, Errors: 0, Skipped: 0, Time elapsed: 0.104 sec - in org.apache.hadoop.hbase.zookeeper.TestZKLeaderManager
Running org.apache.hadoop.hbase.zookeeper.lock.TestZKInterProcessReadWriteLock
Tests run: 13, Failures: 0, Errors: 0, Skipped: 0, Time elapsed: 55.823 sec - in org.apache.hadoop.hbase.TestHBaseTestingUtility
Tests run: 6, Failures: 0, Errors: 0, Skipped: 0, Time elapsed: 24.53 sec - in org.apache.hadoop.hbase.zookeeper.lock.TestZKInterProcessReadWriteLock
Running org.apache.hadoop.hbase.zookeeper.TestZooKeeperACL
Tests run: 7, Failures: 0, Errors: 0, Skipped: 0, Time elapsed: 0.398 sec - in org.apache.hadoop.hbase.zookeeper.TestZooKeeperACL
Running org.apache.hadoop.hbase.mapreduce.TestCellCounter
Running org.apache.hadoop.hbase.mapreduce.TestImportTSVWithOperationAttributes
Tests run: 2, Failures: 0, Errors: 0, Skipped: 0, Time elapsed: 22.756 sec - in org.apache.hadoop.hbase.mapreduce.TestImportTSVWithOperationAttributes
Tests run: 8, Failures: 0, Errors: 0, Skipped: 0, Time elapsed: 38.158 sec - in org.apache.hadoop.hbase.mapreduce.TestCellCounter
Running org.apache.hadoop.hbase.mapreduce.TestSecureLoadIncrementalHFilesSplitRecovery
Running org.apache.hadoop.hbase.mapreduce.TestTableInputFormat
Tests run: 12, Failures: 0, Errors: 0, Skipped: 0, Time elapsed: 125.897 sec - in org.apache.hadoop.hbase.namespace.TestNamespaceAuditor
Running org.apache.hadoop.hbase.mapreduce.TestHLogRecordReader
Tests run: 2, Failures: 0, Errors: 0, Skipped: 0, Time elapsed: 1.348 sec - in org.apache.hadoop.hbase.mapreduce.TestHLogRecordReader
Tests run: 8, Failures: 0, Errors: 0, Skipped: 0, Time elapsed: 17.744 sec - in org.apache.hadoop.hbase.mapreduce.TestTableInputFormat
Running org.apache.hadoop.hbase.mapreduce.TestHRegionPartitioner
Tests run: 10, Failures: 0, Errors: 0, Skipped: 0, Time elapsed: 161.948 sec - in org.apache.hadoop.hbase.TestZooKeeper
Tests run: 1, Failures: 0, Errors: 0, Skipped: 0, Time elapsed: 3.774 sec - in org.apache.hadoop.hbase.mapreduce.TestHRegionPartitioner
Running org.apache.hadoop.hbase.mapreduce.TestImportTsv
Tests run: 6, Failures: 0, Errors: 0, Skipped: 0, Time elapsed: 37.215 sec - in org.apache.hadoop.hbase.mapreduce.TestSecureLoadIncrementalHFilesSplitRecovery
Running org.apache.hadoop.hbase.mapreduce.TestWALPlayer
Running org.apache.hadoop.hbase.mapreduce.TestImportExport
Running org.apache.hadoop.hbase.mapreduce.TestRowCounter
Tests run: 4, Failures: 0, Errors: 0, Skipped: 0, Time elapsed: 10.606 sec - in org.apache.hadoop.hbase.mapreduce.TestWALPlayer
Tests run: 14, Failures: 0, Errors: 0, Skipped: 0, Time elapsed: 264.044 sec - in org.apache.hadoop.hbase.client.TestReplicasClient
Running org.apache.hadoop.hbase.mapreduce.TestImportTSVWithVisibilityLabels
Running org.apache.hadoop.hbase.mapreduce.TestHashTable
Tests run: 1, Failures: 0, Errors: 0, Skipped: 0, Time elapsed: 13.494 sec - in org.apache.hadoop.hbase.mapreduce.TestHashTable
Running org.apache.hadoop.hbase.mapreduce.TestImportTSVWithTTLs
Tests run: 1, Failures: 0, Errors: 0, Skipped: 0, Time elapsed: 12.977 sec - in org.apache.hadoop.hbase.mapreduce.TestImportTSVWithTTLs
Running org.apache.hadoop.hbase.mapreduce.TestHFileOutputFormat2
Tests run: 13, Failures: 0, Errors: 0, Skipped: 0, Time elapsed: 71.524 sec - in org.apache.hadoop.hbase.mapreduce.TestRowCounter
Tests run: 12, Failures: 0, Errors: 0, Skipped: 0, Time elapsed: 87.071 sec - in org.apache.hadoop.hbase.mapreduce.TestImportExport
Running org.apache.hadoop.hbase.mapreduce.TestWALRecordReader
Tests run: 2, Failures: 0, Errors: 0, Skipped: 0, Time elapsed: 1.315 sec - in org.apache.hadoop.hbase.mapreduce.TestWALRecordReader
Tests run: 16, Failures: 0, Errors: 0, Skipped: 14, Time elapsed: 28.429 sec - in org.apache.hadoop.hbase.mapreduce.TestHFileOutputFormat2
Running org.apache.hadoop.hbase.mapreduce.TestTableSnapshotInputFormat
Tests run: 7, Failures: 0, Errors: 0, Skipped: 0, Time elapsed: 79.234 sec - in org.apache.hadoop.hbase.mapreduce.TestImportTSVWithVisibilityLabels
Running org.apache.hadoop.hbase.mapreduce.TestTableInputFormatScan1
Running org.apache.hadoop.hbase.mapreduce.TestMultiTableSnapshotInputFormat
Running org.apache.hadoop.hbase.mapreduce.TestTimeRangeMapRed
Tests run: 1, Failures: 0, Errors: 0, Skipped: 0, Time elapsed: 8.629 sec - in org.apache.hadoop.hbase.mapreduce.TestTimeRangeMapRed
Tests run: 18, Failures: 0, Errors: 0, Skipped: 0, Time elapsed: 141.044 sec - in org.apache.hadoop.hbase.mapreduce.TestImportTsv
Running org.apache.hadoop.hbase.mapreduce.TestSyncTable
Running org.apache.hadoop.hbase.mapreduce.TestCopyTable
Tests run: 4, Failures: 0, Errors: 0, Skipped: 0, Time elapsed: 36.102 sec - in org.apache.hadoop.hbase.mapreduce.TestMultiTableSnapshotInputFormat
Tests run: 7, Failures: 0, Errors: 0, Skipped: 0, Time elapsed: 39.949 sec - in org.apache.hadoop.hbase.mapreduce.TestTableInputFormatScan1
Running org.apache.hadoop.hbase.io.TestFileLink
Running org.apache.hadoop.hbase.TestMetaTableAccessor
Tests run: 1, Failures: 0, Errors: 0, Skipped: 0, Time elapsed: 29.467 sec - in org.apache.hadoop.hbase.mapreduce.TestSyncTable
Tests run: 5, Failures: 0, Errors: 0, Skipped: 0, Time elapsed: 18.353 sec - in org.apache.hadoop.hbase.io.TestFileLink
Running org.apache.hadoop.hbase.io.hfile.TestHFileBlockIndex
Running org.apache.hadoop.hbase.io.hfile.TestSeekBeforeWithInlineBlocks
Tests run: 10, Failures: 0, Errors: 0, Skipped: 0, Time elapsed: 6.809 sec - in org.apache.hadoop.hbase.io.hfile.TestHFileBlockIndex
Tests run: 1, Failures: 0, Errors: 0, Skipped: 0, Time elapsed: 13.355 sec - in org.apache.hadoop.hbase.io.hfile.TestSeekBeforeWithInlineBlocks
Running org.apache.hadoop.hbase.io.hfile.TestScannerSelectionUsingTTL
Tests run: 15, Failures: 0, Errors: 0, Skipped: 0, Time elapsed: 24.572 sec - in org.apache.hadoop.hbase.TestMetaTableAccessor
Running org.apache.hadoop.hbase.io.hfile.TestHFileSeek
Tests run: 1, Failures: 0, Errors: 0, Skipped: 0, Time elapsed: 2.976 sec - in org.apache.hadoop.hbase.io.hfile.TestHFileSeek
Running org.apache.hadoop.hbase.io.hfile.TestHFileBlock
Running org.apache.hadoop.hbase.io.hfile.TestCacheConfig
Tests run: 7, Failures: 0, Errors: 0, Skipped: 0, Time elapsed: 2.324 sec - in org.apache.hadoop.hbase.io.hfile.TestCacheConfig
Running org.apache.hadoop.hbase.io.hfile.TestScannerFromBucketCache
Tests run: 5, Failures: 0, Errors: 0, Skipped: 0, Time elapsed: 57.069 sec - in org.apache.hadoop.hbase.mapreduce.TestCopyTable
Running org.apache.hadoop.hbase.io.hfile.TestForceCacheImportantBlocks
Tests run: 4, Failures: 0, Errors: 0, Skipped: 0, Time elapsed: 5.465 sec - in org.apache.hadoop.hbase.io.hfile.TestScannerFromBucketCache
Running org.apache.hadoop.hbase.io.hfile.TestCacheOnWrite
Tests run: 8, Failures: 0, Errors: 0, Skipped: 0, Time elapsed: 121.226 sec - in org.apache.hadoop.hbase.mapreduce.TestTableSnapshotInputFormat
Running org.apache.hadoop.hbase.io.encoding.TestEncodedSeekers
Tests run: 2, Failures: 0, Errors: 0, Skipped: 0, Time elapsed: 27.314 sec - in org.apache.hadoop.hbase.io.hfile.TestForceCacheImportantBlocks
Running org.apache.hadoop.hbase.io.encoding.TestDataBlockEncoders
Tests run: 6, Failures: 0, Errors: 0, Skipped: 0, Time elapsed: 63.578 sec - in org.apache.hadoop.hbase.io.hfile.TestScannerSelectionUsingTTL
Running org.apache.hadoop.hbase.io.encoding.TestBufferedDataBlockEncoder
Tests run: 2, Failures: 0, Errors: 0, Skipped: 0, Time elapsed: 16.655 sec - in org.apache.hadoop.hbase.io.encoding.TestBufferedDataBlockEncoder
Running org.apache.hadoop.hbase.io.asyncfs.TestFanOutOneBlockAsyncDFSOutput
Tests run: 28, Failures: 0, Errors: 0, Skipped: 0, Time elapsed: 92.194 sec - in org.apache.hadoop.hbase.io.hfile.TestHFileBlock
Running org.apache.hadoop.hbase.io.asyncfs.TestSaslFanOutOneBlockAsyncDFSOutput
Tests run: 56, Failures: 0, Errors: 0, Skipped: 0, Time elapsed: 57.673 sec - in org.apache.hadoop.hbase.io.encoding.TestDataBlockEncoders
Running org.apache.hadoop.hbase.filter.TestScanRowPrefix
Tests run: 1, Failures: 0, Errors: 0, Skipped: 0, Time elapsed: 6.473 sec - in org.apache.hadoop.hbase.filter.TestScanRowPrefix
Tests run: 5, Failures: 0, Errors: 0, Skipped: 0, Time elapsed: 38.578 sec - in org.apache.hadoop.hbase.io.asyncfs.TestFanOutOneBlockAsyncDFSOutput
Running org.apache.hadoop.hbase.filter.TestFilterWithScanLimits
Tests run: 20, Failures: 0, Errors: 0, Skipped: 0, Time elapsed: 111.573 sec - in org.apache.hadoop.hbase.io.encoding.TestEncodedSeekers
Running org.apache.hadoop.hbase.filter.TestFilterWrapper
Tests run: 1, Failures: 0, Errors: 0, Skipped: 0, Time elapsed: 4.549 sec - in org.apache.hadoop.hbase.filter.TestFilterWrapper
Running org.apache.hadoop.hbase.filter.TestFuzzyRowFilterEndToEnd
Running org.apache.hadoop.hbase.filter.TestFilterListOrOperatorWithBlkCnt
Tests run: 1, Failures: 0, Errors: 0, Skipped: 0, Time elapsed: 16.327 sec - in org.apache.hadoop.hbase.filter.TestFilterListOrOperatorWithBlkCnt
Tests run: 72, Failures: 0, Errors: 0, Skipped: 0, Time elapsed: 160.687 sec - in org.apache.hadoop.hbase.io.hfile.TestCacheOnWrite
Tests run: 36, Failures: 0, Errors: 0, Skipped: 0, Time elapsed: 86.711 sec - in org.apache.hadoop.hbase.io.asyncfs.TestSaslFanOutOneBlockAsyncDFSOutput
Tests run: 1, Failures: 0, Errors: 0, Skipped: 0, Time elapsed: 52.14 sec - in org.apache.hadoop.hbase.filter.TestFilterWithScanLimits
Running org.apache.hadoop.hbase.filter.TestColumnRangeFilter
Running org.apache.hadoop.hbase.filter.TestFuzzyRowAndColumnRangeFilter
Running org.apache.hadoop.hbase.filter.TestMultiRowRangeFilter
Tests run: 1, Failures: 0, Errors: 0, Skipped: 0, Time elapsed: 3.741 sec - in org.apache.hadoop.hbase.filter.TestFuzzyRowAndColumnRangeFilter
Tests run: 1, Failures: 0, Errors: 0, Skipped: 0, Time elapsed: 8.174 sec - in org.apache.hadoop.hbase.filter.TestColumnRangeFilter
Tests run: 20, Failures: 0, Errors: 0, Skipped: 0, Time elapsed: 18.095 sec - in org.apache.hadoop.hbase.filter.TestMultiRowRangeFilter
Tests run: 4, Failures: 0, Errors: 0, Skipped: 0, Time elapsed: 294.377 sec - in org.apache.hadoop.hbase.filter.TestFuzzyRowFilterEndToEnd

Results :

Tests in error: 
  TestCloneSnapshotProcedure.testCloneSnapshot:146->getSnapshot:112 » TableExists
  TestCloneSnapshotProcedure.testCloneSnapshotToSameTable:182->getSnapshot:112->Object.wait:461->Object.wait:-2
» TestTimedOut
  TestCloneSnapshotProcedure.testCloneSnapshotTwiceWithSameNonce:163->getSnapshot:112 »
TableExists
  TestCloneSnapshotProcedure.testRecoveryAndDoubleExecution:204->getSnapshot:112 » TableExists
  TestCloneSnapshotProcedure.testRollbackAndDoubleExecution:232->getSnapshot:112 » TableExists
org.apache.hadoop.hbase.master.procedure.TestDeleteTableProcedure.testDoubleDeletedTableWithSameNonce(org.apache.hadoop.hbase.master.procedure.TestDeleteTableProcedure)
  Run 1: TestDeleteTableProcedure.testDoubleDeletedTableWithSameNonce:158->Object.wait:461->Object.wait:-2
» TestTimedOut
  Run 2: TestDeleteTableProcedure.tearDown:91 » TableNotFound testDoubleDeletedTableWit...


Tests run: 2069, Failures: 0, Errors: 6, Skipped: 24

[INFO] ------------------------------------------------------------------------
[INFO] Reactor Summary:
[INFO] 
[INFO] Apache HBase ...................................... SUCCESS [  2.590 s]
[INFO] Apache HBase - Checkstyle ......................... SUCCESS [  0.729 s]
[INFO] Apache HBase - Resource Bundle .................... SUCCESS [  0.202 s]
[INFO] Apache HBase - Annotations ........................ SUCCESS [  0.180 s]
[INFO] Apache HBase - Protocol ........................... SUCCESS [  2.963 s]
[INFO] Apache HBase - Common ............................. SUCCESS [01:30 min]
[INFO] Apache HBase - Procedure .......................... SUCCESS [01:33 min]
[INFO] Apache HBase - Client ............................. SUCCESS [ 41.202 s]
[INFO] Apache HBase - Hadoop Compatibility ............... SUCCESS [  7.454 s]
[INFO] Apache HBase - Hadoop Two Compatibility ........... SUCCESS [  9.420 s]
[INFO] Apache HBase - Prefix Tree ........................ SUCCESS [ 10.453 s]
[INFO] Apache HBase - Server ............................. FAILURE [  01:08 h]
[INFO] Apache HBase - Testing Util ....................... SKIPPED
[INFO] Apache HBase - Thrift ............................. SKIPPED
[INFO] Apache HBase - RSGroup ............................ SKIPPED
[INFO] Apache HBase - Shell .............................. SKIPPED
[INFO] Apache HBase - Integration Tests .................. SKIPPED
[INFO] Apache HBase - Examples ........................... SKIPPED
[INFO] Apache HBase - Rest ............................... SKIPPED
[INFO] Apache HBase - External Block Cache ............... SKIPPED
[INFO] Apache HBase - Spark .............................. SKIPPED
[INFO] Apache HBase - Assembly ........................... SKIPPED
[INFO] Apache HBase - Shaded ............................. SKIPPED
[INFO] Apache HBase - Shaded - Client .................... SKIPPED
[INFO] Apache HBase - Shaded - Server .................... SKIPPED
[INFO] Apache HBase - Archetypes ......................... SKIPPED
[INFO] Apache HBase - Exemplar for hbase-client archetype  SKIPPED
[INFO] Apache HBase - Exemplar for hbase-shaded-client archetype  SKIPPED
[INFO] Apache HBase - Archetype builder .................. SKIPPED
[INFO] ------------------------------------------------------------------------
[INFO] BUILD FAILURE
[INFO] ------------------------------------------------------------------------
[INFO] Total time: 01:13 h
[INFO] Finished at: 2016-07-06T06:54:28+00:00
[INFO] Final Memory: 70M/497M
[INFO] ------------------------------------------------------------------------
[ERROR] Failed to execute goal org.apache.maven.plugins:maven-surefire-plugin:2.18.1:test
(secondPartTestsExecution) on project hbase-server: There are test failures.
[ERROR] 
[ERROR] Please refer to <https://builds.apache.org/job/HBase-Trunk_matrix/jdk=latest1.7,label=yahoo-not-h2/ws/hbase-server/target/surefire-reports>
for the individual test results.
[ERROR] -> [Help 1]
[ERROR] 
[ERROR] To see the full stack trace of the errors, re-run Maven with the -e switch.
[ERROR] Re-run Maven using the -X switch to enable full debug logging.
[ERROR] 
[ERROR] For more information about the errors and possible solutions, please read the following
articles:
[ERROR] [Help 1] http://cwiki.apache.org/confluence/display/MAVEN/MojoFailureException
[ERROR] 
[ERROR] After correcting the problems, you can resume the build with the command
[ERROR]   mvn <goals> -rf :hbase-server
Build step 'Invoke top-level Maven targets' marked build as failure
Performing Post build task...
Match found for :.* : True
Logical operation result is TRUE
Running script  : # Run zombie detector script
./dev-support/zombie-detector.sh --jenkins ${BUILD_ID}
[yahoo-not-h2] $ /bin/bash -xe /tmp/hudson3064005423305615791.sh
+ ./dev-support/zombie-detector.sh --jenkins 1177
Wed Jul  6 06:54:30 UTC 2016 We're ok: there is no zombie test


    {color:green}+1 zombies{color}. No zombie tests found running at the end of the build.
POST BUILD TASK : SUCCESS
END OF POST BUILD TASK : 0
Archiving artifacts
Recording test results
[FINDBUGS] Skipping publisher since build result is FAILURE
[CHECKSTYLE] Skipping publisher since build result is FAILURE

Mime
View raw message