hbase-builds mailing list archives

Site index · List index
Message view « Date » · « Thread »
Top « Date » · « Thread »
From Apache Jenkins Server <jenk...@builds.apache.org>
Subject Build failed in Jenkins: HBase-1.4 » latest1.7,yahoo-not-h2 #287
Date Thu, 14 Jul 2016 05:45:43 GMT
See <https://builds.apache.org/job/HBase-1.4/jdk=latest1.7,label=yahoo-not-h2/287/changes>

Changes:

[enis] HBASE-16095 Add priority to TableDescriptor and priority region open

------------------------------------------
[...truncated 47380 lines...]
Running org.apache.hadoop.hbase.TestMetaTableAccessor
Tests run: 1, Failures: 0, Errors: 0, Skipped: 0, Time elapsed: 54.03 sec - in org.apache.hadoop.hbase.client.TestClientOperationInterrupt
Running org.apache.hadoop.hbase.TestHBaseOnOtherDfsCluster
Tests run: 14, Failures: 0, Errors: 0, Skipped: 0, Time elapsed: 22.928 sec - in org.apache.hadoop.hbase.TestMetaTableAccessor
Running org.apache.hadoop.hbase.util.hbck.TestOfflineMetaRebuildBase
Tests run: 1, Failures: 0, Errors: 0, Skipped: 0, Time elapsed: 13.131 sec - in org.apache.hadoop.hbase.TestHBaseOnOtherDfsCluster
Running org.apache.hadoop.hbase.util.hbck.TestOfflineMetaRebuildOverlap
Tests run: 2, Failures: 0, Errors: 0, Skipped: 0, Time elapsed: 61.77 sec - in org.apache.hadoop.hbase.TestDrainingServer
Running org.apache.hadoop.hbase.util.hbck.TestOfflineMetaRebuildHole
Tests run: 1, Failures: 0, Errors: 0, Skipped: 0, Time elapsed: 25.054 sec - in org.apache.hadoop.hbase.util.hbck.TestOfflineMetaRebuildBase
Running org.apache.hadoop.hbase.util.TestTableName
Tests run: 6, Failures: 0, Errors: 0, Skipped: 0, Time elapsed: 0.591 sec - in org.apache.hadoop.hbase.util.TestTableName
Tests run: 1, Failures: 0, Errors: 0, Skipped: 0, Time elapsed: 22.093 sec - in org.apache.hadoop.hbase.util.hbck.TestOfflineMetaRebuildOverlap
Running org.apache.hadoop.hbase.util.TestMiniClusterLoadEncoded
Running org.apache.hadoop.hbase.util.TestCoprocessorScanPolicy
Tests run: 1, Failures: 0, Errors: 0, Skipped: 0, Time elapsed: 23.547 sec - in org.apache.hadoop.hbase.util.hbck.TestOfflineMetaRebuildHole
Running org.apache.hadoop.hbase.util.TestMiniClusterLoadSequential
Tests run: 4, Failures: 0, Errors: 0, Skipped: 0, Time elapsed: 12.538 sec - in org.apache.hadoop.hbase.util.TestCoprocessorScanPolicy
Running org.apache.hadoop.hbase.util.TestIdLock
Tests run: 77, Failures: 0, Errors: 0, Skipped: 4, Time elapsed: 200.956 sec - in org.apache.hadoop.hbase.client.TestFromClientSide
Running org.apache.hadoop.hbase.util.TestMergeTable
Tests run: 1, Failures: 0, Errors: 0, Skipped: 0, Time elapsed: 15.391 sec - in org.apache.hadoop.hbase.util.TestIdLock
Running org.apache.hadoop.hbase.util.TestHBaseFsckEncryption
Tests run: 1, Failures: 0, Errors: 0, Skipped: 0, Time elapsed: 14.432 sec - in org.apache.hadoop.hbase.util.TestHBaseFsckEncryption
Running org.apache.hadoop.hbase.util.TestMiniClusterLoadParallel
Tests run: 1, Failures: 0, Errors: 0, Skipped: 0, Time elapsed: 25.725 sec - in org.apache.hadoop.hbase.util.TestMergeTable
Tests run: 5, Failures: 0, Errors: 0, Skipped: 0, Time elapsed: 55.917 sec - in org.apache.hadoop.hbase.util.TestMiniClusterLoadEncoded
Running org.apache.hadoop.hbase.util.TestMergeTool
Tests run: 4, Failures: 0, Errors: 0, Skipped: 0, Time elapsed: 53.525 sec - in org.apache.hadoop.hbase.util.TestMiniClusterLoadSequential
Running org.apache.hadoop.hbase.util.TestFSTableDescriptors
Running org.apache.hadoop.hbase.util.TestHBaseFsck
Tests run: 15, Failures: 0, Errors: 0, Skipped: 0, Time elapsed: 3.033 sec - in org.apache.hadoop.hbase.util.TestFSTableDescriptors
Running org.apache.hadoop.hbase.util.TestIdReadWriteLock
Tests run: 1, Failures: 0, Errors: 0, Skipped: 0, Time elapsed: 20.554 sec - in org.apache.hadoop.hbase.util.TestMergeTool
Running org.apache.hadoop.hbase.util.TestFSHDFSUtils
Tests run: 1, Failures: 0, Errors: 0, Skipped: 0, Time elapsed: 15.849 sec - in org.apache.hadoop.hbase.util.TestIdReadWriteLock
Running org.apache.hadoop.hbase.util.TestConnectionCache
Tests run: 3, Failures: 0, Errors: 0, Skipped: 0, Time elapsed: 8.425 sec - in org.apache.hadoop.hbase.util.TestFSHDFSUtils
Running org.apache.hadoop.hbase.util.TestFSVisitor
Tests run: 1, Failures: 0, Errors: 0, Skipped: 0, Time elapsed: 1.978 sec - in org.apache.hadoop.hbase.util.TestFSVisitor
Running org.apache.hadoop.hbase.util.TestFSUtils
Tests run: 1, Failures: 0, Errors: 0, Skipped: 0, Time elapsed: 18.364 sec - in org.apache.hadoop.hbase.util.TestConnectionCache
Running org.apache.hadoop.hbase.util.TestDefaultEnvironmentEdge
Tests run: 4, Failures: 0, Errors: 0, Skipped: 0, Time elapsed: 51.386 sec - in org.apache.hadoop.hbase.util.TestMiniClusterLoadParallel
Tests run: 1, Failures: 0, Errors: 0, Skipped: 0, Time elapsed: 0.392 sec - in org.apache.hadoop.hbase.util.TestDefaultEnvironmentEdge
Running org.apache.hadoop.hbase.wal.TestWALFiltering
Tests run: 10, Failures: 0, Errors: 0, Skipped: 0, Time elapsed: 14.132 sec - in org.apache.hadoop.hbase.util.TestFSUtils
Tests run: 77, Failures: 0, Errors: 0, Skipped: 4, Time elapsed: 200.899 sec - in org.apache.hadoop.hbase.client.TestFromClientSideWithCoprocessor
Running org.apache.hadoop.hbase.wal.TestDefaultWALProviderWithHLogKey
Running org.apache.hadoop.hbase.util.TestRegionSplitter
Running org.apache.hadoop.hbase.wal.TestBoundedRegionGroupingStrategy
Tests run: 5, Failures: 0, Errors: 0, Skipped: 0, Time elapsed: 8.482 sec - in org.apache.hadoop.hbase.wal.TestDefaultWALProviderWithHLogKey
Tests run: 6, Failures: 0, Errors: 0, Skipped: 0, Time elapsed: 6.451 sec - in org.apache.hadoop.hbase.util.TestRegionSplitter
Running org.apache.hadoop.hbase.wal.TestWALReaderOnSecureWAL
Running org.apache.hadoop.hbase.wal.TestSecureWAL
Tests run: 1, Failures: 0, Errors: 0, Skipped: 0, Time elapsed: 1.819 sec - in org.apache.hadoop.hbase.wal.TestSecureWAL
Tests run: 2, Failures: 0, Errors: 0, Skipped: 0, Time elapsed: 2.219 sec - in org.apache.hadoop.hbase.wal.TestWALReaderOnSecureWAL
Running org.apache.hadoop.hbase.wal.TestWALFactory
Running org.apache.hadoop.hbase.wal.TestDefaultWALProvider
Tests run: 1, Failures: 0, Errors: 0, Skipped: 0, Time elapsed: 28.257 sec - in org.apache.hadoop.hbase.wal.TestWALFiltering
Tests run: 5, Failures: 0, Errors: 0, Skipped: 0, Time elapsed: 21.378 sec - in org.apache.hadoop.hbase.wal.TestBoundedRegionGroupingStrategy
Tests run: 5, Failures: 0, Errors: 0, Skipped: 0, Time elapsed: 8.123 sec - in org.apache.hadoop.hbase.wal.TestDefaultWALProvider
Tests run: 9, Failures: 0, Errors: 0, Skipped: 0, Time elapsed: 12.644 sec - in org.apache.hadoop.hbase.wal.TestWALFactory
Running org.apache.hadoop.hbase.namespace.TestNamespaceAuditor
Running org.apache.hadoop.hbase.constraint.TestConstraint
Running org.apache.hadoop.hbase.TestNamespace
Running org.apache.hadoop.hbase.TestInfoServers
Tests run: 3, Failures: 0, Errors: 0, Skipped: 0, Time elapsed: 3.227 sec - in org.apache.hadoop.hbase.TestInfoServers
Running org.apache.hadoop.hbase.TestRegionRebalancing
Tests run: 5, Failures: 0, Errors: 0, Skipped: 0, Time elapsed: 20.8 sec - in org.apache.hadoop.hbase.constraint.TestConstraint
Running org.apache.hadoop.hbase.filter.TestMultiRowRangeFilter
Tests run: 8, Failures: 0, Errors: 0, Skipped: 0, Time elapsed: 36.711 sec - in org.apache.hadoop.hbase.TestNamespace
Tests run: 2, Failures: 0, Errors: 0, Skipped: 0, Time elapsed: 36.555 sec - in org.apache.hadoop.hbase.TestRegionRebalancing
Tests run: 20, Failures: 0, Errors: 0, Skipped: 0, Time elapsed: 16.507 sec - in org.apache.hadoop.hbase.filter.TestMultiRowRangeFilter
Running org.apache.hadoop.hbase.filter.TestScanRowPrefix
Tests run: 1, Failures: 0, Errors: 0, Skipped: 0, Time elapsed: 5.417 sec - in org.apache.hadoop.hbase.filter.TestScanRowPrefix
Running org.apache.hadoop.hbase.filter.TestFilterWrapper
Running org.apache.hadoop.hbase.filter.TestFuzzyRowFilterEndToEnd
Tests run: 1, Failures: 0, Errors: 0, Skipped: 0, Time elapsed: 3.325 sec - in org.apache.hadoop.hbase.filter.TestFilterWrapper
Running org.apache.hadoop.hbase.filter.TestFuzzyRowAndColumnRangeFilter
Tests run: 1, Failures: 0, Errors: 0, Skipped: 0, Time elapsed: 2.482 sec - in org.apache.hadoop.hbase.filter.TestFuzzyRowAndColumnRangeFilter
Running org.apache.hadoop.hbase.filter.TestColumnRangeFilter
Running org.apache.hadoop.hbase.filter.TestFilterWithScanLimits
Tests run: 1, Failures: 0, Errors: 0, Skipped: 0, Time elapsed: 7.502 sec - in org.apache.hadoop.hbase.filter.TestColumnRangeFilter
Tests run: 1, Failures: 0, Errors: 0, Skipped: 0, Time elapsed: 3.792 sec - in org.apache.hadoop.hbase.filter.TestFilterWithScanLimits
Running org.apache.hadoop.hbase.io.TestFileLink
Running org.apache.hadoop.hbase.filter.TestFilterListOrOperatorWithBlkCnt
Tests run: 12, Failures: 0, Errors: 0, Skipped: 1, Time elapsed: 108.426 sec - in org.apache.hadoop.hbase.namespace.TestNamespaceAuditor
Tests run: 5, Failures: 0, Errors: 0, Skipped: 0, Time elapsed: 12.862 sec - in org.apache.hadoop.hbase.io.TestFileLink
Running org.apache.hadoop.hbase.io.hfile.TestScannerSelectionUsingTTL
Running org.apache.hadoop.hbase.io.hfile.TestCacheConfig
Tests run: 6, Failures: 0, Errors: 0, Skipped: 0, Time elapsed: 1.842 sec - in org.apache.hadoop.hbase.io.hfile.TestCacheConfig
Running org.apache.hadoop.hbase.io.hfile.TestHFileSeek
Tests run: 1, Failures: 0, Errors: 0, Skipped: 0, Time elapsed: 2.058 sec - in org.apache.hadoop.hbase.io.hfile.TestHFileSeek
Running org.apache.hadoop.hbase.io.hfile.TestSeekBeforeWithInlineBlocks
Tests run: 1, Failures: 0, Errors: 0, Skipped: 0, Time elapsed: 15.744 sec - in org.apache.hadoop.hbase.filter.TestFilterListOrOperatorWithBlkCnt
Running org.apache.hadoop.hbase.io.hfile.TestForceCacheImportantBlocks
Tests run: 1, Failures: 0, Errors: 0, Skipped: 0, Time elapsed: 11.384 sec - in org.apache.hadoop.hbase.io.hfile.TestSeekBeforeWithInlineBlocks
Running org.apache.hadoop.hbase.io.hfile.TestCacheOnWrite
Tests run: 4, Failures: 0, Errors: 0, Skipped: 0, Time elapsed: 31.293 sec - in org.apache.hadoop.hbase.io.hfile.TestForceCacheImportantBlocks
Running org.apache.hadoop.hbase.io.hfile.TestHFileBlock
Tests run: 6, Failures: 0, Errors: 0, Skipped: 0, Time elapsed: 63.321 sec - in org.apache.hadoop.hbase.io.hfile.TestScannerSelectionUsingTTL
Running org.apache.hadoop.hbase.io.hfile.TestHFileBlockIndex
Tests run: 10, Failures: 0, Errors: 0, Skipped: 0, Time elapsed: 6.423 sec - in org.apache.hadoop.hbase.io.hfile.TestHFileBlockIndex
Running org.apache.hadoop.hbase.io.encoding.TestLoadAndSwitchEncodeOnDisk
Tests run: 1, Failures: 0, Errors: 0, Skipped: 0, Time elapsed: 29.877 sec - in org.apache.hadoop.hbase.io.encoding.TestLoadAndSwitchEncodeOnDisk
Running org.apache.hadoop.hbase.io.encoding.TestBufferedDataBlockEncoder
Tests run: 1, Failures: 0, Errors: 0, Skipped: 0, Time elapsed: 14.314 sec - in org.apache.hadoop.hbase.io.encoding.TestBufferedDataBlockEncoder
Running org.apache.hadoop.hbase.io.encoding.TestEncodedSeekers
Tests run: 28, Failures: 0, Errors: 0, Skipped: 0, Time elapsed: 91.446 sec - in org.apache.hadoop.hbase.io.hfile.TestHFileBlock
Running org.apache.hadoop.hbase.io.encoding.TestDataBlockEncoders
Tests run: 72, Failures: 0, Errors: 0, Skipped: 0, Time elapsed: 132.022 sec - in org.apache.hadoop.hbase.io.hfile.TestCacheOnWrite
Tests run: 54, Failures: 0, Errors: 0, Skipped: 1, Time elapsed: 347.518 sec - in org.apache.hadoop.hbase.util.TestHBaseFsck
Running org.apache.hadoop.hbase.TestClusterBootOrder
Tests run: 28, Failures: 0, Errors: 0, Skipped: 0, Time elapsed: 25.403 sec - in org.apache.hadoop.hbase.io.encoding.TestDataBlockEncoders
Running org.apache.hadoop.hbase.io.encoding.TestChangingEncoding
Tests run: 4, Failures: 0, Errors: 0, Skipped: 0, Time elapsed: 219.538 sec - in org.apache.hadoop.hbase.filter.TestFuzzyRowFilterEndToEnd
Tests run: 2, Failures: 0, Errors: 0, Skipped: 0, Time elapsed: 31.098 sec - in org.apache.hadoop.hbase.TestClusterBootOrder
Tests run: 20, Failures: 0, Errors: 0, Skipped: 0, Time elapsed: 92.973 sec - in org.apache.hadoop.hbase.io.encoding.TestEncodedSeekers
Tests run: 3, Failures: 0, Errors: 0, Skipped: 0, Time elapsed: 144.015 sec - in org.apache.hadoop.hbase.io.encoding.TestChangingEncoding

Results :

Tests in error: 
  TestAcidGuarantees.testMixedAtomicity:357->runTestAtomicity:254->runTestAtomicity:315
» Runtime
  TestClusterId.testClusterId:84 » IO Shutting down

Tests run: 2569, Failures: 0, Errors: 2, Skipped: 57

[INFO] ------------------------------------------------------------------------
[INFO] Reactor Summary:
[INFO] 
[INFO] Apache HBase ...................................... SUCCESS [4:41.422s]
[INFO] Apache HBase - Checkstyle ......................... SUCCESS [31.401s]
[INFO] Apache HBase - Resource Bundle .................... SUCCESS [0.241s]
[INFO] Apache HBase - Annotations ........................ SUCCESS [1.052s]
[INFO] Apache HBase - Protocol ........................... SUCCESS [29.646s]
[INFO] Apache HBase - Common ............................. SUCCESS [3:38.265s]
[INFO] Apache HBase - Procedure .......................... SUCCESS [2:56.653s]
[INFO] Apache HBase - Client ............................. SUCCESS [1:27.095s]
[INFO] Apache HBase - Hadoop Compatibility ............... SUCCESS [10.349s]
[INFO] Apache HBase - Hadoop Two Compatibility ........... SUCCESS [13.625s]
[INFO] Apache HBase - Prefix Tree ........................ SUCCESS [9.681s]
[INFO] Apache HBase - Server ............................. FAILURE [1:23:56.244s]
[INFO] Apache HBase - Testing Util ....................... SKIPPED
[INFO] Apache HBase - Thrift ............................. SKIPPED
[INFO] Apache HBase - Rest ............................... SKIPPED
[INFO] Apache HBase - Shell .............................. SKIPPED
[INFO] Apache HBase - Integration Tests .................. SKIPPED
[INFO] Apache HBase - Examples ........................... SKIPPED
[INFO] Apache HBase - External Block Cache ............... SKIPPED
[INFO] Apache HBase - Assembly ........................... SKIPPED
[INFO] Apache HBase - Shaded ............................. SKIPPED
[INFO] Apache HBase - Shaded - Client .................... SKIPPED
[INFO] Apache HBase - Shaded - Server .................... SKIPPED
[INFO] Apache HBase - Archetypes ......................... SKIPPED
[INFO] Apache HBase - Exemplar for hbase-client archetype  SKIPPED
[INFO] Apache HBase - Exemplar for hbase-shaded-client archetype  SKIPPED
[INFO] Apache HBase - Archetype builder .................. SKIPPED
[INFO] ------------------------------------------------------------------------
[INFO] BUILD FAILURE
[INFO] ------------------------------------------------------------------------
[INFO] Total time: 1:39:38.148s
[INFO] Finished at: Thu Jul 14 05:41:51 UTC 2016
[INFO] Final Memory: 96M/719M
[INFO] ------------------------------------------------------------------------
[ERROR] Failed to execute goal org.apache.maven.plugins:maven-surefire-plugin:2.18.1:test
(secondPartTestsExecution) on project hbase-server: ExecutionException: java.lang.RuntimeException:
java.lang.RuntimeException: org.apache.maven.surefire.report.ReporterException: When writing
xml report stdout/stderr: /tmp/stderr1198375879806184939deferred (No such file or directory)
-> [Help 1]
[ERROR] 
[ERROR] To see the full stack trace of the errors, re-run Maven with the -e switch.
[ERROR] Re-run Maven using the -X switch to enable full debug logging.
[ERROR] 
[ERROR] For more information about the errors and possible solutions, please read the following
articles:
[ERROR] [Help 1] http://cwiki.apache.org/confluence/display/MAVEN/MojoFailureException
[ERROR] 
[ERROR] After correcting the problems, you can resume the build with the command
[ERROR]   mvn <goals> -rf :hbase-server
Build step 'Invoke top-level Maven targets' marked build as failure
Performing Post build task...
Match found for :.* : True
Logical operation result is TRUE
Running script  : # Post-build task script. TODO: Check this in and have all builds reference
check-in.
pwd && ls
# NOTE!!!! The below code has been copied and pasted from ./dev-tools/run-test.sh
# Do not change here without syncing there and vice-versa.
ZOMBIE_TESTS_COUNT=`jps -v | grep surefirebooter | grep -e '-Dhbase.test' | wc -l`
if [[ $ZOMBIE_TESTS_COUNT != 0 ]] ; then
 echo "Suspicious java process found - waiting 30s to see if there are just slow to stop"
 sleep 30
 ZOMBIE_TESTS_COUNT=`jps -v | grep surefirebooter | grep -e '-Dhbase.test' | wc -l`
 if [[ $ZOMBIE_TESTS_COUNT != 0 ]] ; then
   echo " {color:red}There appear to be $ZOMBIE_TESTS_COUNT zombie tests{color}, they should
have been killed by surefire but survived"
   jps -v | grep surefirebooter | grep -e '-Dhbase.test'
   jps -v | grep surefirebooter | grep -e '-Dhbase.test' | cut -d ' ' -f 1 | xargs -n 1 jstack
   # Exit with error
   exit 1
 else
   echo "We're ok: there is no zombie test, but some tests took some time to stop"
 fi
else
  echo "We're ok: there is no zombie test"
fi
[yahoo-not-h2] $ /bin/bash -xe /tmp/hudson736419525363542631.sh
+ pwd
<https://builds.apache.org/job/HBase-1.4/jdk=latest1.7,label=yahoo-not-h2/ws/>
+ ls
bin
CHANGES.txt
conf
dev-support
hbase-annotations
hbase-archetypes
hbase-assembly
hbase-checkstyle
hbase-client
hbase-common
hbase-examples
hbase-external-blockcache
hbase-hadoop2-compat
hbase-hadoop-compat
hbase-it
hbase-native-client
hbase-prefix-tree
hbase-procedure
hbase-protocol
hbase-resource-bundle
hbase-rest
hbase-server
hbase-shaded
hbase-shell
hbase-testing-util
hbase-thrift
LICENSE.txt
NOTICE.txt
pom.xml
README.txt
src
target
++ jps -v
++ grep surefirebooter
++ grep -e -Dhbase.test
++ wc -l
+ ZOMBIE_TESTS_COUNT=0
+ [[ 0 != 0 ]]
+ echo 'We'\''re ok: there is no zombie test'
We're ok: there is no zombie test
POST BUILD TASK : SUCCESS
END OF POST BUILD TASK : 0
Archiving artifacts
Recording test results

Mime
View raw message