hbase-builds mailing list archives

Site index · List index
Message view « Date » · « Thread »
Top « Date » · « Thread »
From Apache Jenkins Server <jenk...@builds.apache.org>
Subject Build failed in Jenkins: HBase-Trunk_matrix » latest1.8,yahoo-not-h2 #1255
Date Tue, 19 Jul 2016 06:31:10 GMT
See <https://builds.apache.org/job/HBase-Trunk_matrix/jdk=latest1.8,label=yahoo-not-h2/1255/changes>

Changes:

[stack] HBASE-16236 Typo in javadoc of InstancePending (Hiroshi Ikeda)

------------------------------------------
[...truncated 5538 lines...]
Running org.apache.hadoop.hbase.io.hfile.TestHFileWriterV3
Tests run: 4, Failures: 0, Errors: 0, Skipped: 0, Time elapsed: 4.353 sec - in org.apache.hadoop.hbase.io.hfile.TestHFileWriterV3
Java HotSpot(TM) 64-Bit Server VM warning: ignoring option MaxPermSize=256m; support was removed
in 8.0
Java HotSpot(TM) 64-Bit Server VM warning: ignoring option MaxPermSize=256m; support was removed
in 8.0
Running org.apache.hadoop.hbase.io.hfile.TestHFileBlockPositionalRead
Tests run: 6, Failures: 0, Errors: 0, Skipped: 0, Time elapsed: 1.413 sec - in org.apache.hadoop.hbase.io.hfile.TestHFileBlockPositionalRead
Java HotSpot(TM) 64-Bit Server VM warning: ignoring option MaxPermSize=256m; support was removed
in 8.0
Java HotSpot(TM) 64-Bit Server VM warning: ignoring option MaxPermSize=256m; support was removed
in 8.0
Running org.apache.hadoop.hbase.io.hfile.TestLruCachedBlock
Tests run: 1, Failures: 0, Errors: 0, Skipped: 0, Time elapsed: 0.786 sec - in org.apache.hadoop.hbase.io.hfile.TestLruCachedBlock
Java HotSpot(TM) 64-Bit Server VM warning: ignoring option MaxPermSize=256m; support was removed
in 8.0
Running org.apache.hadoop.hbase.io.hfile.TestFixedFileTrailer
Tests run: 4, Failures: 0, Errors: 0, Skipped: 0, Time elapsed: 2.764 sec - in org.apache.hadoop.hbase.io.hfile.TestFixedFileTrailer
Java HotSpot(TM) 64-Bit Server VM warning: ignoring option MaxPermSize=256m; support was removed
in 8.0
Running org.apache.hadoop.hbase.io.hfile.TestHFileEncryption
Tests run: 3, Failures: 0, Errors: 0, Skipped: 0, Time elapsed: 7.378 sec - in org.apache.hadoop.hbase.io.hfile.TestHFileEncryption
Java HotSpot(TM) 64-Bit Server VM warning: ignoring option MaxPermSize=256m; support was removed
in 8.0
Running org.apache.hadoop.hbase.io.hfile.TestReseekTo
Tests run: 1, Failures: 0, Errors: 0, Skipped: 0, Time elapsed: 1.969 sec - in org.apache.hadoop.hbase.io.hfile.TestReseekTo
Java HotSpot(TM) 64-Bit Server VM warning: ignoring option MaxPermSize=256m; support was removed
in 8.0
Running org.apache.hadoop.hbase.io.hfile.TestCachedBlockQueue
Tests run: 2, Failures: 0, Errors: 0, Skipped: 0, Time elapsed: 0.585 sec - in org.apache.hadoop.hbase.io.hfile.TestCachedBlockQueue
Java HotSpot(TM) 64-Bit Server VM warning: ignoring option MaxPermSize=256m; support was removed
in 8.0
Running org.apache.hadoop.hbase.io.hfile.TestHFile
Tests run: 9, Failures: 0, Errors: 0, Skipped: 0, Time elapsed: 2.518 sec - in org.apache.hadoop.hbase.io.hfile.TestHFile
Java HotSpot(TM) 64-Bit Server VM warning: ignoring option MaxPermSize=256m; support was removed
in 8.0
Running org.apache.hadoop.hbase.io.hfile.TestLruBlockCache
Tests run: 11, Failures: 0, Errors: 0, Skipped: 0, Time elapsed: 2.394 sec - in org.apache.hadoop.hbase.io.hfile.TestLruBlockCache
Java HotSpot(TM) 64-Bit Server VM warning: ignoring option MaxPermSize=256m; support was removed
in 8.0
Java HotSpot(TM) 64-Bit Server VM warning: ignoring option MaxPermSize=256m; support was removed
in 8.0
Running org.apache.hadoop.hbase.io.hfile.TestLazyDataBlockDecompression
Tests run: 2, Failures: 0, Errors: 0, Skipped: 0, Time elapsed: 2.419 sec - in org.apache.hadoop.hbase.io.hfile.TestLazyDataBlockDecompression
Java HotSpot(TM) 64-Bit Server VM warning: ignoring option MaxPermSize=256m; support was removed
in 8.0
Running org.apache.hadoop.hbase.io.hfile.TestScannerSelectionUsingKeyRange
Tests run: 3, Failures: 0, Errors: 0, Skipped: 0, Time elapsed: 3.676 sec - in org.apache.hadoop.hbase.io.hfile.TestScannerSelectionUsingKeyRange
Java HotSpot(TM) 64-Bit Server VM warning: ignoring option MaxPermSize=256m; support was removed
in 8.0
Running org.apache.hadoop.hbase.io.hfile.TestBlockCacheReporting
Tests run: 2, Failures: 0, Errors: 0, Skipped: 0, Time elapsed: 1.988 sec - in org.apache.hadoop.hbase.io.hfile.TestBlockCacheReporting
Java HotSpot(TM) 64-Bit Server VM warning: ignoring option MaxPermSize=256m; support was removed
in 8.0
Running org.apache.hadoop.hbase.io.hfile.TestPrefetch
Tests run: 2, Failures: 0, Errors: 0, Skipped: 0, Time elapsed: 2.745 sec - in org.apache.hadoop.hbase.io.hfile.TestPrefetch
Java HotSpot(TM) 64-Bit Server VM warning: ignoring option MaxPermSize=256m; support was removed
in 8.0
Java HotSpot(TM) 64-Bit Server VM warning: ignoring option MaxPermSize=256m; support was removed
in 8.0
Running org.apache.hadoop.hbase.io.hfile.TestCombinedBlockCache
Tests run: 1, Failures: 0, Errors: 0, Skipped: 0, Time elapsed: 0.463 sec - in org.apache.hadoop.hbase.io.hfile.TestCombinedBlockCache
Java HotSpot(TM) 64-Bit Server VM warning: ignoring option MaxPermSize=256m; support was removed
in 8.0
Running org.apache.hadoop.hbase.io.hfile.TestHFileDataBlockEncoder
Tests run: 40, Failures: 0, Errors: 0, Skipped: 0, Time elapsed: 6.157 sec - in org.apache.hadoop.hbase.io.hfile.TestHFileDataBlockEncoder
Java HotSpot(TM) 64-Bit Server VM warning: ignoring option MaxPermSize=256m; support was removed
in 8.0
Java HotSpot(TM) 64-Bit Server VM warning: ignoring option MaxPermSize=256m; support was removed
in 8.0
Running org.apache.hadoop.hbase.io.hfile.TestSeekTo
Tests run: 20, Failures: 0, Errors: 0, Skipped: 0, Time elapsed: 4.172 sec - in org.apache.hadoop.hbase.io.hfile.TestSeekTo
Java HotSpot(TM) 64-Bit Server VM warning: ignoring option MaxPermSize=256m; support was removed
in 8.0
Running org.apache.hadoop.hbase.io.TestHeapSize
Tests run: 5, Failures: 0, Errors: 0, Skipped: 0, Time elapsed: 0.738 sec - in org.apache.hadoop.hbase.io.TestHeapSize
Java HotSpot(TM) 64-Bit Server VM warning: ignoring option MaxPermSize=256m; support was removed
in 8.0
Java HotSpot(TM) 64-Bit Server VM warning: ignoring option MaxPermSize=256m; support was removed
in 8.0
Java HotSpot(TM) 64-Bit Server VM warning: ignoring option MaxPermSize=256m; support was removed
in 8.0
Java HotSpot(TM) 64-Bit Server VM warning: ignoring option MaxPermSize=256m; support was removed
in 8.0
Java HotSpot(TM) 64-Bit Server VM warning: ignoring option MaxPermSize=256m; support was removed
in 8.0
Running org.apache.hadoop.hbase.io.encoding.TestPrefixTreeEncoding
Tests run: 8, Failures: 0, Errors: 0, Skipped: 0, Time elapsed: 2.426 sec - in org.apache.hadoop.hbase.io.encoding.TestPrefixTreeEncoding
Java HotSpot(TM) 64-Bit Server VM warning: ignoring option MaxPermSize=256m; support was removed
in 8.0
Running org.apache.hadoop.hbase.io.encoding.TestPrefixTree
Tests run: 2, Failures: 0, Errors: 0, Skipped: 0, Time elapsed: 3.537 sec - in org.apache.hadoop.hbase.io.encoding.TestPrefixTree
Java HotSpot(TM) 64-Bit Server VM warning: ignoring option MaxPermSize=256m; support was removed
in 8.0
Running org.apache.hadoop.hbase.io.encoding.TestSeekToBlockWithEncoders
Tests run: 18, Failures: 0, Errors: 0, Skipped: 0, Time elapsed: 2.038 sec - in org.apache.hadoop.hbase.io.encoding.TestSeekToBlockWithEncoders
Java HotSpot(TM) 64-Bit Server VM warning: ignoring option MaxPermSize=256m; support was removed
in 8.0
Running org.apache.hadoop.hbase.io.encoding.TestSeekBeforeWithReverseScan
Tests run: 2, Failures: 0, Errors: 0, Skipped: 0, Time elapsed: 3.648 sec - in org.apache.hadoop.hbase.io.encoding.TestSeekBeforeWithReverseScan
Java HotSpot(TM) 64-Bit Server VM warning: ignoring option MaxPermSize=256m; support was removed
in 8.0
Running org.apache.hadoop.hbase.io.TestImmutableBytesWritable
Tests run: 3, Failures: 0, Errors: 0, Skipped: 0, Time elapsed: 0.739 sec - in org.apache.hadoop.hbase.io.TestImmutableBytesWritable
Java HotSpot(TM) 64-Bit Server VM warning: ignoring option MaxPermSize=256m; support was removed
in 8.0
Java HotSpot(TM) 64-Bit Server VM warning: ignoring option MaxPermSize=256m; support was removed
in 8.0
Running org.apache.hadoop.hbase.io.TestHFileLink
Tests run: 2, Failures: 0, Errors: 0, Skipped: 0, Time elapsed: 0.739 sec - in org.apache.hadoop.hbase.io.TestHFileLink
Java HotSpot(TM) 64-Bit Server VM warning: ignoring option MaxPermSize=256m; support was removed
in 8.0
Running org.apache.hadoop.hbase.io.TestReference
Tests run: 1, Failures: 0, Errors: 0, Skipped: 0, Time elapsed: 0.858 sec - in org.apache.hadoop.hbase.io.TestReference
Java HotSpot(TM) 64-Bit Server VM warning: ignoring option MaxPermSize=256m; support was removed
in 8.0
Running org.apache.hadoop.hbase.io.TestHalfStoreFileReader
Tests run: 2, Failures: 0, Errors: 0, Skipped: 0, Time elapsed: 1.952 sec - in org.apache.hadoop.hbase.io.TestHalfStoreFileReader
Java HotSpot(TM) 64-Bit Server VM warning: ignoring option MaxPermSize=256m; support was removed
in 8.0
Java HotSpot(TM) 64-Bit Server VM warning: ignoring option MaxPermSize=256m; support was removed
in 8.0
Java HotSpot(TM) 64-Bit Server VM warning: ignoring option MaxPermSize=256m; support was removed
in 8.0
Java HotSpot(TM) 64-Bit Server VM warning: ignoring option MaxPermSize=256m; support was removed
in 8.0
Java HotSpot(TM) 64-Bit Server VM warning: ignoring option MaxPermSize=256m; support was removed
in 8.0
Java HotSpot(TM) 64-Bit Server VM warning: ignoring option MaxPermSize=256m; support was removed
in 8.0
Running org.apache.hadoop.hbase.wal.TestWALMethods
Tests run: 3, Failures: 0, Errors: 0, Skipped: 0, Time elapsed: 1.693 sec - in org.apache.hadoop.hbase.wal.TestWALMethods
Java HotSpot(TM) 64-Bit Server VM warning: ignoring option MaxPermSize=256m; support was removed
in 8.0
Java HotSpot(TM) 64-Bit Server VM warning: ignoring option MaxPermSize=256m; support was removed
in 8.0
Java HotSpot(TM) 64-Bit Server VM warning: ignoring option MaxPermSize=256m; support was removed
in 8.0
Java HotSpot(TM) 64-Bit Server VM warning: ignoring option MaxPermSize=256m; support was removed
in 8.0
Java HotSpot(TM) 64-Bit Server VM warning: ignoring option MaxPermSize=256m; support was removed
in 8.0
Java HotSpot(TM) 64-Bit Server VM warning: ignoring option MaxPermSize=256m; support was removed
in 8.0
Java HotSpot(TM) 64-Bit Server VM warning: ignoring option MaxPermSize=256m; support was removed
in 8.0
Java HotSpot(TM) 64-Bit Server VM warning: ignoring option MaxPermSize=256m; support was removed
in 8.0
Java HotSpot(TM) 64-Bit Server VM warning: ignoring option MaxPermSize=256m; support was removed
in 8.0
Running org.apache.hadoop.hbase.zookeeper.TestZooKeeperMainServer
Tests run: 2, Failures: 0, Errors: 0, Skipped: 0, Time elapsed: 2.47 sec - in org.apache.hadoop.hbase.zookeeper.TestZooKeeperMainServer
Java HotSpot(TM) 64-Bit Server VM warning: ignoring option MaxPermSize=256m; support was removed
in 8.0
Java HotSpot(TM) 64-Bit Server VM warning: ignoring option MaxPermSize=256m; support was removed
in 8.0
Java HotSpot(TM) 64-Bit Server VM warning: ignoring option MaxPermSize=256m; support was removed
in 8.0
Java HotSpot(TM) 64-Bit Server VM warning: ignoring option MaxPermSize=256m; support was removed
in 8.0
Running org.apache.hadoop.hbase.TestNodeHealthCheckChore
Tests run: 4, Failures: 0, Errors: 0, Skipped: 0, Time elapsed: 11.664 sec - in org.apache.hadoop.hbase.TestNodeHealthCheckChore
Java HotSpot(TM) 64-Bit Server VM warning: ignoring option MaxPermSize=256m; support was removed
in 8.0
Running org.apache.hadoop.hbase.executor.TestExecutorService
Tests run: 2, Failures: 0, Errors: 0, Skipped: 0, Time elapsed: 3.63 sec - in org.apache.hadoop.hbase.executor.TestExecutorService
Java HotSpot(TM) 64-Bit Server VM warning: ignoring option MaxPermSize=256m; support was removed
in 8.0
Running org.apache.hadoop.hbase.TestServerLoad
Tests run: 3, Failures: 0, Errors: 0, Skipped: 0, Time elapsed: 0.658 sec - in org.apache.hadoop.hbase.TestServerLoad
Java HotSpot(TM) 64-Bit Server VM warning: ignoring option MaxPermSize=256m; support was removed
in 8.0
Java HotSpot(TM) 64-Bit Server VM warning: ignoring option MaxPermSize=256m; support was removed
in 8.0
Java HotSpot(TM) 64-Bit Server VM warning: ignoring option MaxPermSize=256m; support was removed
in 8.0
Running org.apache.hadoop.hbase.constraint.TestConstraints
Tests run: 6, Failures: 0, Errors: 0, Skipped: 0, Time elapsed: 2.744 sec - in org.apache.hadoop.hbase.constraint.TestConstraints
Java HotSpot(TM) 64-Bit Server VM warning: ignoring option MaxPermSize=256m; support was removed
in 8.0
Java HotSpot(TM) 64-Bit Server VM warning: ignoring option MaxPermSize=256m; support was removed
in 8.0
Java HotSpot(TM) 64-Bit Server VM warning: ignoring option MaxPermSize=256m; support was removed
in 8.0
Java HotSpot(TM) 64-Bit Server VM warning: ignoring option MaxPermSize=256m; support was removed
in 8.0
Running org.apache.hadoop.hbase.protobuf.TestProtobufUtil
Tests run: 7, Failures: 0, Errors: 0, Skipped: 0, Time elapsed: 2.478 sec - in org.apache.hadoop.hbase.protobuf.TestProtobufUtil
Java HotSpot(TM) 64-Bit Server VM warning: ignoring option MaxPermSize=256m; support was removed
in 8.0
Running org.apache.hadoop.hbase.protobuf.TestReplicationProtobuf
Tests run: 1, Failures: 0, Errors: 0, Skipped: 0, Time elapsed: 0.469 sec - in org.apache.hadoop.hbase.protobuf.TestReplicationProtobuf
Java HotSpot(TM) 64-Bit Server VM warning: ignoring option MaxPermSize=256m; support was removed
in 8.0
Java HotSpot(TM) 64-Bit Server VM warning: ignoring option MaxPermSize=256m; support was removed
in 8.0
Java HotSpot(TM) 64-Bit Server VM warning: ignoring option MaxPermSize=256m; support was removed
in 8.0
Running org.apache.hadoop.hbase.ipc.TestCoprocessorRpcUtils
Tests run: 1, Failures: 0, Errors: 0, Skipped: 0, Time elapsed: 0.947 sec - in org.apache.hadoop.hbase.ipc.TestCoprocessorRpcUtils
Java HotSpot(TM) 64-Bit Server VM warning: ignoring option MaxPermSize=256m; support was removed
in 8.0
Java HotSpot(TM) 64-Bit Server VM warning: ignoring option MaxPermSize=256m; support was removed
in 8.0
Running org.apache.hadoop.hbase.ipc.TestBufferChain
Tests run: 5, Failures: 0, Errors: 0, Skipped: 0, Time elapsed: 1.372 sec - in org.apache.hadoop.hbase.ipc.TestBufferChain
Java HotSpot(TM) 64-Bit Server VM warning: ignoring option MaxPermSize=256m; support was removed
in 8.0
Java HotSpot(TM) 64-Bit Server VM warning: ignoring option MaxPermSize=256m; support was removed
in 8.0
Running org.apache.hadoop.hbase.ipc.TestGlobalEventLoopGroup
Tests run: 1, Failures: 0, Errors: 0, Skipped: 0, Time elapsed: 1.804 sec - in org.apache.hadoop.hbase.ipc.TestGlobalEventLoopGroup
Java HotSpot(TM) 64-Bit Server VM warning: ignoring option MaxPermSize=256m; support was removed
in 8.0
Running org.apache.hadoop.hbase.ipc.TestRpcHandlerException
Tests run: 1, Failures: 0, Errors: 0, Skipped: 1, Time elapsed: 0.001 sec - in org.apache.hadoop.hbase.ipc.TestRpcHandlerException
Java HotSpot(TM) 64-Bit Server VM warning: ignoring option MaxPermSize=256m; support was removed
in 8.0
Running org.apache.hadoop.hbase.ipc.TestCallRunner
Tests run: 1, Failures: 0, Errors: 0, Skipped: 0, Time elapsed: 1.089 sec - in org.apache.hadoop.hbase.ipc.TestCallRunner
Java HotSpot(TM) 64-Bit Server VM warning: ignoring option MaxPermSize=256m; support was removed
in 8.0
Running org.apache.hadoop.hbase.ipc.TestAsyncIPC
Tests run: 44, Failures: 0, Errors: 0, Skipped: 0, Time elapsed: 12.101 sec - in org.apache.hadoop.hbase.ipc.TestAsyncIPC
Java HotSpot(TM) 64-Bit Server VM warning: ignoring option MaxPermSize=256m; support was removed
in 8.0
Running org.apache.hadoop.hbase.ipc.TestSimpleRpcScheduler
Tests run: 7, Failures: 1, Errors: 0, Skipped: 0, Time elapsed: 10.021 sec <<< FAILURE!
- in org.apache.hadoop.hbase.ipc.TestSimpleRpcScheduler
testCoDelScheduling(org.apache.hadoop.hbase.ipc.TestSimpleRpcScheduler)  Time elapsed: 0.597
sec  <<< FAILURE!
java.lang.AssertionError: None of these calls should have been discarded expected:<0>
but was:<1>
	at org.junit.Assert.fail(Assert.java:88)
	at org.junit.Assert.failNotEquals(Assert.java:834)
	at org.junit.Assert.assertEquals(Assert.java:645)
	at org.apache.hadoop.hbase.ipc.TestSimpleRpcScheduler.testCoDelScheduling(TestSimpleRpcScheduler.java:449)

Java HotSpot(TM) 64-Bit Server VM warning: ignoring option MaxPermSize=256m; support was removed
in 8.0
Running org.apache.hadoop.hbase.ipc.TestRpcMetrics
Tests run: 3, Failures: 0, Errors: 0, Skipped: 0, Time elapsed: 1.332 sec - in org.apache.hadoop.hbase.ipc.TestRpcMetrics
Java HotSpot(TM) 64-Bit Server VM warning: ignoring option MaxPermSize=256m; support was removed
in 8.0
Java HotSpot(TM) 64-Bit Server VM warning: ignoring option MaxPermSize=256m; support was removed
in 8.0
Running org.apache.hadoop.hbase.ipc.TestIPC
Tests run: 11, Failures: 0, Errors: 0, Skipped: 0, Time elapsed: 4.718 sec - in org.apache.hadoop.hbase.ipc.TestIPC
Java HotSpot(TM) 64-Bit Server VM warning: ignoring option MaxPermSize=256m; support was removed
in 8.0
Running org.apache.hadoop.hbase.conf.TestConfigurationManager
Tests run: 2, Failures: 0, Errors: 0, Skipped: 0, Time elapsed: 0.624 sec - in org.apache.hadoop.hbase.conf.TestConfigurationManager

Results :

Failed tests: 
  TestSimpleRpcScheduler.testCoDelScheduling:449 None of these calls should have been discarded
expected:<0> but was:<1>

Tests run: 1115, Failures: 1, Errors: 0, Skipped: 21

[INFO] ------------------------------------------------------------------------
[INFO] Reactor Summary:
[INFO] 
[INFO] Apache HBase ...................................... SUCCESS [  6.575 s]
[INFO] Apache HBase - Checkstyle ......................... SUCCESS [  1.114 s]
[INFO] Apache HBase - Resource Bundle .................... SUCCESS [  0.421 s]
[INFO] Apache HBase - Annotations ........................ SUCCESS [  0.451 s]
[INFO] Apache HBase - Protocol ........................... SUCCESS [  5.022 s]
[INFO] Apache HBase - Common ............................. SUCCESS [02:31 min]
[INFO] Apache HBase - Procedure .......................... SUCCESS [02:15 min]
[INFO] Apache HBase - Client ............................. SUCCESS [01:01 min]
[INFO] Apache HBase - Hadoop Compatibility ............... SUCCESS [ 10.587 s]
[INFO] Apache HBase - Hadoop Two Compatibility ........... SUCCESS [ 16.011 s]
[INFO] Apache HBase - Prefix Tree ........................ SUCCESS [ 15.935 s]
[INFO] Apache HBase - Server ............................. FAILURE [26:47 min]
[INFO] Apache HBase - Testing Util ....................... SKIPPED
[INFO] Apache HBase - Thrift ............................. SKIPPED
[INFO] Apache HBase - RSGroup ............................ SKIPPED
[INFO] Apache HBase - Shell .............................. SKIPPED
[INFO] Apache HBase - Integration Tests .................. SKIPPED
[INFO] Apache HBase - Examples ........................... SKIPPED
[INFO] Apache HBase - Rest ............................... SKIPPED
[INFO] Apache HBase - External Block Cache ............... SKIPPED
[INFO] Apache HBase - Spark .............................. SKIPPED
[INFO] Apache HBase - Assembly ........................... SKIPPED
[INFO] Apache HBase - Shaded ............................. SKIPPED
[INFO] Apache HBase - Shaded - Client .................... SKIPPED
[INFO] Apache HBase - Shaded - Server .................... SKIPPED
[INFO] Apache HBase - Archetypes ......................... SKIPPED
[INFO] Apache HBase - Exemplar for hbase-client archetype  SKIPPED
[INFO] Apache HBase - Exemplar for hbase-shaded-client archetype  SKIPPED
[INFO] Apache HBase - Archetype builder .................. SKIPPED
[INFO] ------------------------------------------------------------------------
[INFO] BUILD FAILURE
[INFO] ------------------------------------------------------------------------
[INFO] Total time: 33:34 min
[INFO] Finished at: 2016-07-19T06:29:07+00:00
[INFO] Final Memory: 69M/2748M
[INFO] ------------------------------------------------------------------------
[ERROR] Failed to execute goal org.apache.maven.plugins:maven-surefire-plugin:2.18.1:test
(default-test) on project hbase-server: There are test failures.
[ERROR] 
[ERROR] Please refer to <https://builds.apache.org/job/HBase-Trunk_matrix/jdk=latest1.8,label=yahoo-not-h2/ws/hbase-server/target/surefire-reports>
for the individual test results.
[ERROR] -> [Help 1]
[ERROR] 
[ERROR] To see the full stack trace of the errors, re-run Maven with the -e switch.
[ERROR] Re-run Maven using the -X switch to enable full debug logging.
[ERROR] 
[ERROR] For more information about the errors and possible solutions, please read the following
articles:
[ERROR] [Help 1] http://cwiki.apache.org/confluence/display/MAVEN/MojoFailureException
[ERROR] 
[ERROR] After correcting the problems, you can resume the build with the command
[ERROR]   mvn <goals> -rf :hbase-server
Build step 'Invoke top-level Maven targets' marked build as failure
Performing Post build task...
Match found for :.* : True
Logical operation result is TRUE
Running script  : # Run zombie detector script
./dev-support/zombie-detector.sh --jenkins ${BUILD_ID}
[yahoo-not-h2] $ /bin/bash -xe /tmp/hudson7348292912940284004.sh
+ ./dev-support/zombie-detector.sh --jenkins 1255
Tue Jul 19 06:29:09 UTC 2016 We're ok: there is no zombie test


    {color:green}+1 zombies{color}. No zombie tests found running at the end of the build.
POST BUILD TASK : SUCCESS
END OF POST BUILD TASK : 0
Archiving artifacts
Recording test results
[FINDBUGS] Skipping publisher since build result is FAILURE
[CHECKSTYLE] Skipping publisher since build result is FAILURE

Mime
View raw message