hbase-builds mailing list archives

Site index · List index
Message view « Date » · « Thread »
Top « Date » · « Thread »
From Apache Jenkins Server <jenk...@builds.apache.org>
Subject Build failed in Jenkins: HBase-Trunk_matrix » latest1.7,yahoo-not-h2 #1263
Date Wed, 20 Jul 2016 15:53:44 GMT
See <https://builds.apache.org/job/HBase-Trunk_matrix/jdk=latest1.7,label=yahoo-not-h2/1263/>

------------------------------------------
[...truncated 5524 lines...]
Tests run: 1, Failures: 0, Errors: 0, Skipped: 0, Time elapsed: 2.887 sec - in org.apache.hadoop.hbase.security.visibility.TestVisibilityLabelsOpWithDifferentUsersNoACL
Running org.apache.hadoop.hbase.TestGlobalMemStoreSize
Running org.apache.hadoop.hbase.security.visibility.TestVisibilityWithCheckAuths
Tests run: 26, Failures: 0, Errors: 0, Skipped: 0, Time elapsed: 37.137 sec - in org.apache.hadoop.hbase.security.visibility.TestVisibilityLabelsWithDefaultVisLabelService
Tests run: 2, Failures: 0, Errors: 0, Skipped: 0, Time elapsed: 4.991 sec - in org.apache.hadoop.hbase.security.visibility.TestVisibilityWithCheckAuths
Running org.apache.hadoop.hbase.constraint.TestConstraint
Tests run: 1, Failures: 0, Errors: 0, Skipped: 0, Time elapsed: 17.846 sec - in org.apache.hadoop.hbase.TestGlobalMemStoreSize
Running org.apache.hadoop.hbase.filter.TestFuzzyRowAndColumnRangeFilter
Tests run: 1, Failures: 0, Errors: 0, Skipped: 0, Time elapsed: 3.178 sec - in org.apache.hadoop.hbase.filter.TestFuzzyRowAndColumnRangeFilter
Running org.apache.hadoop.hbase.filter.TestFilterWrapper
Tests run: 1, Failures: 0, Errors: 0, Skipped: 0, Time elapsed: 27.662 sec - in org.apache.hadoop.hbase.security.visibility.TestVisibilityLabelReplicationWithExpAsString
Tests run: 1, Failures: 0, Errors: 0, Skipped: 0, Time elapsed: 3.699 sec - in org.apache.hadoop.hbase.filter.TestFilterWrapper
Running org.apache.hadoop.hbase.filter.TestMultiRowRangeFilter
Tests run: 5, Failures: 0, Errors: 0, Skipped: 0, Time elapsed: 22.138 sec - in org.apache.hadoop.hbase.constraint.TestConstraint
Running org.apache.hadoop.hbase.filter.TestColumnRangeFilter
Running org.apache.hadoop.hbase.filter.TestScanRowPrefix
Running org.apache.hadoop.hbase.filter.TestFuzzyRowFilterEndToEnd
Tests run: 1, Failures: 0, Errors: 0, Skipped: 0, Time elapsed: 6.645 sec - in org.apache.hadoop.hbase.filter.TestScanRowPrefix
Tests run: 1, Failures: 0, Errors: 0, Skipped: 0, Time elapsed: 10.631 sec - in org.apache.hadoop.hbase.filter.TestColumnRangeFilter
Tests run: 20, Failures: 0, Errors: 0, Skipped: 0, Time elapsed: 22.895 sec - in org.apache.hadoop.hbase.filter.TestMultiRowRangeFilter
Running org.apache.hadoop.hbase.TestHBaseTestingUtility
Running org.apache.hadoop.hbase.filter.TestFilterListOrOperatorWithBlkCnt
Running org.apache.hadoop.hbase.filter.TestFilterWithScanLimits
Running org.apache.hadoop.hbase.quotas.TestQuotaAdmin
Tests run: 3, Failures: 0, Errors: 0, Skipped: 0, Time elapsed: 4.127 sec - in org.apache.hadoop.hbase.quotas.TestQuotaAdmin
Tests run: 1, Failures: 0, Errors: 0, Skipped: 0, Time elapsed: 21.785 sec - in org.apache.hadoop.hbase.filter.TestFilterListOrOperatorWithBlkCnt
Running org.apache.hadoop.hbase.quotas.TestQuotaTableUtil
Tests run: 3, Failures: 0, Errors: 0, Skipped: 0, Time elapsed: 3.059 sec - in org.apache.hadoop.hbase.quotas.TestQuotaTableUtil
Running org.apache.hadoop.hbase.mob.mapreduce.TestMobSweepJob
Tests run: 3, Failures: 0, Errors: 0, Skipped: 0, Time elapsed: 2.605 sec - in org.apache.hadoop.hbase.mob.mapreduce.TestMobSweepJob
Running org.apache.hadoop.hbase.mob.mapreduce.TestMobSweepReducer
Running org.apache.hadoop.hbase.mob.TestMobDataBlockEncoding
Tests run: 1, Failures: 0, Errors: 0, Skipped: 0, Time elapsed: 6.635 sec - in org.apache.hadoop.hbase.mob.mapreduce.TestMobSweepReducer
Tests run: 13, Failures: 0, Errors: 0, Skipped: 0, Time elapsed: 59.806 sec - in org.apache.hadoop.hbase.TestHBaseTestingUtility
Tests run: 1, Failures: 0, Errors: 0, Skipped: 0, Time elapsed: 53.769 sec - in org.apache.hadoop.hbase.filter.TestFilterWithScanLimits
Tests run: 1, Failures: 0, Errors: 0, Skipped: 0, Time elapsed: 12.727 sec - in org.apache.hadoop.hbase.mob.TestMobDataBlockEncoding
Running org.apache.hadoop.hbase.mob.TestExpiredMobFileCleaner
Running org.apache.hadoop.hbase.tool.TestCanaryTool
Running org.apache.hadoop.hbase.mob.TestDefaultMobStoreFlusher
Running org.apache.hadoop.hbase.mob.compactions.TestPartitionedMobCompactor
Tests run: 2, Failures: 0, Errors: 0, Skipped: 0, Time elapsed: 4.795 sec - in org.apache.hadoop.hbase.mob.TestDefaultMobStoreFlusher
Running org.apache.hadoop.hbase.io.encoding.TestDataBlockEncoders
Tests run: 1, Failures: 0, Errors: 0, Skipped: 0, Time elapsed: 20.404 sec - in org.apache.hadoop.hbase.mob.TestExpiredMobFileCleaner
Tests run: 6, Failures: 0, Errors: 0, Skipped: 0, Time elapsed: 20.761 sec - in org.apache.hadoop.hbase.mob.compactions.TestPartitionedMobCompactor
Running org.apache.hadoop.hbase.io.encoding.TestEncodedSeekers
Running org.apache.hadoop.hbase.io.encoding.TestChangingEncoding
Tests run: 5, Failures: 0, Errors: 0, Skipped: 0, Time elapsed: 50.843 sec - in org.apache.hadoop.hbase.tool.TestCanaryTool
Running org.apache.hadoop.hbase.io.encoding.TestBufferedDataBlockEncoder
Tests run: 56, Failures: 0, Errors: 0, Skipped: 0, Time elapsed: 56.891 sec - in org.apache.hadoop.hbase.io.encoding.TestDataBlockEncoders
Tests run: 2, Failures: 0, Errors: 0, Skipped: 0, Time elapsed: 15.333 sec - in org.apache.hadoop.hbase.io.encoding.TestBufferedDataBlockEncoder
Running org.apache.hadoop.hbase.io.asyncfs.TestSaslFanOutOneBlockAsyncDFSOutput
Running org.apache.hadoop.hbase.io.asyncfs.TestFanOutOneBlockAsyncDFSOutput
Tests run: 5, Failures: 0, Errors: 0, Skipped: 0, Time elapsed: 38.785 sec - in org.apache.hadoop.hbase.io.asyncfs.TestFanOutOneBlockAsyncDFSOutput
Running org.apache.hadoop.hbase.io.hfile.TestScannerSelectionUsingTTL
Tests run: 20, Failures: 0, Errors: 0, Skipped: 0, Time elapsed: 111.338 sec - in org.apache.hadoop.hbase.io.encoding.TestEncodedSeekers
Running org.apache.hadoop.hbase.io.hfile.TestHFileBlock
Tests run: 36, Failures: 0, Errors: 0, Skipped: 0, Time elapsed: 91.059 sec - in org.apache.hadoop.hbase.io.asyncfs.TestSaslFanOutOneBlockAsyncDFSOutput
Running org.apache.hadoop.hbase.io.hfile.TestCacheOnWrite
Tests run: 6, Failures: 0, Errors: 0, Skipped: 0, Time elapsed: 64.265 sec - in org.apache.hadoop.hbase.io.hfile.TestScannerSelectionUsingTTL
Running org.apache.hadoop.hbase.io.hfile.TestHFileBlockIndex
Tests run: 10, Failures: 0, Errors: 0, Skipped: 0, Time elapsed: 7.127 sec - in org.apache.hadoop.hbase.io.hfile.TestHFileBlockIndex
Running org.apache.hadoop.hbase.io.hfile.TestHFileSeek
Tests run: 1, Failures: 0, Errors: 0, Skipped: 0, Time elapsed: 3.536 sec - in org.apache.hadoop.hbase.io.hfile.TestHFileSeek
Running org.apache.hadoop.hbase.io.hfile.TestSeekBeforeWithInlineBlocks
Tests run: 1, Failures: 0, Errors: 0, Skipped: 0, Time elapsed: 13.871 sec - in org.apache.hadoop.hbase.io.hfile.TestSeekBeforeWithInlineBlocks
Running org.apache.hadoop.hbase.io.hfile.TestScannerFromBucketCache
Tests run: 4, Failures: 0, Errors: 0, Skipped: 0, Time elapsed: 5.373 sec - in org.apache.hadoop.hbase.io.hfile.TestScannerFromBucketCache
Running org.apache.hadoop.hbase.io.hfile.TestCacheConfig
Tests run: 28, Failures: 0, Errors: 0, Skipped: 0, Time elapsed: 92.426 sec - in org.apache.hadoop.hbase.io.hfile.TestHFileBlock
Tests run: 7, Failures: 0, Errors: 0, Skipped: 0, Time elapsed: 2.67 sec - in org.apache.hadoop.hbase.io.hfile.TestCacheConfig
Running org.apache.hadoop.hbase.io.hfile.TestForceCacheImportantBlocks
Running org.apache.hadoop.hbase.io.TestFileLink
Tests run: 5, Failures: 0, Errors: 0, Skipped: 0, Time elapsed: 16.483 sec - in org.apache.hadoop.hbase.io.TestFileLink
Running org.apache.hadoop.hbase.procedure.TestZKProcedure
Tests run: 4, Failures: 0, Errors: 0, Skipped: 0, Time elapsed: 2.426 sec - in org.apache.hadoop.hbase.procedure.TestZKProcedure
Tests run: 2, Failures: 0, Errors: 0, Skipped: 0, Time elapsed: 24.104 sec - in org.apache.hadoop.hbase.io.hfile.TestForceCacheImportantBlocks
Running org.apache.hadoop.hbase.TestHBaseOnOtherDfsCluster
Running org.apache.hadoop.hbase.procedure.TestZKProcedureControllers
Tests run: 4, Failures: 0, Errors: 0, Skipped: 0, Time elapsed: 2.338 sec - in org.apache.hadoop.hbase.procedure.TestZKProcedureControllers
Running org.apache.hadoop.hbase.ipc.TestHBaseClient
Tests run: 1, Failures: 0, Errors: 0, Skipped: 0, Time elapsed: 0.526 sec - in org.apache.hadoop.hbase.ipc.TestHBaseClient
Tests run: 4, Failures: 0, Errors: 0, Skipped: 0, Time elapsed: 362.938 sec - in org.apache.hadoop.hbase.filter.TestFuzzyRowFilterEndToEnd
Tests run: 1, Failures: 0, Errors: 0, Skipped: 0, Time elapsed: 15.701 sec - in org.apache.hadoop.hbase.TestHBaseOnOtherDfsCluster
Running org.apache.hadoop.hbase.ipc.TestProtoBufRpc
Running org.apache.hadoop.hbase.TestLocalHBaseCluster
Tests run: 1, Failures: 0, Errors: 0, Skipped: 0, Time elapsed: 2.609 sec - in org.apache.hadoop.hbase.ipc.TestProtoBufRpc
Running org.apache.hadoop.hbase.ipc.TestRpcClientLeaks
Tests run: 1, Failures: 0, Errors: 0, Skipped: 0, Time elapsed: 12.203 sec - in org.apache.hadoop.hbase.TestLocalHBaseCluster
Running org.apache.hadoop.hbase.zookeeper.TestZooKeeperACL
Tests run: 7, Failures: 0, Errors: 0, Skipped: 0, Time elapsed: 0.451 sec - in org.apache.hadoop.hbase.zookeeper.TestZooKeeperACL
Running org.apache.hadoop.hbase.zookeeper.TestRecoverableZooKeeper
Tests run: 1, Failures: 0, Errors: 0, Skipped: 0, Time elapsed: 1.212 sec - in org.apache.hadoop.hbase.zookeeper.TestRecoverableZooKeeper
Running org.apache.hadoop.hbase.zookeeper.TestHQuorumPeer
Running org.apache.hadoop.hbase.zookeeper.TestZooKeeperNodeTracker
Tests run: 3, Failures: 0, Errors: 0, Skipped: 0, Time elapsed: 1.034 sec - in org.apache.hadoop.hbase.zookeeper.TestHQuorumPeer
Tests run: 3, Failures: 0, Errors: 0, Skipped: 0, Time elapsed: 1.203 sec - in org.apache.hadoop.hbase.zookeeper.TestZooKeeperNodeTracker
Running org.apache.hadoop.hbase.zookeeper.TestZKLeaderManager
Tests run: 1, Failures: 0, Errors: 0, Skipped: 0, Time elapsed: 0.134 sec - in org.apache.hadoop.hbase.zookeeper.TestZKLeaderManager
Running org.apache.hadoop.hbase.zookeeper.TestZKMulti
Running org.apache.hadoop.hbase.zookeeper.lock.TestZKInterProcessReadWriteLock
Tests run: 12, Failures: 0, Errors: 0, Skipped: 0, Time elapsed: 1.561 sec - in org.apache.hadoop.hbase.zookeeper.TestZKMulti
Tests run: 1, Failures: 0, Errors: 0, Skipped: 0, Time elapsed: 24.394 sec - in org.apache.hadoop.hbase.ipc.TestRpcClientLeaks
Tests run: 3, Failures: 0, Errors: 0, Skipped: 0, Time elapsed: 277.68 sec - in org.apache.hadoop.hbase.io.encoding.TestChangingEncoding
Running org.apache.hadoop.hbase.TestMetaTableAccessorNoCluster
Tests run: 2, Failures: 0, Errors: 0, Skipped: 0, Time elapsed: 2.885 sec - in org.apache.hadoop.hbase.TestMetaTableAccessorNoCluster
Running org.apache.hadoop.hbase.replication.regionserver.TestReplicationWALReaderManager
Running org.apache.hadoop.hbase.replication.regionserver.TestReplicationSourceManagerZkImpl
Running org.apache.hadoop.hbase.TestJMXListener
Tests run: 2, Failures: 0, Errors: 0, Skipped: 0, Time elapsed: 2.378 sec - in org.apache.hadoop.hbase.TestJMXListener
Tests run: 8, Failures: 0, Errors: 0, Skipped: 0, Time elapsed: 8.219 sec - in org.apache.hadoop.hbase.replication.regionserver.TestReplicationSourceManagerZkImpl
Tests run: 6, Failures: 0, Errors: 0, Skipped: 0, Time elapsed: 24.552 sec - in org.apache.hadoop.hbase.zookeeper.lock.TestZKInterProcessReadWriteLock
Running org.apache.hadoop.hbase.replication.regionserver.TestRegionReplicaReplicationEndpointNoMaster
Running org.apache.hadoop.hbase.replication.regionserver.TestTableBasedReplicationSourceManagerImpl
Running org.apache.hadoop.hbase.replication.regionserver.TestReplicationSink
Tests run: 72, Failures: 0, Errors: 0, Skipped: 0, Time elapsed: 184.114 sec - in org.apache.hadoop.hbase.io.hfile.TestCacheOnWrite
Tests run: 6, Failures: 0, Errors: 0, Skipped: 0, Time elapsed: 7.25 sec - in org.apache.hadoop.hbase.replication.regionserver.TestReplicationSink
Running org.apache.hadoop.hbase.replication.TestReplicationTrackerZKImpl
Tests run: 5, Failures: 0, Errors: 0, Skipped: 0, Time elapsed: 1.262 sec - in org.apache.hadoop.hbase.replication.TestReplicationTrackerZKImpl
Running org.apache.hadoop.hbase.replication.TestMultiSlaveReplication
Running org.apache.hadoop.hbase.replication.TestReplicationSyncUpToolWithBulkLoadedData
Tests run: 6, Failures: 0, Errors: 0, Skipped: 0, Time elapsed: 66.3 sec - in org.apache.hadoop.hbase.replication.regionserver.TestTableBasedReplicationSourceManagerImpl
Tests run: 1, Failures: 0, Errors: 0, Skipped: 0, Time elapsed: 40.042 sec - in org.apache.hadoop.hbase.replication.TestReplicationSyncUpToolWithBulkLoadedData
Running org.apache.hadoop.hbase.replication.TestReplicationTableBase
Tests run: 2, Failures: 0, Errors: 0, Skipped: 0, Time elapsed: 59.932 sec - in org.apache.hadoop.hbase.replication.TestMultiSlaveReplication
Running org.apache.hadoop.hbase.replication.TestReplicationChangingPeerRegionservers
Tests run: 4, Failures: 0, Errors: 0, Skipped: 0, Time elapsed: 96.987 sec - in org.apache.hadoop.hbase.replication.regionserver.TestRegionReplicaReplicationEndpointNoMaster
Tests run: 1, Failures: 0, Errors: 0, Skipped: 0, Time elapsed: 23.314 sec - in org.apache.hadoop.hbase.replication.TestReplicationTableBase
Tests run: 1, Failures: 0, Errors: 0, Skipped: 0, Time elapsed: 5.563 sec - in org.apache.hadoop.hbase.replication.TestReplicationChangingPeerRegionservers
Running org.apache.hadoop.hbase.replication.multiwal.TestReplicationKillMasterRSCompressedWithMultipleWAL
Running org.apache.hadoop.hbase.replication.multiwal.TestReplicationSyncUpToolWithMultipleAsyncWAL
Running org.apache.hadoop.hbase.replication.multiwal.TestReplicationSyncUpToolWithMultipleWAL
Tests run: 1, Failures: 0, Errors: 0, Skipped: 0, Time elapsed: 21.548 sec - in org.apache.hadoop.hbase.replication.multiwal.TestReplicationKillMasterRSCompressedWithMultipleWAL
Running org.apache.hadoop.hbase.replication.multiwal.TestReplicationEndpointWithMultipleAsyncWAL
Tests run: 4, Failures: 0, Errors: 0, Skipped: 0, Time elapsed: 10.458 sec - in org.apache.hadoop.hbase.replication.multiwal.TestReplicationEndpointWithMultipleAsyncWAL
Running org.apache.hadoop.hbase.replication.multiwal.TestReplicationEndpointWithMultipleWAL
Running org.apache.hadoop.hbase.replication.TestPerTableCFReplication
Tests run: 4, Failures: 0, Errors: 0, Skipped: 0, Time elapsed: 10.636 sec - in org.apache.hadoop.hbase.replication.multiwal.TestReplicationEndpointWithMultipleWAL
Tests run: 1, Failures: 0, Errors: 0, Skipped: 0, Time elapsed: 53.528 sec - in org.apache.hadoop.hbase.replication.multiwal.TestReplicationSyncUpToolWithMultipleAsyncWAL
Tests run: 1, Failures: 0, Errors: 0, Skipped: 0, Time elapsed: 54.409 sec - in org.apache.hadoop.hbase.replication.multiwal.TestReplicationSyncUpToolWithMultipleWAL
Running org.apache.hadoop.hbase.replication.TestReplicationDisableInactivePeer
Running org.apache.hadoop.hbase.replication.TestReplicationSource
Tests run: 1, Failures: 0, Errors: 0, Skipped: 0, Time elapsed: 0.638 sec - in org.apache.hadoop.hbase.replication.TestReplicationSource
Tests run: 3, Failures: 0, Errors: 0, Skipped: 0, Time elapsed: 36.093 sec - in org.apache.hadoop.hbase.replication.TestPerTableCFReplication
Running org.apache.hadoop.hbase.replication.TestReplicationEndpoint
Running org.apache.hadoop.hbase.replication.TestReplicationStateZKImpl
Tests run: 9, Failures: 0, Errors: 0, Skipped: 0, Time elapsed: 1.242 sec - in org.apache.hadoop.hbase.replication.TestReplicationStateZKImpl
Running org.apache.hadoop.hbase.fs.TestBlockReorder
Tests run: 1, Failures: 0, Errors: 0, Skipped: 0, Time elapsed: 20.173 sec - in org.apache.hadoop.hbase.replication.TestReplicationDisableInactivePeer
Running org.apache.hadoop.hbase.TestMovedRegionsCleaner
Tests run: 4, Failures: 0, Errors: 0, Skipped: 0, Time elapsed: 10.263 sec - in org.apache.hadoop.hbase.replication.TestReplicationEndpoint
Running org.apache.hadoop.hbase.replication.TestReplicationSyncUpTool
Tests run: 1, Failures: 0, Errors: 0, Skipped: 0, Time elapsed: 11.444 sec - in org.apache.hadoop.hbase.TestMovedRegionsCleaner
Running org.apache.hadoop.hbase.TestMetaTableLocator
Tests run: 7, Failures: 0, Errors: 0, Skipped: 0, Time elapsed: 3.604 sec - in org.apache.hadoop.hbase.TestMetaTableLocator
Tests run: 3, Failures: 0, Errors: 0, Skipped: 0, Time elapsed: 23.869 sec - in org.apache.hadoop.hbase.fs.TestBlockReorder
Running org.apache.hadoop.hbase.namespace.TestNamespaceAuditor
Running org.apache.hadoop.hbase.mapred.TestTableOutputFormatConnectionExhaust
Tests run: 8, Failures: 0, Errors: 0, Skipped: 0, Time elapsed: 260.576 sec - in org.apache.hadoop.hbase.replication.regionserver.TestReplicationWALReaderManager
Running org.apache.hadoop.hbase.mapred.TestTableMapReduceUtil
Tests run: 1, Failures: 0, Errors: 0, Skipped: 0, Time elapsed: 13.076 sec - in org.apache.hadoop.hbase.mapred.TestTableOutputFormatConnectionExhaust
Running org.apache.hadoop.hbase.mapred.TestTableSnapshotInputFormat
Tests run: 4, Failures: 0, Errors: 0, Skipped: 0, Time elapsed: 15.983 sec - in org.apache.hadoop.hbase.mapred.TestTableMapReduceUtil
Running org.apache.hadoop.hbase.mapred.TestMultiTableSnapshotInputFormat
Tests run: 1, Failures: 0, Errors: 0, Skipped: 0, Time elapsed: 52.063 sec - in org.apache.hadoop.hbase.replication.TestReplicationSyncUpTool
Running org.apache.hadoop.hbase.mapred.TestTableInputFormat
Running org.apache.hadoop.hbase.TestMultiVersions
Tests run: 8, Failures: 0, Errors: 0, Skipped: 0, Time elapsed: 19.246 sec - in org.apache.hadoop.hbase.mapred.TestTableInputFormat
Tests run: 3, Failures: 0, Errors: 0, Skipped: 0, Time elapsed: 8.294 sec - in org.apache.hadoop.hbase.TestMultiVersions
Tests run: 4, Failures: 0, Errors: 0, Skipped: 0, Time elapsed: 41.67 sec - in org.apache.hadoop.hbase.mapred.TestMultiTableSnapshotInputFormat
Tests run: 12, Failures: 0, Errors: 0, Skipped: 0, Time elapsed: 126.649 sec - in org.apache.hadoop.hbase.namespace.TestNamespaceAuditor
Tests run: 7, Failures: 0, Errors: 0, Skipped: 0, Time elapsed: 118.829 sec - in org.apache.hadoop.hbase.mapred.TestTableSnapshotInputFormat

Results :

Failed tests: 
  TestVisibilityLabelsReplication.testVisibilityReplication:266 null

Tests run: 2075, Failures: 1, Errors: 0, Skipped: 25

[INFO] ------------------------------------------------------------------------
[INFO] Reactor Summary:
[INFO] 
[INFO] Apache HBase ...................................... SUCCESS [  3.249 s]
[INFO] Apache HBase - Checkstyle ......................... SUCCESS [  0.928 s]
[INFO] Apache HBase - Resource Bundle .................... SUCCESS [  0.247 s]
[INFO] Apache HBase - Annotations ........................ SUCCESS [  0.288 s]
[INFO] Apache HBase - Protocol ........................... SUCCESS [  3.630 s]
[INFO] Apache HBase - Common ............................. SUCCESS [01:35 min]
[INFO] Apache HBase - Procedure .......................... SUCCESS [01:37 min]
[INFO] Apache HBase - Client ............................. SUCCESS [ 42.542 s]
[INFO] Apache HBase - Hadoop Compatibility ............... SUCCESS [  7.576 s]
[INFO] Apache HBase - Hadoop Two Compatibility ........... SUCCESS [  9.858 s]
[INFO] Apache HBase - Prefix Tree ........................ SUCCESS [ 10.650 s]
[INFO] Apache HBase - Server ............................. FAILURE [  01:05 h]
[INFO] Apache HBase - Testing Util ....................... SKIPPED
[INFO] Apache HBase - Thrift ............................. SKIPPED
[INFO] Apache HBase - RSGroup ............................ SKIPPED
[INFO] Apache HBase - Shell .............................. SKIPPED
[INFO] Apache HBase - Integration Tests .................. SKIPPED
[INFO] Apache HBase - Examples ........................... SKIPPED
[INFO] Apache HBase - Rest ............................... SKIPPED
[INFO] Apache HBase - External Block Cache ............... SKIPPED
[INFO] Apache HBase - Spark .............................. SKIPPED
[INFO] Apache HBase - Assembly ........................... SKIPPED
[INFO] Apache HBase - Shaded ............................. SKIPPED
[INFO] Apache HBase - Shaded - Client .................... SKIPPED
[INFO] Apache HBase - Shaded - Server .................... SKIPPED
[INFO] Apache HBase - Archetypes ......................... SKIPPED
[INFO] Apache HBase - Exemplar for hbase-client archetype  SKIPPED
[INFO] Apache HBase - Exemplar for hbase-shaded-client archetype  SKIPPED
[INFO] Apache HBase - Archetype builder .................. SKIPPED
[INFO] ------------------------------------------------------------------------
[INFO] BUILD FAILURE
[INFO] ------------------------------------------------------------------------
[INFO] Total time: 01:10 h
[INFO] Finished at: 2016-07-20T15:43:34+00:00
[INFO] Final Memory: 70M/606M
[INFO] ------------------------------------------------------------------------
[ERROR] Failed to execute goal org.apache.maven.plugins:maven-surefire-plugin:2.18.1:test
(secondPartTestsExecution) on project hbase-server: There are test failures.
[ERROR] 
[ERROR] Please refer to <https://builds.apache.org/job/HBase-Trunk_matrix/jdk=latest1.7,label=yahoo-not-h2/ws/hbase-server/target/surefire-reports>
for the individual test results.
[ERROR] -> [Help 1]
[ERROR] 
[ERROR] To see the full stack trace of the errors, re-run Maven with the -e switch.
[ERROR] Re-run Maven using the -X switch to enable full debug logging.
[ERROR] 
[ERROR] For more information about the errors and possible solutions, please read the following
articles:
[ERROR] [Help 1] http://cwiki.apache.org/confluence/display/MAVEN/MojoFailureException
[ERROR] 
[ERROR] After correcting the problems, you can resume the build with the command
[ERROR]   mvn <goals> -rf :hbase-server
Build step 'Invoke top-level Maven targets' marked build as failure
Performing Post build task...
Match found for :.* : True
Logical operation result is TRUE
Running script  : # Run zombie detector script
./dev-support/zombie-detector.sh --jenkins ${BUILD_ID}
[yahoo-not-h2] $ /bin/bash -xe /tmp/hudson793109909745638954.sh
+ ./dev-support/zombie-detector.sh --jenkins 1263
Wed Jul 20 15:43:37 UTC 2016 We're ok: there is no zombie test


    {color:green}+1 zombies{color}. No zombie tests found running at the end of the build.
POST BUILD TASK : SUCCESS
END OF POST BUILD TASK : 0
Archiving artifacts
Recording test results
[FINDBUGS] Skipping publisher since build result is FAILURE
[CHECKSTYLE] Skipping publisher since build result is FAILURE

Mime
View raw message