hbase-builds mailing list archives

Site index · List index
Message view « Date » · « Thread »
Top « Date » · « Thread »
From Apache Jenkins Server <jenk...@builds.apache.org>
Subject Build failed in Jenkins: HBase-Trunk_matrix » latest1.7,yahoo-not-h2 #1262
Date Wed, 20 Jul 2016 13:19:05 GMT
See <https://builds.apache.org/job/HBase-Trunk_matrix/jdk=latest1.7,label=yahoo-not-h2/1262/>

------------------------------------------
[...truncated 5694 lines...]
Tests run: 1, Failures: 0, Errors: 0, Skipped: 0, Time elapsed: 13.461 sec - in org.apache.hadoop.hbase.TestLocalHBaseCluster
Tests run: 1, Failures: 0, Errors: 0, Skipped: 0, Time elapsed: 32.08 sec - in org.apache.hadoop.hbase.wal.TestWALFiltering
Running org.apache.hadoop.hbase.master.TestRegionPlacement2
Tests run: 2, Failures: 0, Errors: 0, Skipped: 0, Time elapsed: 2.487 sec - in org.apache.hadoop.hbase.master.TestRegionPlacement2
Running org.apache.hadoop.hbase.master.TestMasterOperationsForRegionReplicas
Running org.apache.hadoop.hbase.master.TestRegionPlacement
Tests run: 2, Failures: 0, Errors: 0, Skipped: 2, Time elapsed: 0.002 sec - in org.apache.hadoop.hbase.master.TestRegionPlacement
Running org.apache.hadoop.hbase.master.TestActiveMasterManager
Tests run: 32, Failures: 0, Errors: 0, Skipped: 0, Time elapsed: 84.64 sec - in org.apache.hadoop.hbase.wal.TestWALSplitCompressed
Tests run: 2, Failures: 0, Errors: 0, Skipped: 0, Time elapsed: 1.367 sec - in org.apache.hadoop.hbase.master.TestActiveMasterManager
Running org.apache.hadoop.hbase.master.TestSplitLogManager
Tests run: 32, Failures: 0, Errors: 0, Skipped: 0, Time elapsed: 87.138 sec - in org.apache.hadoop.hbase.wal.TestWALSplit
Running org.apache.hadoop.hbase.master.TestMasterFileSystem
Tests run: 1, Failures: 0, Errors: 0, Skipped: 0, Time elapsed: 1.665 sec - in org.apache.hadoop.hbase.master.TestMasterFileSystem
Running org.apache.hadoop.hbase.master.TestMasterFailover
Running org.apache.hadoop.hbase.master.TestDeadServer
Tests run: 4, Failures: 0, Errors: 0, Skipped: 0, Time elapsed: 2.512 sec - in org.apache.hadoop.hbase.master.TestDeadServer
Tests run: 2, Failures: 0, Errors: 0, Skipped: 0, Time elapsed: 32.741 sec - in org.apache.hadoop.hbase.master.TestMasterOperationsForRegionReplicas
Running org.apache.hadoop.hbase.master.procedure.TestAddColumnFamilyProcedure
Tests run: 12, Failures: 0, Errors: 0, Skipped: 0, Time elapsed: 167.33 sec - in org.apache.hadoop.hbase.namespace.TestNamespaceAuditor
Running org.apache.hadoop.hbase.master.procedure.TestTableDescriptorModificationFromClient
Running org.apache.hadoop.hbase.master.procedure.TestEnableTableProcedure
Tests run: 6, Failures: 0, Errors: 0, Skipped: 0, Time elapsed: 28.188 sec - in org.apache.hadoop.hbase.master.procedure.TestAddColumnFamilyProcedure
Tests run: 3, Failures: 0, Errors: 0, Skipped: 0, Time elapsed: 45.918 sec - in org.apache.hadoop.hbase.master.TestMasterFailover
Running org.apache.hadoop.hbase.master.procedure.TestModifyNamespaceProcedure
Running org.apache.hadoop.hbase.master.procedure.TestDeleteNamespaceProcedure
Tests run: 6, Failures: 0, Errors: 0, Skipped: 0, Time elapsed: 9.366 sec - in org.apache.hadoop.hbase.master.procedure.TestModifyNamespaceProcedure
Tests run: 5, Failures: 0, Errors: 0, Skipped: 0, Time elapsed: 28.257 sec - in org.apache.hadoop.hbase.master.procedure.TestEnableTableProcedure
Running org.apache.hadoop.hbase.master.procedure.TestMasterProcedureScheduler
Tests run: 7, Failures: 0, Errors: 0, Skipped: 0, Time elapsed: 14.53 sec - in org.apache.hadoop.hbase.master.procedure.TestDeleteNamespaceProcedure
Running org.apache.hadoop.hbase.master.procedure.TestCreateTableProcedure
Tests run: 7, Failures: 0, Errors: 0, Skipped: 0, Time elapsed: 50.476 sec - in org.apache.hadoop.hbase.master.procedure.TestTableDescriptorModificationFromClient
Running org.apache.hadoop.hbase.master.procedure.TestWALProcedureStoreOnHDFS
Running org.apache.hadoop.hbase.master.procedure.TestModifyColumnFamilyProcedure
Tests run: 12, Failures: 0, Errors: 0, Skipped: 0, Time elapsed: 30.653 sec - in org.apache.hadoop.hbase.master.procedure.TestMasterProcedureScheduler
Running org.apache.hadoop.hbase.master.procedure.TestMasterProcedureEvents
Tests run: 5, Failures: 0, Errors: 0, Skipped: 0, Time elapsed: 25.175 sec - in org.apache.hadoop.hbase.master.procedure.TestModifyColumnFamilyProcedure
Tests run: 2, Failures: 0, Errors: 0, Skipped: 0, Time elapsed: 12.499 sec - in org.apache.hadoop.hbase.master.procedure.TestMasterProcedureEvents
Running org.apache.hadoop.hbase.master.procedure.TestDisableTableProcedure
Tests run: 9, Failures: 0, Errors: 0, Skipped: 0, Time elapsed: 45.172 sec - in org.apache.hadoop.hbase.master.procedure.TestCreateTableProcedure
Tests run: 3, Failures: 0, Errors: 0, Skipped: 0, Time elapsed: 43.652 sec - in org.apache.hadoop.hbase.master.procedure.TestWALProcedureStoreOnHDFS
Running org.apache.hadoop.hbase.master.procedure.TestDeleteTableProcedure
Tests run: 15, Failures: 0, Errors: 0, Skipped: 1, Time elapsed: 149.166 sec - in org.apache.hadoop.hbase.master.TestSplitLogManager
Running org.apache.hadoop.hbase.master.procedure.TestDeleteColumnFamilyProcedure
Running org.apache.hadoop.hbase.master.procedure.TestDeleteColumnFamilyProcedureFromClient
Tests run: 4, Failures: 0, Errors: 0, Skipped: 0, Time elapsed: 15.658 sec - in org.apache.hadoop.hbase.master.procedure.TestDisableTableProcedure
Running org.apache.hadoop.hbase.master.TestMasterStatusServlet
Tests run: 4, Failures: 0, Errors: 0, Skipped: 0, Time elapsed: 1.772 sec - in org.apache.hadoop.hbase.master.TestMasterStatusServlet
Running org.apache.hadoop.hbase.master.TestMasterNoCluster
Running org.apache.hadoop.hbase.master.procedure.TestProcedureAdmin
Tests run: 7, Failures: 0, Errors: 0, Skipped: 0, Time elapsed: 20.242 sec - in org.apache.hadoop.hbase.master.procedure.TestDeleteTableProcedure
Tests run: 3, Failures: 0, Errors: 0, Skipped: 0, Time elapsed: 16.477 sec - in org.apache.hadoop.hbase.master.TestMasterNoCluster
Tests run: 2, Failures: 0, Errors: 0, Skipped: 0, Time elapsed: 24.237 sec - in org.apache.hadoop.hbase.master.procedure.TestDeleteColumnFamilyProcedureFromClient
Running org.apache.hadoop.hbase.master.TestGetLastFlushedSequenceId
Tests run: 5, Failures: 0, Errors: 0, Skipped: 0, Time elapsed: 16.076 sec - in org.apache.hadoop.hbase.master.procedure.TestProcedureAdmin
Running org.apache.hadoop.hbase.master.snapshot.TestSnapshotFileCache
Running org.apache.hadoop.hbase.master.TestMaster
Tests run: 8, Failures: 0, Errors: 0, Skipped: 0, Time elapsed: 36.402 sec - in org.apache.hadoop.hbase.master.procedure.TestDeleteColumnFamilyProcedure
Running org.apache.hadoop.hbase.master.TestAssignmentManagerMetrics
Tests run: 1, Failures: 0, Errors: 0, Skipped: 0, Time elapsed: 21.854 sec - in org.apache.hadoop.hbase.master.TestGetLastFlushedSequenceId
Running org.apache.hadoop.hbase.master.TestMasterFailoverBalancerPersistence
Running org.apache.hadoop.hbase.master.TestMetaShutdownHandler
Tests run: 1, Failures: 0, Errors: 0, Skipped: 0, Time elapsed: 10.271 sec - in org.apache.hadoop.hbase.master.TestAssignmentManagerMetrics
Tests run: 4, Failures: 0, Errors: 0, Skipped: 0, Time elapsed: 18.297 sec - in org.apache.hadoop.hbase.master.TestMaster
Running org.apache.hadoop.hbase.master.TestGetInfoPort
Running org.apache.hadoop.hbase.master.TestMasterMetrics
Tests run: 3, Failures: 0, Errors: 0, Skipped: 0, Time elapsed: 1.358 sec - in org.apache.hadoop.hbase.master.TestMasterMetrics
Tests run: 1, Failures: 0, Errors: 0, Skipped: 0, Time elapsed: 18.597 sec - in org.apache.hadoop.hbase.master.TestMasterFailoverBalancerPersistence
Running org.apache.hadoop.hbase.master.TestMasterShutdown
Tests run: 1, Failures: 0, Errors: 0, Skipped: 0, Time elapsed: 13.744 sec - in org.apache.hadoop.hbase.master.TestGetInfoPort
Running org.apache.hadoop.hbase.master.TestRestartCluster
Running org.apache.hadoop.hbase.master.cleaner.TestLogsCleaner
Tests run: 1, Failures: 0, Errors: 0, Skipped: 0, Time elapsed: 31.621 sec - in org.apache.hadoop.hbase.master.TestMetaShutdownHandler
Tests run: 3, Failures: 0, Errors: 0, Skipped: 0, Time elapsed: 11.969 sec - in org.apache.hadoop.hbase.master.cleaner.TestLogsCleaner
Running org.apache.hadoop.hbase.master.cleaner.TestHFileLinkCleaner
Tests run: 4, Failures: 0, Errors: 0, Skipped: 0, Time elapsed: 52.878 sec - in org.apache.hadoop.hbase.master.snapshot.TestSnapshotFileCache
Tests run: 2, Failures: 0, Errors: 0, Skipped: 0, Time elapsed: 19.997 sec - in org.apache.hadoop.hbase.master.TestMasterShutdown
Running org.apache.hadoop.hbase.master.TestMasterTransitions
Tests run: 3, Failures: 0, Errors: 0, Skipped: 3, Time elapsed: 0.001 sec - in org.apache.hadoop.hbase.master.TestMasterTransitions
Running org.apache.hadoop.hbase.master.TestClusterStatusPublisher
Tests run: 3, Failures: 0, Errors: 0, Skipped: 0, Time elapsed: 0.297 sec - in org.apache.hadoop.hbase.master.TestClusterStatusPublisher
Running org.apache.hadoop.hbase.master.cleaner.TestHFileCleaner
Running org.apache.hadoop.hbase.master.TestHMasterRPCException
Tests run: 3, Failures: 0, Errors: 0, Skipped: 0, Time elapsed: 1.284 sec - in org.apache.hadoop.hbase.master.cleaner.TestHFileCleaner
Running org.apache.hadoop.hbase.master.TestTableLockManager
Tests run: 1, Failures: 0, Errors: 0, Skipped: 0, Time elapsed: 3.377 sec - in org.apache.hadoop.hbase.master.TestHMasterRPCException
Tests run: 1, Failures: 0, Errors: 0, Skipped: 0, Time elapsed: 10.862 sec - in org.apache.hadoop.hbase.master.cleaner.TestHFileLinkCleaner
Running org.apache.hadoop.hbase.master.balancer.TestDefaultLoadBalancer
Tests run: 1, Failures: 0, Errors: 0, Skipped: 0, Time elapsed: 3.36 sec - in org.apache.hadoop.hbase.master.balancer.TestDefaultLoadBalancer
Running org.apache.hadoop.hbase.master.balancer.TestStochasticLoadBalancer
Running org.apache.hadoop.hbase.master.TestMasterMetricsWrapper
Tests run: 1, Failures: 0, Errors: 0, Skipped: 0, Time elapsed: 1.986 sec - in org.apache.hadoop.hbase.master.TestMasterMetricsWrapper
Running org.apache.hadoop.hbase.master.balancer.TestBaseLoadBalancer
Tests run: 6, Failures: 0, Errors: 0, Skipped: 0, Time elapsed: 0.468 sec - in org.apache.hadoop.hbase.master.balancer.TestBaseLoadBalancer
Running org.apache.hadoop.hbase.master.TestWarmupRegion
Running org.apache.hadoop.hbase.master.TestTableStateManager
Tests run: 2, Failures: 0, Errors: 0, Skipped: 0, Time elapsed: 56.557 sec - in org.apache.hadoop.hbase.master.TestRestartCluster
Running org.apache.hadoop.hbase.master.TestMasterRestartAfterDisablingTable
Tests run: 1, Failures: 0, Errors: 0, Skipped: 0, Time elapsed: 21.29 sec - in org.apache.hadoop.hbase.master.TestTableStateManager
Running org.apache.hadoop.hbase.master.TestMasterWalManager
Tests run: 1, Failures: 0, Errors: 0, Skipped: 0, Time elapsed: 35.15 sec - in org.apache.hadoop.hbase.master.TestWarmupRegion
Tests run: 1, Failures: 0, Errors: 0, Skipped: 0, Time elapsed: 1.684 sec - in org.apache.hadoop.hbase.master.TestMasterWalManager
Running org.apache.hadoop.hbase.TestMetaTableAccessorNoCluster
Tests run: 1, Failures: 0, Errors: 0, Skipped: 0, Time elapsed: 21.911 sec - in org.apache.hadoop.hbase.master.TestMasterRestartAfterDisablingTable
Running org.apache.hadoop.hbase.mapred.TestTableSnapshotInputFormat
Tests run: 2, Failures: 0, Errors: 0, Skipped: 0, Time elapsed: 2.356 sec - in org.apache.hadoop.hbase.TestMetaTableAccessorNoCluster
Running org.apache.hadoop.hbase.mapred.TestTableMapReduceUtil
Running org.apache.hadoop.hbase.mapred.TestMultiTableSnapshotInputFormat
Tests run: 4, Failures: 0, Errors: 0, Skipped: 0, Time elapsed: 15.716 sec - in org.apache.hadoop.hbase.mapred.TestTableMapReduceUtil
Running org.apache.hadoop.hbase.mapred.TestTableOutputFormatConnectionExhaust
Tests run: 4, Failures: 0, Errors: 0, Skipped: 0, Time elapsed: 111.252 sec - in org.apache.hadoop.hbase.master.TestTableLockManager
Tests run: 1, Failures: 0, Errors: 0, Skipped: 0, Time elapsed: 14.653 sec - in org.apache.hadoop.hbase.mapred.TestTableOutputFormatConnectionExhaust
Running org.apache.hadoop.hbase.TestIOFencing
Running org.apache.hadoop.hbase.mapred.TestTableInputFormat
Tests run: 4, Failures: 0, Errors: 0, Skipped: 0, Time elapsed: 45.397 sec - in org.apache.hadoop.hbase.mapred.TestMultiTableSnapshotInputFormat
Running org.apache.hadoop.hbase.TestMetaTableLocator
Tests run: 7, Failures: 0, Errors: 0, Skipped: 0, Time elapsed: 4.235 sec - in org.apache.hadoop.hbase.TestMetaTableLocator
Tests run: 8, Failures: 0, Errors: 0, Skipped: 0, Time elapsed: 24.339 sec - in org.apache.hadoop.hbase.mapred.TestTableInputFormat
Running org.apache.hadoop.hbase.util.TestHBaseFsckMOB
Running org.apache.hadoop.hbase.util.TestRegionSplitter
Tests run: 1, Failures: 0, Errors: 0, Skipped: 0, Time elapsed: 14.29 sec - in org.apache.hadoop.hbase.util.TestHBaseFsckMOB
Running org.apache.hadoop.hbase.util.TestFSHDFSUtils
Tests run: 6, Failures: 0, Errors: 0, Skipped: 0, Time elapsed: 6.433 sec - in org.apache.hadoop.hbase.util.TestRegionSplitter
Running org.apache.hadoop.hbase.util.TestFSVisitor
Tests run: 1, Failures: 0, Errors: 0, Skipped: 0, Time elapsed: 1.861 sec - in org.apache.hadoop.hbase.util.TestFSVisitor
Tests run: 3, Failures: 0, Errors: 0, Skipped: 0, Time elapsed: 7.965 sec - in org.apache.hadoop.hbase.util.TestFSHDFSUtils
Running org.apache.hadoop.hbase.util.TestMiniClusterLoadParallel
Running org.apache.hadoop.hbase.util.TestHBaseFsckTwoRS
Tests run: 2, Failures: 0, Errors: 0, Skipped: 0, Time elapsed: 78.138 sec - in org.apache.hadoop.hbase.TestIOFencing
Running org.apache.hadoop.hbase.util.TestIdReadWriteLock
Tests run: 7, Failures: 0, Errors: 0, Skipped: 0, Time elapsed: 163.439 sec - in org.apache.hadoop.hbase.mapred.TestTableSnapshotInputFormat
Tests run: 1, Failures: 0, Errors: 0, Skipped: 0, Time elapsed: 15.541 sec - in org.apache.hadoop.hbase.util.TestIdReadWriteLock
Running org.apache.hadoop.hbase.util.hbck.TestOfflineMetaRebuildOverlap
Running org.apache.hadoop.hbase.util.hbck.TestOfflineMetaRebuildHole
Tests run: 1, Failures: 0, Errors: 0, Skipped: 0, Time elapsed: 33.449 sec - in org.apache.hadoop.hbase.util.hbck.TestOfflineMetaRebuildHole
Tests run: 4, Failures: 0, Errors: 0, Skipped: 0, Time elapsed: 76.749 sec - in org.apache.hadoop.hbase.util.TestMiniClusterLoadParallel
Running org.apache.hadoop.hbase.util.hbck.TestOfflineMetaRebuildBase
Tests run: 1, Failures: 0, Errors: 0, Skipped: 0, Time elapsed: 35.234 sec - in org.apache.hadoop.hbase.util.hbck.TestOfflineMetaRebuildOverlap
Running org.apache.hadoop.hbase.util.TestConnectionCache
Running org.apache.hadoop.hbase.util.TestFSTableDescriptors
Tests run: 16, Failures: 0, Errors: 0, Skipped: 0, Time elapsed: 3.384 sec - in org.apache.hadoop.hbase.util.TestFSTableDescriptors
Running org.apache.hadoop.hbase.util.TestMiniClusterLoadEncoded
Tests run: 1, Failures: 0, Errors: 0, Skipped: 0, Time elapsed: 24.083 sec - in org.apache.hadoop.hbase.util.TestConnectionCache
Tests run: 9, Failures: 0, Errors: 0, Skipped: 0, Time elapsed: 91.684 sec - in org.apache.hadoop.hbase.util.TestHBaseFsckTwoRS
Running org.apache.hadoop.hbase.util.TestDefaultEnvironmentEdge
Tests run: 1, Failures: 0, Errors: 0, Skipped: 0, Time elapsed: 0.249 sec - in org.apache.hadoop.hbase.util.TestDefaultEnvironmentEdge
Tests run: 1, Failures: 0, Errors: 0, Skipped: 0, Time elapsed: 32.962 sec - in org.apache.hadoop.hbase.util.hbck.TestOfflineMetaRebuildBase
Running org.apache.hadoop.hbase.util.TestTableName
Tests run: 6, Failures: 0, Errors: 0, Skipped: 0, Time elapsed: 0.42 sec - in org.apache.hadoop.hbase.util.TestTableName
Running org.apache.hadoop.hbase.util.TestMiniClusterLoadSequential
Running org.apache.hadoop.hbase.util.TestHBaseFsckOneRS
Running org.apache.hadoop.hbase.util.TestHBaseFsckReplicas
Tests run: 4, Failures: 0, Errors: 0, Skipped: 0, Time elapsed: 45.27 sec - in org.apache.hadoop.hbase.util.TestHBaseFsckReplicas
Tests run: 5, Failures: 0, Errors: 0, Skipped: 0, Time elapsed: 79.935 sec - in org.apache.hadoop.hbase.util.TestMiniClusterLoadEncoded
Running org.apache.hadoop.hbase.util.TestIdLock
Tests run: 21, Failures: 0, Errors: 0, Skipped: 1, Time elapsed: 348.342 sec - in org.apache.hadoop.hbase.master.balancer.TestStochasticLoadBalancer
Running org.apache.hadoop.hbase.util.TestFSUtils
Running org.apache.hadoop.hbase.util.TestCoprocessorScanPolicy
Tests run: 1, Failures: 0, Errors: 0, Skipped: 0, Time elapsed: 15.23 sec - in org.apache.hadoop.hbase.util.TestIdLock
Running org.apache.hadoop.hbase.util.TestMergeTool
Tests run: 4, Failures: 0, Errors: 0, Skipped: 0, Time elapsed: 72.855 sec - in org.apache.hadoop.hbase.util.TestMiniClusterLoadSequential
Running org.apache.hadoop.hbase.util.TestMergeTable
Tests run: 4, Failures: 0, Errors: 0, Skipped: 0, Time elapsed: 19.215 sec - in org.apache.hadoop.hbase.util.TestCoprocessorScanPolicy
Tests run: 11, Failures: 0, Errors: 0, Skipped: 0, Time elapsed: 26.659 sec - in org.apache.hadoop.hbase.util.TestFSUtils
Running org.apache.hadoop.hbase.util.TestHBaseFsckEncryption
Tests run: 1, Failures: 0, Errors: 0, Skipped: 0, Time elapsed: 18.758 sec - in org.apache.hadoop.hbase.util.TestMergeTool
Tests run: 1, Failures: 0, Errors: 0, Skipped: 0, Time elapsed: 27.635 sec - in org.apache.hadoop.hbase.util.TestMergeTable
Tests run: 1, Failures: 0, Errors: 0, Skipped: 0, Time elapsed: 17.804 sec - in org.apache.hadoop.hbase.util.TestHBaseFsckEncryption
Tests run: 42, Failures: 0, Errors: 0, Skipped: 1, Time elapsed: 364.54 sec - in org.apache.hadoop.hbase.util.TestHBaseFsckOneRS

Results :

Failed tests: 
  TestVisibilityLabelReplicationWithExpAsString>TestVisibilityLabelsReplication.testVisibilityReplication:266
null
Tests in error: 
  TestVisibilityLabelsWithDefaultVisLabelService>TestVisibilityLabels.testLabelsWithCheckAndPut:590
» ScannerTimeout

Tests run: 2122, Failures: 1, Errors: 1, Skipped: 26

[INFO] ------------------------------------------------------------------------
[INFO] Reactor Summary:
[INFO] 
[INFO] Apache HBase ...................................... SUCCESS [  2.581 s]
[INFO] Apache HBase - Checkstyle ......................... SUCCESS [  0.721 s]
[INFO] Apache HBase - Resource Bundle .................... SUCCESS [  0.235 s]
[INFO] Apache HBase - Annotations ........................ SUCCESS [  0.298 s]
[INFO] Apache HBase - Protocol ........................... SUCCESS [  3.767 s]
[INFO] Apache HBase - Common ............................. SUCCESS [01:33 min]
[INFO] Apache HBase - Procedure .......................... SUCCESS [01:40 min]
[INFO] Apache HBase - Client ............................. SUCCESS [ 42.827 s]
[INFO] Apache HBase - Hadoop Compatibility ............... SUCCESS [  7.678 s]
[INFO] Apache HBase - Hadoop Two Compatibility ........... SUCCESS [  9.948 s]
[INFO] Apache HBase - Prefix Tree ........................ SUCCESS [ 11.026 s]
[INFO] Apache HBase - Server ............................. FAILURE [  01:20 h]
[INFO] Apache HBase - Testing Util ....................... SKIPPED
[INFO] Apache HBase - Thrift ............................. SKIPPED
[INFO] Apache HBase - RSGroup ............................ SKIPPED
[INFO] Apache HBase - Shell .............................. SKIPPED
[INFO] Apache HBase - Integration Tests .................. SKIPPED
[INFO] Apache HBase - Examples ........................... SKIPPED
[INFO] Apache HBase - Rest ............................... SKIPPED
[INFO] Apache HBase - External Block Cache ............... SKIPPED
[INFO] Apache HBase - Spark .............................. SKIPPED
[INFO] Apache HBase - Assembly ........................... SKIPPED
[INFO] Apache HBase - Shaded ............................. SKIPPED
[INFO] Apache HBase - Shaded - Client .................... SKIPPED
[INFO] Apache HBase - Shaded - Server .................... SKIPPED
[INFO] Apache HBase - Archetypes ......................... SKIPPED
[INFO] Apache HBase - Exemplar for hbase-client archetype  SKIPPED
[INFO] Apache HBase - Exemplar for hbase-shaded-client archetype  SKIPPED
[INFO] Apache HBase - Archetype builder .................. SKIPPED
[INFO] ------------------------------------------------------------------------
[INFO] BUILD FAILURE
[INFO] ------------------------------------------------------------------------
[INFO] Total time: 01:25 h
[INFO] Finished at: 2016-07-20T13:17:02+00:00
[INFO] Final Memory: 70M/580M
[INFO] ------------------------------------------------------------------------
[ERROR] Failed to execute goal org.apache.maven.plugins:maven-surefire-plugin:2.18.1:test
(secondPartTestsExecution) on project hbase-server: There are test failures.
[ERROR] 
[ERROR] Please refer to <https://builds.apache.org/job/HBase-Trunk_matrix/jdk=latest1.7,label=yahoo-not-h2/ws/hbase-server/target/surefire-reports>
for the individual test results.
[ERROR] -> [Help 1]
[ERROR] 
[ERROR] To see the full stack trace of the errors, re-run Maven with the -e switch.
[ERROR] Re-run Maven using the -X switch to enable full debug logging.
[ERROR] 
[ERROR] For more information about the errors and possible solutions, please read the following
articles:
[ERROR] [Help 1] http://cwiki.apache.org/confluence/display/MAVEN/MojoFailureException
[ERROR] 
[ERROR] After correcting the problems, you can resume the build with the command
[ERROR]   mvn <goals> -rf :hbase-server
Build step 'Invoke top-level Maven targets' marked build as failure
Performing Post build task...
Match found for :.* : True
Logical operation result is TRUE
Running script  : # Run zombie detector script
./dev-support/zombie-detector.sh --jenkins ${BUILD_ID}
[yahoo-not-h2] $ /bin/bash -xe /tmp/hudson2982031031783032727.sh
+ ./dev-support/zombie-detector.sh --jenkins 1262
Wed Jul 20 13:17:12 UTC 2016 We're ok: there is no zombie test


    {color:green}+1 zombies{color}. No zombie tests found running at the end of the build.
POST BUILD TASK : SUCCESS
END OF POST BUILD TASK : 0
Archiving artifacts
Recording test results
[FINDBUGS] Skipping publisher since build result is FAILURE
[CHECKSTYLE] Skipping publisher since build result is FAILURE

Mime
View raw message