hbase-builds mailing list archives

Site index · List index
Message view « Date » · « Thread »
Top « Date » · « Thread »
From Apache Jenkins Server <jenk...@builds.apache.org>
Subject Build failed in Jenkins: HBase-1.4 » latest1.8,yahoo-not-h2 #295
Date Tue, 19 Jul 2016 00:13:44 GMT
See <https://builds.apache.org/job/HBase-1.4/jdk=latest1.8,label=yahoo-not-h2/295/changes>

Changes:

[tedyu] HBASE-16237 Blocks for hbase:meta table are not cached in L1 cache (Lars

------------------------------------------
[...truncated 49353 lines...]
Running org.apache.hadoop.hbase.master.TestMaster
Tests run: 1, Failures: 0, Errors: 0, Skipped: 0, Time elapsed: 17.599 sec - in org.apache.hadoop.hbase.master.TestGetInfoPort
Java HotSpot(TM) 64-Bit Server VM warning: ignoring option MaxPermSize=256m; support was removed
in 8.0
Tests run: 4, Failures: 0, Errors: 0, Skipped: 0, Time elapsed: 18.989 sec - in org.apache.hadoop.hbase.master.TestMaster
Java HotSpot(TM) 64-Bit Server VM warning: ignoring option MaxPermSize=256m; support was removed
in 8.0
Java HotSpot(TM) 64-Bit Server VM warning: ignoring option MaxPermSize=256m; support was removed
in 8.0
Running org.apache.hadoop.hbase.master.TestDeadServer
Tests run: 4, Failures: 0, Errors: 0, Skipped: 0, Time elapsed: 2.509 sec - in org.apache.hadoop.hbase.master.TestDeadServer
Java HotSpot(TM) 64-Bit Server VM warning: ignoring option MaxPermSize=256m; support was removed
in 8.0
Running org.apache.hadoop.hbase.master.normalizer.TestSimpleRegionNormalizerOnCluster
Running org.apache.hadoop.hbase.master.TestZKBasedOpenCloseRegion
Tests run: 3, Failures: 0, Errors: 0, Skipped: 0, Time elapsed: 4.985 sec - in org.apache.hadoop.hbase.master.TestZKBasedOpenCloseRegion
Java HotSpot(TM) 64-Bit Server VM warning: ignoring option MaxPermSize=256m; support was removed
in 8.0
Tests run: 2, Failures: 0, Errors: 0, Skipped: 0, Time elapsed: 32.194 sec - in org.apache.hadoop.hbase.master.normalizer.TestSimpleRegionNormalizerOnCluster
Java HotSpot(TM) 64-Bit Server VM warning: ignoring option MaxPermSize=256m; support was removed
in 8.0
Running org.apache.hadoop.hbase.master.TestMasterStatusServlet
Tests run: 4, Failures: 0, Errors: 0, Skipped: 0, Time elapsed: 3.349 sec - in org.apache.hadoop.hbase.master.TestMasterStatusServlet
Java HotSpot(TM) 64-Bit Server VM warning: ignoring option MaxPermSize=256m; support was removed
in 8.0
Java HotSpot(TM) 64-Bit Server VM warning: ignoring option MaxPermSize=256m; support was removed
in 8.0
Running org.apache.hadoop.hbase.master.TestAssignmentManagerMetrics
Tests run: 15, Failures: 0, Errors: 0, Skipped: 1, Time elapsed: 140.278 sec - in org.apache.hadoop.hbase.master.TestSplitLogManager
Java HotSpot(TM) 64-Bit Server VM warning: ignoring option MaxPermSize=256m; support was removed
in 8.0
Tests run: 1, Failures: 0, Errors: 0, Skipped: 0, Time elapsed: 9.452 sec - in org.apache.hadoop.hbase.master.TestAssignmentManagerMetrics
Java HotSpot(TM) 64-Bit Server VM warning: ignoring option MaxPermSize=256m; support was removed
in 8.0
Java HotSpot(TM) 64-Bit Server VM warning: ignoring option MaxPermSize=256m; support was removed
in 8.0
Java HotSpot(TM) 64-Bit Server VM warning: ignoring option MaxPermSize=256m; support was removed
in 8.0
Running org.apache.hadoop.hbase.master.cleaner.TestSnapshotFromMaster
Running org.apache.hadoop.hbase.master.cleaner.TestLogsCleaner
Running org.apache.hadoop.hbase.master.cleaner.TestHFileCleaner
Tests run: 3, Failures: 0, Errors: 0, Skipped: 0, Time elapsed: 2.232 sec - in org.apache.hadoop.hbase.master.cleaner.TestHFileCleaner
Java HotSpot(TM) 64-Bit Server VM warning: ignoring option MaxPermSize=256m; support was removed
in 8.0
Tests run: 3, Failures: 0, Errors: 0, Skipped: 0, Time elapsed: 13.012 sec - in org.apache.hadoop.hbase.master.cleaner.TestLogsCleaner
Java HotSpot(TM) 64-Bit Server VM warning: ignoring option MaxPermSize=256m; support was removed
in 8.0
Running org.apache.hadoop.hbase.master.TestDistributedLogSplitting
Running org.apache.hadoop.hbase.master.TestMasterMetrics
Tests run: 3, Failures: 0, Errors: 0, Skipped: 0, Time elapsed: 2.353 sec - in org.apache.hadoop.hbase.master.TestMasterMetrics
Java HotSpot(TM) 64-Bit Server VM warning: ignoring option MaxPermSize=256m; support was removed
in 8.0
Java HotSpot(TM) 64-Bit Server VM warning: ignoring option MaxPermSize=256m; support was removed
in 8.0
Running org.apache.hadoop.hbase.master.TestMasterOperationsForRegionReplicas
Tests run: 2, Failures: 0, Errors: 0, Skipped: 0, Time elapsed: 28.163 sec - in org.apache.hadoop.hbase.master.TestMasterOperationsForRegionReplicas
Java HotSpot(TM) 64-Bit Server VM warning: ignoring option MaxPermSize=256m; support was removed
in 8.0
Running org.apache.hadoop.hbase.master.TestMasterRestartAfterDisablingTable
Tests run: 18, Failures: 0, Errors: 0, Skipped: 15, Time elapsed: 56.957 sec - in org.apache.hadoop.hbase.master.TestDistributedLogSplitting
Java HotSpot(TM) 64-Bit Server VM warning: ignoring option MaxPermSize=256m; support was removed
in 8.0
Running org.apache.hadoop.hbase.master.TestRegionPlacement
Tests run: 2, Failures: 0, Errors: 0, Skipped: 2, Time elapsed: 0.01 sec - in org.apache.hadoop.hbase.master.TestRegionPlacement
Java HotSpot(TM) 64-Bit Server VM warning: ignoring option MaxPermSize=256m; support was removed
in 8.0
Java HotSpot(TM) 64-Bit Server VM warning: ignoring option MaxPermSize=256m; support was removed
in 8.0
Java HotSpot(TM) 64-Bit Server VM warning: ignoring option MaxPermSize=256m; support was removed
in 8.0
Tests run: 21, Failures: 0, Errors: 0, Skipped: 1, Time elapsed: 448.769 sec - in org.apache.hadoop.hbase.master.balancer.TestStochasticLoadBalancer
Java HotSpot(TM) 64-Bit Server VM warning: ignoring option MaxPermSize=256m; support was removed
in 8.0
Tests run: 1, Failures: 0, Errors: 0, Skipped: 0, Time elapsed: 31.484 sec - in org.apache.hadoop.hbase.master.TestMasterRestartAfterDisablingTable
Java HotSpot(TM) 64-Bit Server VM warning: ignoring option MaxPermSize=256m; support was removed
in 8.0
Java HotSpot(TM) 64-Bit Server VM warning: ignoring option MaxPermSize=256m; support was removed
in 8.0
Running org.apache.hadoop.hbase.master.TestAssignmentListener
Java HotSpot(TM) 64-Bit Server VM warning: ignoring option MaxPermSize=256m; support was removed
in 8.0
Running org.apache.hadoop.hbase.master.snapshot.TestSnapshotFileCache
Tests run: 2, Failures: 0, Errors: 0, Skipped: 0, Time elapsed: 14.972 sec - in org.apache.hadoop.hbase.master.TestAssignmentListener
Java HotSpot(TM) 64-Bit Server VM warning: ignoring option MaxPermSize=256m; support was removed
in 8.0
Running org.apache.hadoop.hbase.master.TestMasterPriorityRpc
Running org.apache.hadoop.hbase.master.TestMasterMetricsWrapper
Tests run: 1, Failures: 0, Errors: 0, Skipped: 0, Time elapsed: 3.432 sec - in org.apache.hadoop.hbase.master.TestMasterMetricsWrapper
Java HotSpot(TM) 64-Bit Server VM warning: ignoring option MaxPermSize=256m; support was removed
in 8.0
Tests run: 3, Failures: 0, Errors: 0, Skipped: 0, Time elapsed: 4.774 sec - in org.apache.hadoop.hbase.master.TestMasterPriorityRpc
Java HotSpot(TM) 64-Bit Server VM warning: ignoring option MaxPermSize=256m; support was removed
in 8.0
Java HotSpot(TM) 64-Bit Server VM warning: ignoring option MaxPermSize=256m; support was removed
in 8.0
Running org.apache.hadoop.hbase.snapshot.TestSnapshotClientRetries
Tests run: 2, Failures: 0, Errors: 0, Skipped: 0, Time elapsed: 32.583 sec - in org.apache.hadoop.hbase.snapshot.TestSnapshotClientRetries
Java HotSpot(TM) 64-Bit Server VM warning: ignoring option MaxPermSize=256m; support was removed
in 8.0
Running org.apache.hadoop.hbase.snapshot.TestExportSnapshot
Tests run: 4, Failures: 0, Errors: 0, Skipped: 0, Time elapsed: 55.217 sec - in org.apache.hadoop.hbase.master.snapshot.TestSnapshotFileCache
Java HotSpot(TM) 64-Bit Server VM warning: ignoring option MaxPermSize=256m; support was removed
in 8.0
Running org.apache.hadoop.hbase.snapshot.TestSnapshotDescriptionUtils
Tests run: 2, Failures: 0, Errors: 0, Skipped: 0, Time elapsed: 0.298 sec - in org.apache.hadoop.hbase.snapshot.TestSnapshotDescriptionUtils
Java HotSpot(TM) 64-Bit Server VM warning: ignoring option MaxPermSize=256m; support was removed
in 8.0
Java HotSpot(TM) 64-Bit Server VM warning: ignoring option MaxPermSize=256m; support was removed
in 8.0
Java HotSpot(TM) 64-Bit Server VM warning: ignoring option MaxPermSize=256m; support was removed
in 8.0
Running org.apache.hadoop.hbase.snapshot.TestFlushSnapshotFromClient
Running org.apache.hadoop.hbase.snapshot.TestRestoreFlushSnapshotFromClient
Tests run: 4, Failures: 0, Errors: 0, Skipped: 0, Time elapsed: 546.873 sec - in org.apache.hadoop.hbase.master.balancer.TestStochasticLoadBalancer2
Java HotSpot(TM) 64-Bit Server VM warning: ignoring option MaxPermSize=256m; support was removed
in 8.0
Running org.apache.hadoop.hbase.snapshot.TestSecureExportSnapshot
Tests run: 9, Failures: 0, Errors: 0, Skipped: 0, Time elapsed: 99.04 sec - in org.apache.hadoop.hbase.snapshot.TestFlushSnapshotFromClient
Tests run: 5, Failures: 0, Errors: 0, Skipped: 0, Time elapsed: 91.667 sec - in org.apache.hadoop.hbase.snapshot.TestRestoreFlushSnapshotFromClient
Tests run: 4, Failures: 0, Errors: 1, Skipped: 0, Time elapsed: 330.002 sec <<< FAILURE!
- in org.apache.hadoop.hbase.master.cleaner.TestSnapshotFromMaster
testSnapshotHFileArchiving(org.apache.hadoop.hbase.master.cleaner.TestSnapshotFromMaster)
 Time elapsed: 304.948 sec  <<< ERROR!
org.junit.runners.model.TestTimedOutException: test timed out after 300000 milliseconds
	at java.lang.Object.wait(Native Method)
	at org.apache.hadoop.hbase.client.AsyncProcess.waitForMaximumCurrentTasks(AsyncProcess.java:1810)
	at org.apache.hadoop.hbase.client.AsyncProcess.waitForMaximumCurrentTasks(AsyncProcess.java:1784)
	at org.apache.hadoop.hbase.client.AsyncProcess.waitForAllPreviousOpsAndReset(AsyncProcess.java:1860)
	at org.apache.hadoop.hbase.client.BufferedMutatorImpl.backgroundFlushCommits(BufferedMutatorImpl.java:241)
	at org.apache.hadoop.hbase.client.BufferedMutatorImpl.flush(BufferedMutatorImpl.java:190)
	at org.apache.hadoop.hbase.client.HTable.flushCommits(HTable.java:1463)
	at org.apache.hadoop.hbase.client.HTable.put(HTable.java:1029)
	at org.apache.hadoop.hbase.HBaseTestingUtility.loadTable(HBaseTestingUtility.java:2223)
	at org.apache.hadoop.hbase.HBaseTestingUtility.loadTable(HBaseTestingUtility.java:2202)
	at org.apache.hadoop.hbase.HBaseTestingUtility.loadTable(HBaseTestingUtility.java:2190)
	at org.apache.hadoop.hbase.HBaseTestingUtility.loadTable(HBaseTestingUtility.java:2168)
	at org.apache.hadoop.hbase.master.cleaner.TestSnapshotFromMaster.testSnapshotHFileArchiving(TestSnapshotFromMaster.java:297)

Tests run: 1, Failures: 0, Errors: 1, Skipped: 0, Time elapsed: 643.126 sec <<< FAILURE!
- in org.apache.hadoop.hbase.master.cleaner.TestSnapshotFromMaster
testSnapshotHFileArchiving(org.apache.hadoop.hbase.master.cleaner.TestSnapshotFromMaster)
 Time elapsed: 303.869 sec  <<< ERROR!
org.junit.runners.model.TestTimedOutException: test timed out after 300000 milliseconds
	at java.lang.Thread.sleep(Native Method)
	at org.apache.hadoop.hbase.client.HBaseAdmin$ProcedureFuture.waitProcedureResult(HBaseAdmin.java:4673)
	at org.apache.hadoop.hbase.client.HBaseAdmin$ProcedureFuture.get(HBaseAdmin.java:4602)
	at org.apache.hadoop.hbase.client.HBaseAdmin.enableTable(HBaseAdmin.java:1073)
	at org.apache.hadoop.hbase.master.cleaner.TestSnapshotFromMaster.testSnapshotHFileArchiving(TestSnapshotFromMaster.java:324)

Tests run: 9, Failures: 0, Errors: 0, Skipped: 0, Time elapsed: 478.794 sec - in org.apache.hadoop.hbase.snapshot.TestExportSnapshot
Tests run: 9, Failures: 0, Errors: 0, Skipped: 0, Time elapsed: 453.116 sec - in org.apache.hadoop.hbase.snapshot.TestSecureExportSnapshot

Results :

Tests in error: 
org.apache.hadoop.hbase.master.cleaner.TestSnapshotFromMaster.testSnapshotHFileArchiving(org.apache.hadoop.hbase.master.cleaner.TestSnapshotFromMaster)
  Run 1: TestSnapshotFromMaster.testSnapshotHFileArchiving:297->Object.wait:-2 » TestTimedOut
  Run 2: TestSnapshotFromMaster.testSnapshotHFileArchiving:324 » TestTimedOut test time...

  TestClusterId.testClusterId:84 » IO Shutting down
Flaked tests: 
org.apache.hadoop.hbase.client.TestSnapshotCloneIndependence.testOnlineSnapshotDeleteIndependent(org.apache.hadoop.hbase.client.TestSnapshotCloneIndependence)
  Run 1: TestSnapshotCloneIndependence.testOnlineSnapshotDeleteIndependent:226->runTestSnapshotDeleteIndependent:374
expected:<17576> but was:<13108>
  Run 2: PASS


Tests run: 2570, Failures: 0, Errors: 2, Skipped: 57, Flakes: 1

[INFO] ------------------------------------------------------------------------
[INFO] Reactor Summary:
[INFO] 
[INFO] Apache HBase ...................................... SUCCESS [5:42.143s]
[INFO] Apache HBase - Checkstyle ......................... SUCCESS [36.993s]
[INFO] Apache HBase - Resource Bundle .................... SUCCESS [0.387s]
[INFO] Apache HBase - Annotations ........................ SUCCESS [1.801s]
[INFO] Apache HBase - Protocol ........................... SUCCESS [30.500s]
[INFO] Apache HBase - Common ............................. SUCCESS [4:11.163s]
[INFO] Apache HBase - Procedure .......................... SUCCESS [3:33.600s]
[INFO] Apache HBase - Client ............................. SUCCESS [1:48.409s]
[INFO] Apache HBase - Hadoop Compatibility ............... SUCCESS [15.515s]
[INFO] Apache HBase - Hadoop Two Compatibility ........... SUCCESS [20.475s]
[INFO] Apache HBase - Prefix Tree ........................ SUCCESS [13.476s]
[INFO] Apache HBase - Server ............................. FAILURE [2:13:47.180s]
[INFO] Apache HBase - Testing Util ....................... SKIPPED
[INFO] Apache HBase - Thrift ............................. SKIPPED
[INFO] Apache HBase - Rest ............................... SKIPPED
[INFO] Apache HBase - Shell .............................. SKIPPED
[INFO] Apache HBase - Integration Tests .................. SKIPPED
[INFO] Apache HBase - Examples ........................... SKIPPED
[INFO] Apache HBase - External Block Cache ............... SKIPPED
[INFO] Apache HBase - Assembly ........................... SKIPPED
[INFO] Apache HBase - Shaded ............................. SKIPPED
[INFO] Apache HBase - Shaded - Client .................... SKIPPED
[INFO] Apache HBase - Shaded - Server .................... SKIPPED
[INFO] Apache HBase - Archetypes ......................... SKIPPED
[INFO] Apache HBase - Exemplar for hbase-client archetype  SKIPPED
[INFO] Apache HBase - Exemplar for hbase-shaded-client archetype  SKIPPED
[INFO] Apache HBase - Archetype builder .................. SKIPPED
[INFO] ------------------------------------------------------------------------
[INFO] BUILD FAILURE
[INFO] ------------------------------------------------------------------------
[INFO] Total time: 2:32:55.295s
[INFO] Finished at: Mon Jul 18 23:57:32 UTC 2016
[INFO] Final Memory: 499M/731M
[INFO] ------------------------------------------------------------------------
[ERROR] Failed to execute goal org.apache.maven.plugins:maven-surefire-plugin:2.18.1:test
(secondPartTestsExecution) on project hbase-server: ExecutionException: java.lang.RuntimeException:
java.lang.RuntimeException: org.apache.maven.surefire.report.ReporterException: When writing
xml report stdout/stderr: /tmp/stderr4376079969819898377deferred (No such file or directory)
-> [Help 1]
[ERROR] 
[ERROR] To see the full stack trace of the errors, re-run Maven with the -e switch.
[ERROR] Re-run Maven using the -X switch to enable full debug logging.
[ERROR] 
[ERROR] For more information about the errors and possible solutions, please read the following
articles:
[ERROR] [Help 1] http://cwiki.apache.org/confluence/display/MAVEN/MojoFailureException
[ERROR] 
[ERROR] After correcting the problems, you can resume the build with the command
[ERROR]   mvn <goals> -rf :hbase-server
Build step 'Invoke top-level Maven targets' marked build as failure
Performing Post build task...
Match found for :.* : True
Logical operation result is TRUE
Running script  : # Post-build task script. TODO: Check this in and have all builds reference
check-in.
pwd && ls
# NOTE!!!! The below code has been copied and pasted from ./dev-tools/run-test.sh
# Do not change here without syncing there and vice-versa.
ZOMBIE_TESTS_COUNT=`jps -v | grep surefirebooter | grep -e '-Dhbase.test' | wc -l`
if [[ $ZOMBIE_TESTS_COUNT != 0 ]] ; then
 echo "Suspicious java process found - waiting 30s to see if there are just slow to stop"
 sleep 30
 ZOMBIE_TESTS_COUNT=`jps -v | grep surefirebooter | grep -e '-Dhbase.test' | wc -l`
 if [[ $ZOMBIE_TESTS_COUNT != 0 ]] ; then
   echo " {color:red}There appear to be $ZOMBIE_TESTS_COUNT zombie tests{color}, they should
have been killed by surefire but survived"
   jps -v | grep surefirebooter | grep -e '-Dhbase.test'
   jps -v | grep surefirebooter | grep -e '-Dhbase.test' | cut -d ' ' -f 1 | xargs -n 1 jstack
   # Exit with error
   exit 1
 else
   echo "We're ok: there is no zombie test, but some tests took some time to stop"
 fi
else
  echo "We're ok: there is no zombie test"
fi
[yahoo-not-h2] $ /bin/bash -xe /tmp/hudson328601338539887182.sh
+ pwd
<https://builds.apache.org/job/HBase-1.4/jdk=latest1.8,label=yahoo-not-h2/ws/>
+ ls
bin
CHANGES.txt
conf
dev-support
hbase-annotations
hbase-archetypes
hbase-assembly
hbase-checkstyle
hbase-client
hbase-common
hbase-examples
hbase-external-blockcache
hbase-hadoop2-compat
hbase-hadoop-compat
hbase-it
hbase-native-client
hbase-prefix-tree
hbase-procedure
hbase-protocol
hbase-resource-bundle
hbase-rest
hbase-server
hbase-shaded
hbase-shell
hbase-testing-util
hbase-thrift
LICENSE.txt
NOTICE.txt
pom.xml
README.txt
src
target
++ wc -l
++ grep -e -Dhbase.test
++ grep surefirebooter
++ jps -v
+ ZOMBIE_TESTS_COUNT=0
+ [[ 0 != 0 ]]
+ echo 'We'\''re ok: there is no zombie test'
We're ok: there is no zombie test
POST BUILD TASK : SUCCESS
END OF POST BUILD TASK : 0
Archiving artifacts
Recording test results

Mime
View raw message