hbase-builds mailing list archives

Site index · List index
Message view « Date » · « Thread »
Top « Date » · « Thread »
From Apache Jenkins Server <jenk...@builds.apache.org>
Subject Build failed in Jenkins: HBase-Trunk_matrix » latest1.8,yahoo-not-h2 #1274
Date Fri, 22 Jul 2016 11:28:53 GMT
See <https://builds.apache.org/job/HBase-Trunk_matrix/jdk=latest1.8,label=yahoo-not-h2/1274/>

------------------------------------------
[...truncated 7122 lines...]
Java HotSpot(TM) 64-Bit Server VM warning: ignoring option MaxPermSize=256m; support was removed
in 8.0
Running org.apache.hadoop.hbase.regionserver.wal.TestAsyncProtobufLog
Running org.apache.hadoop.hbase.regionserver.wal.TestFSHLog
Tests run: 1, Failures: 0, Errors: 0, Skipped: 0, Time elapsed: 5.188 sec - in org.apache.hadoop.hbase.regionserver.wal.TestAsyncProtobufLog
Java HotSpot(TM) 64-Bit Server VM warning: ignoring option MaxPermSize=256m; support was removed
in 8.0
Tests run: 12, Failures: 0, Errors: 0, Skipped: 0, Time elapsed: 48.804 sec - in org.apache.hadoop.hbase.regionserver.wal.TestAsyncWALReplayCompressed
Java HotSpot(TM) 64-Bit Server VM warning: ignoring option MaxPermSize=256m; support was removed
in 8.0
Running org.apache.hadoop.hbase.regionserver.wal.TestLogRollingNoCluster
Tests run: 7, Failures: 0, Errors: 0, Skipped: 0, Time elapsed: 9.21 sec - in org.apache.hadoop.hbase.regionserver.wal.TestFSHLog
Java HotSpot(TM) 64-Bit Server VM warning: ignoring option MaxPermSize=256m; support was removed
in 8.0
Running org.apache.hadoop.hbase.regionserver.wal.TestLogRollAbort
Running org.apache.hadoop.hbase.regionserver.wal.TestSecureWALReplay
Tests run: 6, Failures: 0, Errors: 0, Skipped: 1, Time elapsed: 152.297 sec - in org.apache.hadoop.hbase.regionserver.TestPerColumnFamilyFlush
Java HotSpot(TM) 64-Bit Server VM warning: ignoring option MaxPermSize=256m; support was removed
in 8.0
Running org.apache.hadoop.hbase.regionserver.wal.TestWALReplay
Tests run: 1, Failures: 0, Errors: 0, Skipped: 0, Time elapsed: 22.746 sec - in org.apache.hadoop.hbase.regionserver.wal.TestLogRollingNoCluster
Java HotSpot(TM) 64-Bit Server VM warning: ignoring option MaxPermSize=256m; support was removed
in 8.0
Running org.apache.hadoop.hbase.regionserver.wal.TestLogRolling
Running org.apache.hadoop.hbase.regionserver.wal.TestAsyncFSWAL
Tests run: 6, Failures: 0, Errors: 0, Skipped: 0, Time elapsed: 8.34 sec - in org.apache.hadoop.hbase.regionserver.wal.TestAsyncFSWAL
Java HotSpot(TM) 64-Bit Server VM warning: ignoring option MaxPermSize=256m; support was removed
in 8.0
Java HotSpot(TM) 64-Bit Server VM warning: ignoring option MaxPermSize=256m; support was removed
in 8.0
Running org.apache.hadoop.hbase.regionserver.wal.TestProtobufLog
Tests run: 1, Failures: 0, Errors: 0, Skipped: 0, Time elapsed: 2.272 sec - in org.apache.hadoop.hbase.regionserver.wal.TestProtobufLog
Java HotSpot(TM) 64-Bit Server VM warning: ignoring option MaxPermSize=256m; support was removed
in 8.0
Tests run: 2, Failures: 0, Errors: 0, Skipped: 0, Time elapsed: 40.673 sec - in org.apache.hadoop.hbase.regionserver.wal.TestLogRollAbort
Java HotSpot(TM) 64-Bit Server VM warning: ignoring option MaxPermSize=256m; support was removed
in 8.0
Java HotSpot(TM) 64-Bit Server VM warning: ignoring option MaxPermSize=256m; support was removed
in 8.0
Java HotSpot(TM) 64-Bit Server VM warning: ignoring option MaxPermSize=256m; support was removed
in 8.0
Running org.apache.hadoop.hbase.regionserver.wal.TestDurability
Tests run: 6, Failures: 0, Errors: 0, Skipped: 0, Time elapsed: 3.782 sec - in org.apache.hadoop.hbase.regionserver.wal.TestDurability
Java HotSpot(TM) 64-Bit Server VM warning: ignoring option MaxPermSize=256m; support was removed
in 8.0
Java HotSpot(TM) 64-Bit Server VM warning: ignoring option MaxPermSize=256m; support was removed
in 8.0
Running org.apache.hadoop.hbase.regionserver.wal.TestLogRollPeriod
Tests run: 12, Failures: 0, Errors: 0, Skipped: 0, Time elapsed: 51.492 sec - in org.apache.hadoop.hbase.regionserver.wal.TestWALReplay
Java HotSpot(TM) 64-Bit Server VM warning: ignoring option MaxPermSize=256m; support was removed
in 8.0
Tests run: 12, Failures: 0, Errors: 0, Skipped: 0, Time elapsed: 59.771 sec - in org.apache.hadoop.hbase.regionserver.wal.TestSecureWALReplay
Java HotSpot(TM) 64-Bit Server VM warning: ignoring option MaxPermSize=256m; support was removed
in 8.0
Java HotSpot(TM) 64-Bit Server VM warning: ignoring option MaxPermSize=256m; support was removed
in 8.0
Java HotSpot(TM) 64-Bit Server VM warning: ignoring option MaxPermSize=256m; support was removed
in 8.0
Running org.apache.hadoop.hbase.regionserver.wal.TestAsyncWALReplay
Running org.apache.hadoop.hbase.regionserver.wal.TestAsyncLogRollPeriod
Running org.apache.hadoop.hbase.regionserver.wal.TestSecureAsyncWALReplay
Tests run: 2, Failures: 0, Errors: 0, Skipped: 0, Time elapsed: 62.085 sec - in org.apache.hadoop.hbase.regionserver.wal.TestLogRollPeriod
Java HotSpot(TM) 64-Bit Server VM warning: ignoring option MaxPermSize=256m; support was removed
in 8.0
Java HotSpot(TM) 64-Bit Server VM warning: ignoring option MaxPermSize=256m; support was removed
in 8.0
Tests run: 12, Failures: 0, Errors: 0, Skipped: 0, Time elapsed: 47.742 sec - in org.apache.hadoop.hbase.regionserver.wal.TestAsyncWALReplay
Java HotSpot(TM) 64-Bit Server VM warning: ignoring option MaxPermSize=256m; support was removed
in 8.0
Java HotSpot(TM) 64-Bit Server VM warning: ignoring option MaxPermSize=256m; support was removed
in 8.0
Tests run: 12, Failures: 0, Errors: 0, Skipped: 0, Time elapsed: 51.823 sec - in org.apache.hadoop.hbase.regionserver.wal.TestSecureAsyncWALReplay
Java HotSpot(TM) 64-Bit Server VM warning: ignoring option MaxPermSize=256m; support was removed
in 8.0
Java HotSpot(TM) 64-Bit Server VM warning: ignoring option MaxPermSize=256m; support was removed
in 8.0
Java HotSpot(TM) 64-Bit Server VM warning: ignoring option MaxPermSize=256m; support was removed
in 8.0
Java HotSpot(TM) 64-Bit Server VM warning: ignoring option MaxPermSize=256m; support was removed
in 8.0
Running org.apache.hadoop.hbase.regionserver.TestScannerWithBulkload
Running org.apache.hadoop.hbase.regionserver.throttle.TestCompactionWithThroughputController
Tests run: 2, Failures: 0, Errors: 0, Skipped: 0, Time elapsed: 63.48 sec - in org.apache.hadoop.hbase.regionserver.wal.TestAsyncLogRollPeriod
Java HotSpot(TM) 64-Bit Server VM warning: ignoring option MaxPermSize=256m; support was removed
in 8.0
Running org.apache.hadoop.hbase.regionserver.TestDefaultMemStore
Running org.apache.hadoop.hbase.regionserver.TestEncryptionRandomKeying
Tests run: 1, Failures: 0, Errors: 0, Skipped: 0, Time elapsed: 2.14 sec - in org.apache.hadoop.hbase.regionserver.TestEncryptionRandomKeying
Java HotSpot(TM) 64-Bit Server VM warning: ignoring option MaxPermSize=256m; support was removed
in 8.0
Running org.apache.hadoop.hbase.regionserver.TestMasterAddressTracker
Tests run: 5, Failures: 0, Errors: 0, Skipped: 0, Time elapsed: 1.595 sec - in org.apache.hadoop.hbase.regionserver.TestMasterAddressTracker
Java HotSpot(TM) 64-Bit Server VM warning: ignoring option MaxPermSize=256m; support was removed
in 8.0
Running org.apache.hadoop.hbase.regionserver.TestParallelPut
Tests run: 3, Failures: 0, Errors: 0, Skipped: 0, Time elapsed: 17.221 sec - in org.apache.hadoop.hbase.regionserver.TestScannerWithBulkload
Java HotSpot(TM) 64-Bit Server VM warning: ignoring option MaxPermSize=256m; support was removed
in 8.0
Running org.apache.hadoop.hbase.regionserver.TestColumnSeeking
Tests run: 2, Failures: 0, Errors: 0, Skipped: 0, Time elapsed: 10.911 sec - in org.apache.hadoop.hbase.regionserver.TestParallelPut
Java HotSpot(TM) 64-Bit Server VM warning: ignoring option MaxPermSize=256m; support was removed
in 8.0
Tests run: 2, Failures: 0, Errors: 0, Skipped: 0, Time elapsed: 16.955 sec - in org.apache.hadoop.hbase.regionserver.TestColumnSeeking
Java HotSpot(TM) 64-Bit Server VM warning: ignoring option MaxPermSize=256m; support was removed
in 8.0
Java HotSpot(TM) 64-Bit Server VM warning: ignoring option MaxPermSize=256m; support was removed
in 8.0
Running org.apache.hadoop.hbase.regionserver.TestCorruptedRegionStoreFile
Tests run: 24, Failures: 0, Errors: 0, Skipped: 0, Time elapsed: 37.196 sec - in org.apache.hadoop.hbase.regionserver.TestDefaultMemStore
Java HotSpot(TM) 64-Bit Server VM warning: ignoring option MaxPermSize=256m; support was removed
in 8.0
Running org.apache.hadoop.hbase.regionserver.TestRegionIncrement
Running org.apache.hadoop.hbase.regionserver.TestRegionServerOnlineConfigChange
Tests run: 2, Failures: 0, Errors: 0, Skipped: 0, Time elapsed: 2.011 sec - in org.apache.hadoop.hbase.regionserver.TestRegionServerOnlineConfigChange
Java HotSpot(TM) 64-Bit Server VM warning: ignoring option MaxPermSize=256m; support was removed
in 8.0
Java HotSpot(TM) 64-Bit Server VM warning: ignoring option MaxPermSize=256m; support was removed
in 8.0
Tests run: 3, Failures: 0, Errors: 0, Skipped: 0, Time elapsed: 12.211 sec - in org.apache.hadoop.hbase.regionserver.TestRegionIncrement
Java HotSpot(TM) 64-Bit Server VM warning: ignoring option MaxPermSize=256m; support was removed
in 8.0
Java HotSpot(TM) 64-Bit Server VM warning: ignoring option MaxPermSize=256m; support was removed
in 8.0
Running org.apache.hadoop.hbase.regionserver.TestCompaction
Java HotSpot(TM) 64-Bit Server VM warning: ignoring option MaxPermSize=256m; support was removed
in 8.0
Tests run: 6, Failures: 0, Errors: 0, Skipped: 0, Time elapsed: 17.58 sec - in org.apache.hadoop.hbase.regionserver.TestCompaction
Java HotSpot(TM) 64-Bit Server VM warning: ignoring option MaxPermSize=256m; support was removed
in 8.0
Running org.apache.hadoop.hbase.regionserver.TestRecoveredEdits
Running org.apache.hadoop.hbase.regionserver.TestRemoveRegionMetrics
Tests run: 1, Failures: 0, Errors: 0, Skipped: 0, Time elapsed: 12.196 sec - in org.apache.hadoop.hbase.regionserver.TestRecoveredEdits
Java HotSpot(TM) 64-Bit Server VM warning: ignoring option MaxPermSize=256m; support was removed
in 8.0
Running org.apache.hadoop.hbase.regionserver.TestGetClosestAtOrBefore
Tests run: 3, Failures: 0, Errors: 0, Skipped: 0, Time elapsed: 3.191 sec - in org.apache.hadoop.hbase.regionserver.TestGetClosestAtOrBefore
Java HotSpot(TM) 64-Bit Server VM warning: ignoring option MaxPermSize=256m; support was removed
in 8.0
Running org.apache.hadoop.hbase.regionserver.TestCompoundBloomFilter
Tests run: 3, Failures: 0, Errors: 0, Skipped: 0, Time elapsed: 102.889 sec - in org.apache.hadoop.hbase.regionserver.throttle.TestCompactionWithThroughputController
Java HotSpot(TM) 64-Bit Server VM warning: ignoring option MaxPermSize=256m; support was removed
in 8.0
Running org.apache.hadoop.hbase.regionserver.TestRegionServerReportForDuty
Tests run: 1, Failures: 0, Errors: 0, Skipped: 0, Time elapsed: 33.364 sec - in org.apache.hadoop.hbase.regionserver.TestRegionServerReportForDuty
Java HotSpot(TM) 64-Bit Server VM warning: ignoring option MaxPermSize=256m; support was removed
in 8.0
Java HotSpot(TM) 64-Bit Server VM warning: ignoring option MaxPermSize=256m; support was removed
in 8.0
Java HotSpot(TM) 64-Bit Server VM warning: ignoring option MaxPermSize=256m; support was removed
in 8.0
Java HotSpot(TM) 64-Bit Server VM warning: ignoring option MaxPermSize=256m; support was removed
in 8.0
Java HotSpot(TM) 64-Bit Server VM warning: ignoring option MaxPermSize=256m; support was removed
in 8.0
Java HotSpot(TM) 64-Bit Server VM warning: ignoring option MaxPermSize=256m; support was removed
in 8.0
Java HotSpot(TM) 64-Bit Server VM warning: ignoring option MaxPermSize=256m; support was removed
in 8.0
Java HotSpot(TM) 64-Bit Server VM warning: ignoring option MaxPermSize=256m; support was removed
in 8.0
Java HotSpot(TM) 64-Bit Server VM warning: ignoring option MaxPermSize=256m; support was removed
in 8.0
Tests run: 5, Failures: 0, Errors: 0, Skipped: 0, Time elapsed: 277.087 sec - in org.apache.hadoop.hbase.regionserver.wal.TestLogRolling
Running org.apache.hadoop.hbase.regionserver.compactions.TestCompactedHFilesDischarger
Java HotSpot(TM) 64-Bit Server VM warning: ignoring option MaxPermSize=256m; support was removed
in 8.0
Running org.apache.hadoop.hbase.regionserver.compactions.TestFIFOCompactionPolicy
Tests run: 3, Failures: 0, Errors: 0, Skipped: 0, Time elapsed: 4.378 sec - in org.apache.hadoop.hbase.regionserver.compactions.TestCompactedHFilesDischarger
Java HotSpot(TM) 64-Bit Server VM warning: ignoring option MaxPermSize=256m; support was removed
in 8.0
Running org.apache.hadoop.hbase.regionserver.TestAtomicOperation
Tests run: 2, Failures: 0, Errors: 0, Skipped: 0, Time elapsed: 156.573 sec - in org.apache.hadoop.hbase.regionserver.TestCorruptedRegionStoreFile
Java HotSpot(TM) 64-Bit Server VM warning: ignoring option MaxPermSize=256m; support was removed
in 8.0
Java HotSpot(TM) 64-Bit Server VM warning: ignoring option MaxPermSize=256m; support was removed
in 8.0
Tests run: 4, Failures: 0, Errors: 0, Skipped: 0, Time elapsed: 60.707 sec - in org.apache.hadoop.hbase.regionserver.compactions.TestFIFOCompactionPolicy
Java HotSpot(TM) 64-Bit Server VM warning: ignoring option MaxPermSize=256m; support was removed
in 8.0
Running org.apache.hadoop.hbase.regionserver.TestTimestampFilterSeekHint
Running org.apache.hadoop.hbase.regionserver.TestDeleteMobTable
Tests run: 8, Failures: 0, Errors: 0, Skipped: 0, Time elapsed: 64.805 sec - in org.apache.hadoop.hbase.regionserver.TestAtomicOperation
Java HotSpot(TM) 64-Bit Server VM warning: ignoring option MaxPermSize=256m; support was removed
in 8.0
Running org.apache.hadoop.hbase.regionserver.TestCompactingMemStore
Tests run: 1, Failures: 0, Errors: 0, Skipped: 0, Time elapsed: 162.13 sec - in org.apache.hadoop.hbase.regionserver.TestRemoveRegionMetrics
Tests run: 3, Failures: 0, Errors: 0, Skipped: 0, Time elapsed: 25.644 sec - in org.apache.hadoop.hbase.regionserver.TestDeleteMobTable
Java HotSpot(TM) 64-Bit Server VM warning: ignoring option MaxPermSize=256m; support was removed
in 8.0
Java HotSpot(TM) 64-Bit Server VM warning: ignoring option MaxPermSize=256m; support was removed
in 8.0
Java HotSpot(TM) 64-Bit Server VM warning: ignoring option MaxPermSize=256m; support was removed
in 8.0
Running org.apache.hadoop.hbase.regionserver.TestRSKilledWhenInitializing
Running org.apache.hadoop.hbase.regionserver.TestFSErrorsExposed
Tests run: 2, Failures: 0, Errors: 0, Skipped: 0, Time elapsed: 34.539 sec - in org.apache.hadoop.hbase.regionserver.TestTimestampFilterSeekHint
Java HotSpot(TM) 64-Bit Server VM warning: ignoring option MaxPermSize=256m; support was removed
in 8.0
Java HotSpot(TM) 64-Bit Server VM warning: ignoring option MaxPermSize=256m; support was removed
in 8.0
Running org.apache.hadoop.hbase.regionserver.TestMultiColumnScanner
Tests run: 30, Failures: 0, Errors: 0, Skipped: 0, Time elapsed: 41.846 sec - in org.apache.hadoop.hbase.regionserver.TestCompactingMemStore
Java HotSpot(TM) 64-Bit Server VM warning: ignoring option MaxPermSize=256m; support was removed
in 8.0
Java HotSpot(TM) 64-Bit Server VM warning: ignoring option MaxPermSize=256m; support was removed
in 8.0
Java HotSpot(TM) 64-Bit Server VM warning: ignoring option MaxPermSize=256m; support was removed
in 8.0
Running org.apache.hadoop.hbase.regionserver.TestFlushRegionEntry
Tests run: 1, Failures: 0, Errors: 0, Skipped: 0, Time elapsed: 0.775 sec - in org.apache.hadoop.hbase.regionserver.TestFlushRegionEntry
Java HotSpot(TM) 64-Bit Server VM warning: ignoring option MaxPermSize=256m; support was removed
in 8.0
Running org.apache.hadoop.hbase.regionserver.TestStore
Tests run: 1, Failures: 0, Errors: 0, Skipped: 0, Time elapsed: 37.073 sec - in org.apache.hadoop.hbase.regionserver.TestRSKilledWhenInitializing
Tests run: 18, Failures: 0, Errors: 0, Skipped: 0, Time elapsed: 15.249 sec - in org.apache.hadoop.hbase.regionserver.TestStore
Java HotSpot(TM) 64-Bit Server VM warning: ignoring option MaxPermSize=256m; support was removed
in 8.0
Java HotSpot(TM) 64-Bit Server VM warning: ignoring option MaxPermSize=256m; support was removed
in 8.0
Java HotSpot(TM) 64-Bit Server VM warning: ignoring option MaxPermSize=256m; support was removed
in 8.0
Running org.apache.hadoop.hbase.TestMetaTableLocator
Tests run: 3, Failures: 0, Errors: 0, Skipped: 0, Time elapsed: 47.105 sec - in org.apache.hadoop.hbase.regionserver.TestFSErrorsExposed
Java HotSpot(TM) 64-Bit Server VM warning: ignoring option MaxPermSize=256m; support was removed
in 8.0
Java HotSpot(TM) 64-Bit Server VM warning: ignoring option MaxPermSize=256m; support was removed
in 8.0
Java HotSpot(TM) 64-Bit Server VM warning: ignoring option MaxPermSize=256m; support was removed
in 8.0
Tests run: 7, Failures: 0, Errors: 0, Skipped: 0, Time elapsed: 4.719 sec - in org.apache.hadoop.hbase.TestMetaTableLocator
Java HotSpot(TM) 64-Bit Server VM warning: ignoring option MaxPermSize=256m; support was removed
in 8.0
Java HotSpot(TM) 64-Bit Server VM warning: ignoring option MaxPermSize=256m; support was removed
in 8.0
Java HotSpot(TM) 64-Bit Server VM warning: ignoring option MaxPermSize=256m; support was removed
in 8.0
Java HotSpot(TM) 64-Bit Server VM warning: ignoring option MaxPermSize=256m; support was removed
in 8.0
Running org.apache.hadoop.hbase.TestStochasticBalancerJmxMetrics
Tests run: 1, Failures: 0, Errors: 0, Skipped: 1, Time elapsed: 0.003 sec - in org.apache.hadoop.hbase.TestStochasticBalancerJmxMetrics
Java HotSpot(TM) 64-Bit Server VM warning: ignoring option MaxPermSize=256m; support was removed
in 8.0
Running org.apache.hadoop.hbase.namespace.TestNamespaceAuditor
Tests run: 3, Failures: 0, Errors: 0, Skipped: 0, Time elapsed: 217.538 sec - in org.apache.hadoop.hbase.regionserver.TestCompoundBloomFilter
Tests run: 12, Failures: 0, Errors: 0, Skipped: 0, Time elapsed: 71.559 sec - in org.apache.hadoop.hbase.regionserver.TestMultiColumnScanner
Tests run: 12, Failures: 0, Errors: 0, Skipped: 0, Time elapsed: 175.198 sec - in org.apache.hadoop.hbase.namespace.TestNamespaceAuditor

Results :

Failed tests: 
  TestRegionServerObserver.testCoprocessorHooksInRegionsMerge:104 null
Tests in error: 
  TestMobSnapshotFromClient>TestSnapshotFromClient.setup:103->createTable:57 » Runtime
  TestReplicationEndpoint.testInterClusterReplication:231 » Runtime org.apache.h...

Tests run: 2066, Failures: 1, Errors: 2, Skipped: 26

[INFO] ------------------------------------------------------------------------
[INFO] Reactor Summary:
[INFO] 
[INFO] Apache HBase ...................................... SUCCESS [  3.911 s]
[INFO] Apache HBase - Checkstyle ......................... SUCCESS [  0.768 s]
[INFO] Apache HBase - Resource Bundle .................... SUCCESS [  0.205 s]
[INFO] Apache HBase - Annotations ........................ SUCCESS [  0.211 s]
[INFO] Apache HBase - Protocol ........................... SUCCESS [  3.337 s]
[INFO] Apache HBase - Common ............................. SUCCESS [01:47 min]
[INFO] Apache HBase - Procedure .......................... SUCCESS [01:59 min]
[INFO] Apache HBase - Client ............................. SUCCESS [ 49.118 s]
[INFO] Apache HBase - Hadoop Compatibility ............... SUCCESS [  8.688 s]
[INFO] Apache HBase - Hadoop Two Compatibility ........... SUCCESS [ 12.515 s]
[INFO] Apache HBase - Prefix Tree ........................ SUCCESS [ 12.277 s]
[INFO] Apache HBase - Server ............................. FAILURE [  01:37 h]
[INFO] Apache HBase - Testing Util ....................... SKIPPED
[INFO] Apache HBase - Thrift ............................. SKIPPED
[INFO] Apache HBase - RSGroup ............................ SKIPPED
[INFO] Apache HBase - Shell .............................. SKIPPED
[INFO] Apache HBase - Integration Tests .................. SKIPPED
[INFO] Apache HBase - Examples ........................... SKIPPED
[INFO] Apache HBase - Rest ............................... SKIPPED
[INFO] Apache HBase - External Block Cache ............... SKIPPED
[INFO] Apache HBase - Spark .............................. SKIPPED
[INFO] Apache HBase - Assembly ........................... SKIPPED
[INFO] Apache HBase - Shaded ............................. SKIPPED
[INFO] Apache HBase - Shaded - Client .................... SKIPPED
[INFO] Apache HBase - Shaded - Server .................... SKIPPED
[INFO] Apache HBase - Archetypes ......................... SKIPPED
[INFO] Apache HBase - Exemplar for hbase-client archetype  SKIPPED
[INFO] Apache HBase - Exemplar for hbase-shaded-client archetype  SKIPPED
[INFO] Apache HBase - Archetype builder .................. SKIPPED
[INFO] ------------------------------------------------------------------------
[INFO] BUILD FAILURE
[INFO] ------------------------------------------------------------------------
[INFO] Total time: 01:42 h
[INFO] Finished at: 2016-07-22T11:26:16+00:00
[INFO] Final Memory: 71M/2720M
[INFO] ------------------------------------------------------------------------
[ERROR] Failed to execute goal org.apache.maven.plugins:maven-surefire-plugin:2.18.1:test
(secondPartTestsExecution) on project hbase-server: There are test failures.
[ERROR] 
[ERROR] Please refer to <https://builds.apache.org/job/HBase-Trunk_matrix/jdk=latest1.8,label=yahoo-not-h2/ws/hbase-server/target/surefire-reports>
for the individual test results.
[ERROR] -> [Help 1]
[ERROR] 
[ERROR] To see the full stack trace of the errors, re-run Maven with the -e switch.
[ERROR] Re-run Maven using the -X switch to enable full debug logging.
[ERROR] 
[ERROR] For more information about the errors and possible solutions, please read the following
articles:
[ERROR] [Help 1] http://cwiki.apache.org/confluence/display/MAVEN/MojoFailureException
[ERROR] 
[ERROR] After correcting the problems, you can resume the build with the command
[ERROR]   mvn <goals> -rf :hbase-server
Build step 'Invoke top-level Maven targets' marked build as failure
Performing Post build task...
Match found for :.* : True
Logical operation result is TRUE
Running script  : # Run zombie detector script
./dev-support/zombie-detector.sh --jenkins ${BUILD_ID}
[yahoo-not-h2] $ /bin/bash -xe /tmp/hudson7738598266994654661.sh
+ ./dev-support/zombie-detector.sh --jenkins 1274
Fri Jul 22 11:26:18 UTC 2016 We're ok: there is no zombie test


    {color:green}+1 zombies{color}. No zombie tests found running at the end of the build.
POST BUILD TASK : SUCCESS
END OF POST BUILD TASK : 0
Archiving artifacts
Recording test results
[FINDBUGS] Skipping publisher since build result is FAILURE
[CHECKSTYLE] Skipping publisher since build result is FAILURE

Mime
View raw message