hbase-builds mailing list archives

Site index · List index
Message view « Date » · « Thread »
Top « Date » · « Thread »
From Apache Jenkins Server <jenk...@builds.apache.org>
Subject Build failed in Jenkins: HBase-Trunk_matrix » latest1.7,yahoo-not-h2 #1205
Date Sun, 10 Jul 2016 22:52:46 GMT
See <https://builds.apache.org/job/HBase-Trunk_matrix/jdk=latest1.7,label=yahoo-not-h2/1205/>

------------------------------------------
[...truncated 5536 lines...]
Tests run: 2, Failures: 0, Errors: 0, Skipped: 0, Time elapsed: 8.664 sec - in org.apache.hadoop.hbase.client.TestHTableMultiplexerFlushCache
Tests run: 1, Failures: 0, Errors: 0, Skipped: 0, Time elapsed: 28.081 sec - in org.apache.hadoop.hbase.client.TestLeaseRenewal
Tests run: 1, Failures: 0, Errors: 0, Skipped: 0, Time elapsed: 8.822 sec - in org.apache.hadoop.hbase.client.TestHTableMultiplexer
Running org.apache.hadoop.hbase.client.TestClientScannerRPCTimeout
Running org.apache.hadoop.hbase.client.TestIncrementFromClientSideWithCoprocessor
Running org.apache.hadoop.hbase.client.TestMultiParallel
Tests run: 1, Failures: 0, Errors: 0, Skipped: 0, Time elapsed: 12.089 sec - in org.apache.hadoop.hbase.client.TestClientScannerRPCTimeout
Tests run: 6, Failures: 0, Errors: 0, Skipped: 0, Time elapsed: 10.153 sec - in org.apache.hadoop.hbase.client.TestIncrementFromClientSideWithCoprocessor
Running org.apache.hadoop.hbase.client.TestMultipleTimestamps
Tests run: 9, Failures: 0, Errors: 0, Skipped: 0, Time elapsed: 54.833 sec - in org.apache.hadoop.hbase.client.TestSnapshotFromClient
Running org.apache.hadoop.hbase.client.TestClientTimeouts
Tests run: 1, Failures: 0, Errors: 0, Skipped: 0, Time elapsed: 2.54 sec - in org.apache.hadoop.hbase.client.TestClientTimeouts
Running org.apache.hadoop.hbase.client.TestResultSizeEstimation
Tests run: 8, Failures: 0, Errors: 0, Skipped: 0, Time elapsed: 14.035 sec - in org.apache.hadoop.hbase.client.TestMultipleTimestamps
Running org.apache.hadoop.hbase.client.TestTableSnapshotScanner
Tests run: 2, Failures: 0, Errors: 0, Skipped: 0, Time elapsed: 3.756 sec - in org.apache.hadoop.hbase.client.TestResultSizeEstimation
Running org.apache.hadoop.hbase.client.TestScannersFromClientSide
Running org.apache.hadoop.hbase.client.TestMultiRespectsLimits
Tests run: 8, Failures: 0, Errors: 0, Skipped: 0, Time elapsed: 15.33 sec - in org.apache.hadoop.hbase.client.TestScannersFromClientSide
Running org.apache.hadoop.hbase.client.TestSnapshotMetadata
Tests run: 2, Failures: 0, Errors: 0, Skipped: 0, Time elapsed: 26.124 sec - in org.apache.hadoop.hbase.client.TestMultiRespectsLimits
Running org.apache.hadoop.hbase.client.TestMetaCache
Tests run: 3, Failures: 0, Errors: 0, Skipped: 0, Time elapsed: 52.137 sec - in org.apache.hadoop.hbase.client.TestTableSnapshotScanner
Tests run: 2, Failures: 0, Errors: 0, Skipped: 0, Time elapsed: 7.762 sec - in org.apache.hadoop.hbase.client.TestMetaCache
Tests run: 12, Failures: 0, Errors: 0, Skipped: 0, Time elapsed: 136.69 sec - in org.apache.hadoop.hbase.client.TestMetaWithReplicas
Running org.apache.hadoop.hbase.client.TestTimestampsFilter
Tests run: 4, Failures: 0, Errors: 0, Skipped: 0, Time elapsed: 35.472 sec - in org.apache.hadoop.hbase.client.TestSnapshotMetadata
Running org.apache.hadoop.hbase.client.TestUpdateConfiguration
Tests run: 2, Failures: 0, Errors: 0, Skipped: 0, Time elapsed: 0.279 sec - in org.apache.hadoop.hbase.client.TestUpdateConfiguration
Running org.apache.hadoop.hbase.client.TestSnapshotFromClientWithRegionReplicas
Tests run: 3, Failures: 0, Errors: 0, Skipped: 0, Time elapsed: 10.709 sec - in org.apache.hadoop.hbase.client.TestTimestampsFilter
Running org.apache.hadoop.hbase.client.TestSplitOrMergeStatus
Running org.apache.hadoop.hbase.client.TestIncrementsFromClientSide
Running org.apache.hadoop.hbase.client.TestConnectionImplementation
Tests run: 2, Failures: 0, Errors: 0, Skipped: 0, Time elapsed: 2.104 sec - in org.apache.hadoop.hbase.client.TestConnectionImplementation
Tests run: 6, Failures: 0, Errors: 0, Skipped: 0, Time elapsed: 10.561 sec - in org.apache.hadoop.hbase.client.TestIncrementsFromClientSide
Running org.apache.hadoop.hbase.client.TestMobSnapshotFromClient
Tests run: 12, Failures: 0, Errors: 0, Skipped: 0, Time elapsed: 132.658 sec - in org.apache.hadoop.hbase.client.TestMultiParallel
Running org.apache.hadoop.hbase.client.TestCloneSnapshotFromClientWithRegionReplicas
Tests run: 4, Failures: 0, Errors: 0, Skipped: 0, Time elapsed: 31.76 sec - in org.apache.hadoop.hbase.client.TestSplitOrMergeStatus
Running org.apache.hadoop.hbase.client.TestShortCircuitConnection
Tests run: 9, Failures: 0, Errors: 0, Skipped: 0, Time elapsed: 54.662 sec - in org.apache.hadoop.hbase.client.TestSnapshotFromClientWithRegionReplicas
Tests run: 1, Failures: 0, Errors: 0, Skipped: 0, Time elapsed: 2.679 sec - in org.apache.hadoop.hbase.client.TestShortCircuitConnection
Running org.apache.hadoop.hbase.client.TestFromClientSide3
Running org.apache.hadoop.hbase.client.TestFastFail
Tests run: 2, Failures: 0, Errors: 0, Skipped: 1, Time elapsed: 3.872 sec - in org.apache.hadoop.hbase.client.TestFastFail
Running org.apache.hadoop.hbase.client.TestReplicasClient
Tests run: 9, Failures: 0, Errors: 0, Skipped: 0, Time elapsed: 72.677 sec - in org.apache.hadoop.hbase.client.TestMobSnapshotFromClient
Running org.apache.hadoop.hbase.client.TestAdmin2
Running org.apache.hadoop.hbase.client.TestSizeFailures
Tests run: 9, Failures: 0, Errors: 0, Skipped: 0, Time elapsed: 73.058 sec - in org.apache.hadoop.hbase.client.TestFromClientSide3
Running org.apache.hadoop.hbase.client.TestFromClientSideNoCodec
Tests run: 2, Failures: 0, Errors: 0, Skipped: 0, Time elapsed: 4.111 sec - in org.apache.hadoop.hbase.client.TestFromClientSideNoCodec
Running org.apache.hadoop.hbase.TestZooKeeper
Tests run: 5, Failures: 0, Errors: 0, Skipped: 0, Time elapsed: 138.068 sec - in org.apache.hadoop.hbase.client.TestCloneSnapshotFromClientWithRegionReplicas
Running org.apache.hadoop.hbase.TestStochasticBalancerJmxMetrics
Tests run: 1, Failures: 0, Errors: 0, Skipped: 1, Time elapsed: 0.001 sec - in org.apache.hadoop.hbase.TestStochasticBalancerJmxMetrics
Tests run: 2, Failures: 0, Errors: 0, Skipped: 0, Time elapsed: 48.153 sec - in org.apache.hadoop.hbase.client.TestSizeFailures
Running org.apache.hadoop.hbase.namespace.TestNamespaceAuditor
Running org.apache.hadoop.hbase.trace.TestHTraceHooks
Tests run: 1, Failures: 0, Errors: 0, Skipped: 0, Time elapsed: 2.626 sec - in org.apache.hadoop.hbase.trace.TestHTraceHooks
Running org.apache.hadoop.hbase.TestHBaseTestingUtility
Tests run: 26, Failures: 0, Errors: 0, Skipped: 0, Time elapsed: 91.843 sec - in org.apache.hadoop.hbase.client.TestAdmin2
Running org.apache.hadoop.hbase.zookeeper.TestHQuorumPeer
Tests run: 3, Failures: 0, Errors: 0, Skipped: 0, Time elapsed: 0.795 sec - in org.apache.hadoop.hbase.zookeeper.TestHQuorumPeer
Running org.apache.hadoop.hbase.zookeeper.TestRecoverableZooKeeper
Tests run: 1, Failures: 0, Errors: 0, Skipped: 0, Time elapsed: 1.183 sec - in org.apache.hadoop.hbase.zookeeper.TestRecoverableZooKeeper
Running org.apache.hadoop.hbase.zookeeper.TestZooKeeperNodeTracker
Tests run: 3, Failures: 0, Errors: 0, Skipped: 0, Time elapsed: 0.941 sec - in org.apache.hadoop.hbase.zookeeper.TestZooKeeperNodeTracker
Running org.apache.hadoop.hbase.zookeeper.TestZKMulti
Tests run: 12, Failures: 0, Errors: 0, Skipped: 0, Time elapsed: 1.546 sec - in org.apache.hadoop.hbase.zookeeper.TestZKMulti
Running org.apache.hadoop.hbase.zookeeper.TestZKLeaderManager
Tests run: 1, Failures: 0, Errors: 0, Skipped: 0, Time elapsed: 0.09 sec - in org.apache.hadoop.hbase.zookeeper.TestZKLeaderManager
Running org.apache.hadoop.hbase.zookeeper.lock.TestZKInterProcessReadWriteLock
Tests run: 6, Failures: 0, Errors: 0, Skipped: 0, Time elapsed: 24.474 sec - in org.apache.hadoop.hbase.zookeeper.lock.TestZKInterProcessReadWriteLock
Tests run: 13, Failures: 0, Errors: 0, Skipped: 0, Time elapsed: 53.003 sec - in org.apache.hadoop.hbase.TestHBaseTestingUtility
Running org.apache.hadoop.hbase.zookeeper.TestZooKeeperACL
Tests run: 7, Failures: 0, Errors: 0, Skipped: 0, Time elapsed: 0.369 sec - in org.apache.hadoop.hbase.zookeeper.TestZooKeeperACL
Running org.apache.hadoop.hbase.mapreduce.TestCellCounter
Running org.apache.hadoop.hbase.mapreduce.TestImportTSVWithOperationAttributes
Tests run: 2, Failures: 0, Errors: 0, Skipped: 0, Time elapsed: 24.179 sec - in org.apache.hadoop.hbase.mapreduce.TestImportTSVWithOperationAttributes
Tests run: 8, Failures: 0, Errors: 0, Skipped: 0, Time elapsed: 37.805 sec - in org.apache.hadoop.hbase.mapreduce.TestCellCounter
Running org.apache.hadoop.hbase.mapreduce.TestSecureLoadIncrementalHFilesSplitRecovery
Running org.apache.hadoop.hbase.mapreduce.TestTableInputFormat
Tests run: 12, Failures: 0, Errors: 0, Skipped: 0, Time elapsed: 127.022 sec - in org.apache.hadoop.hbase.namespace.TestNamespaceAuditor
Running org.apache.hadoop.hbase.mapreduce.TestHLogRecordReader
Tests run: 2, Failures: 0, Errors: 0, Skipped: 0, Time elapsed: 1.351 sec - in org.apache.hadoop.hbase.mapreduce.TestHLogRecordReader
Tests run: 8, Failures: 0, Errors: 0, Skipped: 0, Time elapsed: 16.484 sec - in org.apache.hadoop.hbase.mapreduce.TestTableInputFormat
Tests run: 10, Failures: 0, Errors: 0, Skipped: 0, Time elapsed: 161.87 sec - in org.apache.hadoop.hbase.TestZooKeeper
Running org.apache.hadoop.hbase.mapreduce.TestHRegionPartitioner
Tests run: 1, Failures: 0, Errors: 0, Skipped: 0, Time elapsed: 4.203 sec - in org.apache.hadoop.hbase.mapreduce.TestHRegionPartitioner
Running org.apache.hadoop.hbase.mapreduce.TestImportTsv
Running org.apache.hadoop.hbase.mapreduce.TestWALPlayer
Tests run: 6, Failures: 0, Errors: 0, Skipped: 0, Time elapsed: 35.611 sec - in org.apache.hadoop.hbase.mapreduce.TestSecureLoadIncrementalHFilesSplitRecovery
Running org.apache.hadoop.hbase.mapreduce.TestImportExport
Tests run: 14, Failures: 0, Errors: 0, Skipped: 0, Time elapsed: 262.299 sec - in org.apache.hadoop.hbase.client.TestReplicasClient
Tests run: 4, Failures: 0, Errors: 0, Skipped: 0, Time elapsed: 10.699 sec - in org.apache.hadoop.hbase.mapreduce.TestWALPlayer
Running org.apache.hadoop.hbase.mapreduce.TestRowCounter
Running org.apache.hadoop.hbase.mapreduce.TestImportTSVWithVisibilityLabels
Running org.apache.hadoop.hbase.mapreduce.TestHashTable
Tests run: 1, Failures: 0, Errors: 0, Skipped: 0, Time elapsed: 15.016 sec - in org.apache.hadoop.hbase.mapreduce.TestHashTable
Running org.apache.hadoop.hbase.mapreduce.TestImportTSVWithTTLs
Tests run: 1, Failures: 0, Errors: 0, Skipped: 0, Time elapsed: 12.888 sec - in org.apache.hadoop.hbase.mapreduce.TestImportTSVWithTTLs
Running org.apache.hadoop.hbase.mapreduce.TestHFileOutputFormat2
Tests run: 13, Failures: 0, Errors: 0, Skipped: 0, Time elapsed: 71.29 sec - in org.apache.hadoop.hbase.mapreduce.TestRowCounter
Running org.apache.hadoop.hbase.mapreduce.TestWALRecordReader
Tests run: 16, Failures: 0, Errors: 0, Skipped: 14, Time elapsed: 28.295 sec - in org.apache.hadoop.hbase.mapreduce.TestHFileOutputFormat2
Tests run: 2, Failures: 0, Errors: 0, Skipped: 0, Time elapsed: 1.481 sec - in org.apache.hadoop.hbase.mapreduce.TestWALRecordReader
Tests run: 12, Failures: 0, Errors: 0, Skipped: 0, Time elapsed: 87.299 sec - in org.apache.hadoop.hbase.mapreduce.TestImportExport
Running org.apache.hadoop.hbase.mapreduce.TestTableSnapshotInputFormat
Tests run: 7, Failures: 0, Errors: 0, Skipped: 0, Time elapsed: 75.999 sec - in org.apache.hadoop.hbase.mapreduce.TestImportTSVWithVisibilityLabels
Running org.apache.hadoop.hbase.mapreduce.TestTableInputFormatScan1
Running org.apache.hadoop.hbase.mapreduce.TestTimeRangeMapRed
Running org.apache.hadoop.hbase.mapreduce.TestMultiTableSnapshotInputFormat
Tests run: 1, Failures: 0, Errors: 0, Skipped: 0, Time elapsed: 8.382 sec - in org.apache.hadoop.hbase.mapreduce.TestTimeRangeMapRed
Running org.apache.hadoop.hbase.mapreduce.TestSyncTable
Tests run: 18, Failures: 0, Errors: 0, Skipped: 0, Time elapsed: 136.678 sec - in org.apache.hadoop.hbase.mapreduce.TestImportTsv
Running org.apache.hadoop.hbase.mapreduce.TestCopyTable
Tests run: 7, Failures: 0, Errors: 0, Skipped: 0, Time elapsed: 38.964 sec - in org.apache.hadoop.hbase.mapreduce.TestTableInputFormatScan1
Tests run: 4, Failures: 0, Errors: 0, Skipped: 0, Time elapsed: 36.742 sec - in org.apache.hadoop.hbase.mapreduce.TestMultiTableSnapshotInputFormat
Running org.apache.hadoop.hbase.io.TestFileLink
Tests run: 1, Failures: 0, Errors: 0, Skipped: 0, Time elapsed: 29.162 sec - in org.apache.hadoop.hbase.mapreduce.TestSyncTable
Running org.apache.hadoop.hbase.TestMetaTableAccessor
Running org.apache.hadoop.hbase.io.hfile.TestHFileBlockIndex
Tests run: 5, Failures: 0, Errors: 0, Skipped: 0, Time elapsed: 14.794 sec - in org.apache.hadoop.hbase.io.TestFileLink
Running org.apache.hadoop.hbase.io.hfile.TestSeekBeforeWithInlineBlocks
Tests run: 10, Failures: 0, Errors: 0, Skipped: 0, Time elapsed: 6.713 sec - in org.apache.hadoop.hbase.io.hfile.TestHFileBlockIndex
Running org.apache.hadoop.hbase.io.hfile.TestScannerSelectionUsingTTL
Tests run: 1, Failures: 0, Errors: 0, Skipped: 0, Time elapsed: 12.683 sec - in org.apache.hadoop.hbase.io.hfile.TestSeekBeforeWithInlineBlocks
Running org.apache.hadoop.hbase.io.hfile.TestHFileSeek
Tests run: 1, Failures: 0, Errors: 0, Skipped: 0, Time elapsed: 2.724 sec - in org.apache.hadoop.hbase.io.hfile.TestHFileSeek
Tests run: 15, Failures: 0, Errors: 0, Skipped: 0, Time elapsed: 25.798 sec - in org.apache.hadoop.hbase.TestMetaTableAccessor
Running org.apache.hadoop.hbase.io.hfile.TestHFileBlock
Running org.apache.hadoop.hbase.io.hfile.TestCacheConfig
Tests run: 7, Failures: 0, Errors: 0, Skipped: 0, Time elapsed: 2.733 sec - in org.apache.hadoop.hbase.io.hfile.TestCacheConfig
Running org.apache.hadoop.hbase.io.hfile.TestScannerFromBucketCache
Tests run: 5, Failures: 0, Errors: 0, Skipped: 0, Time elapsed: 57.159 sec - in org.apache.hadoop.hbase.mapreduce.TestCopyTable
Tests run: 4, Failures: 0, Errors: 0, Skipped: 0, Time elapsed: 5.081 sec - in org.apache.hadoop.hbase.io.hfile.TestScannerFromBucketCache
Running org.apache.hadoop.hbase.io.hfile.TestForceCacheImportantBlocks
Running org.apache.hadoop.hbase.io.hfile.TestCacheOnWrite
Tests run: 8, Failures: 0, Errors: 0, Skipped: 0, Time elapsed: 123.022 sec - in org.apache.hadoop.hbase.mapreduce.TestTableSnapshotInputFormat
Running org.apache.hadoop.hbase.io.encoding.TestEncodedSeekers
Tests run: 2, Failures: 0, Errors: 0, Skipped: 0, Time elapsed: 28.219 sec - in org.apache.hadoop.hbase.io.hfile.TestForceCacheImportantBlocks
Running org.apache.hadoop.hbase.io.encoding.TestDataBlockEncoders
Tests run: 6, Failures: 0, Errors: 0, Skipped: 0, Time elapsed: 63.412 sec - in org.apache.hadoop.hbase.io.hfile.TestScannerSelectionUsingTTL
Running org.apache.hadoop.hbase.io.encoding.TestBufferedDataBlockEncoder
Tests run: 2, Failures: 0, Errors: 0, Skipped: 0, Time elapsed: 16.76 sec - in org.apache.hadoop.hbase.io.encoding.TestBufferedDataBlockEncoder
Running org.apache.hadoop.hbase.io.asyncfs.TestFanOutOneBlockAsyncDFSOutput
Tests run: 28, Failures: 0, Errors: 0, Skipped: 0, Time elapsed: 92.218 sec - in org.apache.hadoop.hbase.io.hfile.TestHFileBlock
Running org.apache.hadoop.hbase.io.asyncfs.TestSaslFanOutOneBlockAsyncDFSOutput
Tests run: 56, Failures: 0, Errors: 0, Skipped: 0, Time elapsed: 56.79 sec - in org.apache.hadoop.hbase.io.encoding.TestDataBlockEncoders
Tests run: 5, Failures: 0, Errors: 0, Skipped: 0, Time elapsed: 31.585 sec - in org.apache.hadoop.hbase.io.asyncfs.TestFanOutOneBlockAsyncDFSOutput
Running org.apache.hadoop.hbase.filter.TestScanRowPrefix
Tests run: 1, Failures: 0, Errors: 0, Skipped: 0, Time elapsed: 5.633 sec - in org.apache.hadoop.hbase.filter.TestScanRowPrefix
Running org.apache.hadoop.hbase.filter.TestFilterWithScanLimits
Running org.apache.hadoop.hbase.filter.TestFilterWrapper
Tests run: 20, Failures: 0, Errors: 0, Skipped: 0, Time elapsed: 106.264 sec - in org.apache.hadoop.hbase.io.encoding.TestEncodedSeekers
Tests run: 1, Failures: 0, Errors: 0, Skipped: 0, Time elapsed: 3.634 sec - in org.apache.hadoop.hbase.filter.TestFilterWrapper
Running org.apache.hadoop.hbase.filter.TestFuzzyRowFilterEndToEnd
Running org.apache.hadoop.hbase.filter.TestFilterListOrOperatorWithBlkCnt
Tests run: 1, Failures: 0, Errors: 0, Skipped: 0, Time elapsed: 15.815 sec - in org.apache.hadoop.hbase.filter.TestFilterListOrOperatorWithBlkCnt
Tests run: 72, Failures: 0, Errors: 0, Skipped: 0, Time elapsed: 157.845 sec - in org.apache.hadoop.hbase.io.hfile.TestCacheOnWrite
Tests run: 1, Failures: 0, Errors: 0, Skipped: 0, Time elapsed: 52.505 sec - in org.apache.hadoop.hbase.filter.TestFilterWithScanLimits
Running org.apache.hadoop.hbase.filter.TestColumnRangeFilter
Running org.apache.hadoop.hbase.filter.TestFuzzyRowAndColumnRangeFilter
Running org.apache.hadoop.hbase.filter.TestMultiRowRangeFilter
Tests run: 1, Failures: 0, Errors: 0, Skipped: 0, Time elapsed: 2.662 sec - in org.apache.hadoop.hbase.filter.TestFuzzyRowAndColumnRangeFilter
Tests run: 1, Failures: 0, Errors: 0, Skipped: 0, Time elapsed: 6.616 sec - in org.apache.hadoop.hbase.filter.TestColumnRangeFilter
Tests run: 20, Failures: 0, Errors: 0, Skipped: 0, Time elapsed: 16.401 sec - in org.apache.hadoop.hbase.filter.TestMultiRowRangeFilter
Tests run: 36, Failures: 0, Errors: 0, Skipped: 0, Time elapsed: 108.316 sec - in org.apache.hadoop.hbase.io.asyncfs.TestSaslFanOutOneBlockAsyncDFSOutput
Tests run: 4, Failures: 0, Errors: 0, Skipped: 0, Time elapsed: 297.028 sec - in org.apache.hadoop.hbase.filter.TestFuzzyRowFilterEndToEnd

Results :

Tests in error: 
  TestProcedureAdmin.testAbortProcedureFailure:128->Object.wait:461->Object.wait:-2
» TestTimedOut

Tests run: 2071, Failures: 0, Errors: 1, Skipped: 24

[INFO] ------------------------------------------------------------------------
[INFO] Reactor Summary:
[INFO] 
[INFO] Apache HBase ...................................... SUCCESS [  2.585 s]
[INFO] Apache HBase - Checkstyle ......................... SUCCESS [  0.654 s]
[INFO] Apache HBase - Resource Bundle .................... SUCCESS [  0.193 s]
[INFO] Apache HBase - Annotations ........................ SUCCESS [  0.180 s]
[INFO] Apache HBase - Protocol ........................... SUCCESS [  2.969 s]
[INFO] Apache HBase - Common ............................. SUCCESS [01:29 min]
[INFO] Apache HBase - Procedure .......................... SUCCESS [01:34 min]
[INFO] Apache HBase - Client ............................. SUCCESS [ 41.235 s]
[INFO] Apache HBase - Hadoop Compatibility ............... SUCCESS [  7.459 s]
[INFO] Apache HBase - Hadoop Two Compatibility ........... SUCCESS [  9.454 s]
[INFO] Apache HBase - Prefix Tree ........................ SUCCESS [ 10.481 s]
[INFO] Apache HBase - Server ............................. FAILURE [  01:05 h]
[INFO] Apache HBase - Testing Util ....................... SKIPPED
[INFO] Apache HBase - Thrift ............................. SKIPPED
[INFO] Apache HBase - RSGroup ............................ SKIPPED
[INFO] Apache HBase - Shell .............................. SKIPPED
[INFO] Apache HBase - Integration Tests .................. SKIPPED
[INFO] Apache HBase - Examples ........................... SKIPPED
[INFO] Apache HBase - Rest ............................... SKIPPED
[INFO] Apache HBase - External Block Cache ............... SKIPPED
[INFO] Apache HBase - Spark .............................. SKIPPED
[INFO] Apache HBase - Assembly ........................... SKIPPED
[INFO] Apache HBase - Shaded ............................. SKIPPED
[INFO] Apache HBase - Shaded - Client .................... SKIPPED
[INFO] Apache HBase - Shaded - Server .................... SKIPPED
[INFO] Apache HBase - Archetypes ......................... SKIPPED
[INFO] Apache HBase - Exemplar for hbase-client archetype  SKIPPED
[INFO] Apache HBase - Exemplar for hbase-shaded-client archetype  SKIPPED
[INFO] Apache HBase - Archetype builder .................. SKIPPED
[INFO] ------------------------------------------------------------------------
[INFO] BUILD FAILURE
[INFO] ------------------------------------------------------------------------
[INFO] Total time: 01:09 h
[INFO] Finished at: 2016-07-10T22:51:00+00:00
[INFO] Final Memory: 70M/478M
[INFO] ------------------------------------------------------------------------
[ERROR] Failed to execute goal org.apache.maven.plugins:maven-surefire-plugin:2.18.1:test
(secondPartTestsExecution) on project hbase-server: There are test failures.
[ERROR] 
[ERROR] Please refer to <https://builds.apache.org/job/HBase-Trunk_matrix/jdk=latest1.7,label=yahoo-not-h2/ws/hbase-server/target/surefire-reports>
for the individual test results.
[ERROR] -> [Help 1]
[ERROR] 
[ERROR] To see the full stack trace of the errors, re-run Maven with the -e switch.
[ERROR] Re-run Maven using the -X switch to enable full debug logging.
[ERROR] 
[ERROR] For more information about the errors and possible solutions, please read the following
articles:
[ERROR] [Help 1] http://cwiki.apache.org/confluence/display/MAVEN/MojoFailureException
[ERROR] 
[ERROR] After correcting the problems, you can resume the build with the command
[ERROR]   mvn <goals> -rf :hbase-server
Build step 'Invoke top-level Maven targets' marked build as failure
Performing Post build task...
Match found for :.* : True
Logical operation result is TRUE
Running script  : # Run zombie detector script
./dev-support/zombie-detector.sh --jenkins ${BUILD_ID}
[yahoo-not-h2] $ /bin/bash -xe /tmp/hudson6198349429825908578.sh
+ ./dev-support/zombie-detector.sh --jenkins 1205
Sun Jul 10 22:51:01 UTC 2016 We're ok: there is no zombie test


    {color:green}+1 zombies{color}. No zombie tests found running at the end of the build.
POST BUILD TASK : SUCCESS
END OF POST BUILD TASK : 0
Archiving artifacts
Recording test results
[FINDBUGS] Skipping publisher since build result is FAILURE
[CHECKSTYLE] Skipping publisher since build result is FAILURE

Mime
View raw message