hbase-builds mailing list archives

Site index · List index
Message view « Date » · « Thread »
Top « Date » · « Thread »
From Apache Jenkins Server <jenk...@builds.apache.org>
Subject Build failed in Jenkins: HBase-Trunk_matrix » latest1.8,yahoo-not-h2 #1121
Date Mon, 27 Jun 2016 03:25:45 GMT
See <https://builds.apache.org/job/HBase-Trunk_matrix/jdk=latest1.8,label=yahoo-not-h2/1121/>

------------------------------------------
[...truncated 7139 lines...]
Tests run: 12, Failures: 0, Errors: 0, Skipped: 0, Time elapsed: 45.428 sec - in org.apache.hadoop.hbase.regionserver.wal.TestSecureWALReplay
Java HotSpot(TM) 64-Bit Server VM warning: ignoring option MaxPermSize=256m; support was removed
in 8.0
Running org.apache.hadoop.hbase.regionserver.wal.TestProtobufLog
Java HotSpot(TM) 64-Bit Server VM warning: ignoring option MaxPermSize=256m; support was removed
in 8.0
Tests run: 1, Failures: 0, Errors: 0, Skipped: 0, Time elapsed: 1.695 sec - in org.apache.hadoop.hbase.regionserver.wal.TestProtobufLog
Java HotSpot(TM) 64-Bit Server VM warning: ignoring option MaxPermSize=256m; support was removed
in 8.0
Java HotSpot(TM) 64-Bit Server VM warning: ignoring option MaxPermSize=256m; support was removed
in 8.0
Running org.apache.hadoop.hbase.regionserver.wal.TestDurability
Tests run: 6, Failures: 0, Errors: 0, Skipped: 0, Time elapsed: 3.14 sec - in org.apache.hadoop.hbase.regionserver.wal.TestDurability
Java HotSpot(TM) 64-Bit Server VM warning: ignoring option MaxPermSize=256m; support was removed
in 8.0
Java HotSpot(TM) 64-Bit Server VM warning: ignoring option MaxPermSize=256m; support was removed
in 8.0
Tests run: 12, Failures: 0, Errors: 0, Skipped: 0, Time elapsed: 44.205 sec - in org.apache.hadoop.hbase.regionserver.wal.TestWALReplay
Java HotSpot(TM) 64-Bit Server VM warning: ignoring option MaxPermSize=256m; support was removed
in 8.0
Java HotSpot(TM) 64-Bit Server VM warning: ignoring option MaxPermSize=256m; support was removed
in 8.0
Java HotSpot(TM) 64-Bit Server VM warning: ignoring option MaxPermSize=256m; support was removed
in 8.0
Running org.apache.hadoop.hbase.regionserver.wal.TestLogRollPeriod
Running org.apache.hadoop.hbase.regionserver.wal.TestAsyncWALReplay
Running org.apache.hadoop.hbase.regionserver.wal.TestSecureAsyncWALReplay
Tests run: 7, Failures: 0, Errors: 0, Skipped: 0, Time elapsed: 195.537 sec - in org.apache.hadoop.hbase.regionserver.TestRegionReplicas
Java HotSpot(TM) 64-Bit Server VM warning: ignoring option MaxPermSize=256m; support was removed
in 8.0
Tests run: 12, Failures: 0, Errors: 0, Skipped: 0, Time elapsed: 40.889 sec - in org.apache.hadoop.hbase.regionserver.wal.TestAsyncWALReplay
Java HotSpot(TM) 64-Bit Server VM warning: ignoring option MaxPermSize=256m; support was removed
in 8.0
Java HotSpot(TM) 64-Bit Server VM warning: ignoring option MaxPermSize=256m; support was removed
in 8.0
Running org.apache.hadoop.hbase.regionserver.wal.TestAsyncLogRollPeriod
Tests run: 12, Failures: 0, Errors: 0, Skipped: 0, Time elapsed: 42.995 sec - in org.apache.hadoop.hbase.regionserver.wal.TestSecureAsyncWALReplay
Java HotSpot(TM) 64-Bit Server VM warning: ignoring option MaxPermSize=256m; support was removed
in 8.0
Java HotSpot(TM) 64-Bit Server VM warning: ignoring option MaxPermSize=256m; support was removed
in 8.0
Tests run: 2, Failures: 0, Errors: 0, Skipped: 0, Time elapsed: 59.198 sec - in org.apache.hadoop.hbase.regionserver.wal.TestLogRollPeriod
Java HotSpot(TM) 64-Bit Server VM warning: ignoring option MaxPermSize=256m; support was removed
in 8.0
Java HotSpot(TM) 64-Bit Server VM warning: ignoring option MaxPermSize=256m; support was removed
in 8.0
Java HotSpot(TM) 64-Bit Server VM warning: ignoring option MaxPermSize=256m; support was removed
in 8.0
Running org.apache.hadoop.hbase.regionserver.TestScannerWithBulkload
Java HotSpot(TM) 64-Bit Server VM warning: ignoring option MaxPermSize=256m; support was removed
in 8.0
Running org.apache.hadoop.hbase.regionserver.throttle.TestCompactionWithThroughputController
Running org.apache.hadoop.hbase.regionserver.TestEncryptionRandomKeying
Tests run: 1, Failures: 0, Errors: 0, Skipped: 0, Time elapsed: 1.619 sec - in org.apache.hadoop.hbase.regionserver.TestEncryptionRandomKeying
Java HotSpot(TM) 64-Bit Server VM warning: ignoring option MaxPermSize=256m; support was removed
in 8.0
Running org.apache.hadoop.hbase.regionserver.TestDefaultMemStore
Tests run: 3, Failures: 0, Errors: 0, Skipped: 0, Time elapsed: 14.779 sec - in org.apache.hadoop.hbase.regionserver.TestScannerWithBulkload
Java HotSpot(TM) 64-Bit Server VM warning: ignoring option MaxPermSize=256m; support was removed
in 8.0
Running org.apache.hadoop.hbase.regionserver.TestMasterAddressTracker
Tests run: 5, Failures: 0, Errors: 0, Skipped: 0, Time elapsed: 0.872 sec - in org.apache.hadoop.hbase.regionserver.TestMasterAddressTracker
Java HotSpot(TM) 64-Bit Server VM warning: ignoring option MaxPermSize=256m; support was removed
in 8.0
Running org.apache.hadoop.hbase.regionserver.TestSplitTransactionOnCluster
Tests run: 23, Failures: 0, Errors: 0, Skipped: 0, Time elapsed: 23.935 sec - in org.apache.hadoop.hbase.regionserver.TestDefaultMemStore
Java HotSpot(TM) 64-Bit Server VM warning: ignoring option MaxPermSize=256m; support was removed
in 8.0
Running org.apache.hadoop.hbase.regionserver.TestParallelPut
Tests run: 2, Failures: 0, Errors: 0, Skipped: 0, Time elapsed: 5.029 sec - in org.apache.hadoop.hbase.regionserver.TestParallelPut
Java HotSpot(TM) 64-Bit Server VM warning: ignoring option MaxPermSize=256m; support was removed
in 8.0
Running org.apache.hadoop.hbase.regionserver.TestColumnSeeking
Tests run: 2, Failures: 0, Errors: 0, Skipped: 0, Time elapsed: 59.488 sec - in org.apache.hadoop.hbase.regionserver.wal.TestAsyncLogRollPeriod
Java HotSpot(TM) 64-Bit Server VM warning: ignoring option MaxPermSize=256m; support was removed
in 8.0
Tests run: 2, Failures: 0, Errors: 0, Skipped: 0, Time elapsed: 8.914 sec - in org.apache.hadoop.hbase.regionserver.TestColumnSeeking
Java HotSpot(TM) 64-Bit Server VM warning: ignoring option MaxPermSize=256m; support was removed
in 8.0
Java HotSpot(TM) 64-Bit Server VM warning: ignoring option MaxPermSize=256m; support was removed
in 8.0
Running org.apache.hadoop.hbase.regionserver.TestCorruptedRegionStoreFile
Running org.apache.hadoop.hbase.regionserver.TestRegionServerOnlineConfigChange
Tests run: 2, Failures: 0, Errors: 0, Skipped: 0, Time elapsed: 2.136 sec - in org.apache.hadoop.hbase.regionserver.TestRegionServerOnlineConfigChange
Java HotSpot(TM) 64-Bit Server VM warning: ignoring option MaxPermSize=256m; support was removed
in 8.0
Running org.apache.hadoop.hbase.regionserver.TestRegionIncrement
Tests run: 3, Failures: 0, Errors: 0, Skipped: 0, Time elapsed: 7.896 sec - in org.apache.hadoop.hbase.regionserver.TestRegionIncrement
Java HotSpot(TM) 64-Bit Server VM warning: ignoring option MaxPermSize=256m; support was removed
in 8.0
Java HotSpot(TM) 64-Bit Server VM warning: ignoring option MaxPermSize=256m; support was removed
in 8.0
Java HotSpot(TM) 64-Bit Server VM warning: ignoring option MaxPermSize=256m; support was removed
in 8.0
Running org.apache.hadoop.hbase.regionserver.TestCompaction
Tests run: 3, Failures: 0, Errors: 0, Skipped: 0, Time elapsed: 83.318 sec - in org.apache.hadoop.hbase.regionserver.throttle.TestCompactionWithThroughputController
Java HotSpot(TM) 64-Bit Server VM warning: ignoring option MaxPermSize=256m; support was removed
in 8.0
Java HotSpot(TM) 64-Bit Server VM warning: ignoring option MaxPermSize=256m; support was removed
in 8.0
Tests run: 6, Failures: 0, Errors: 0, Skipped: 0, Time elapsed: 12.679 sec - in org.apache.hadoop.hbase.regionserver.TestCompaction
Java HotSpot(TM) 64-Bit Server VM warning: ignoring option MaxPermSize=256m; support was removed
in 8.0
Running org.apache.hadoop.hbase.regionserver.TestRecoveredEdits
Running org.apache.hadoop.hbase.regionserver.TestRemoveRegionMetrics
Tests run: 1, Failures: 0, Errors: 0, Skipped: 0, Time elapsed: 7.387 sec - in org.apache.hadoop.hbase.regionserver.TestRecoveredEdits
Java HotSpot(TM) 64-Bit Server VM warning: ignoring option MaxPermSize=256m; support was removed
in 8.0
Running org.apache.hadoop.hbase.regionserver.TestGetClosestAtOrBefore
Tests run: 3, Failures: 0, Errors: 0, Skipped: 0, Time elapsed: 2.013 sec - in org.apache.hadoop.hbase.regionserver.TestGetClosestAtOrBefore
Java HotSpot(TM) 64-Bit Server VM warning: ignoring option MaxPermSize=256m; support was removed
in 8.0
Running org.apache.hadoop.hbase.regionserver.TestCompoundBloomFilter
Tests run: 15, Failures: 0, Errors: 0, Skipped: 0, Time elapsed: 94.581 sec - in org.apache.hadoop.hbase.regionserver.TestSplitTransactionOnCluster
Java HotSpot(TM) 64-Bit Server VM warning: ignoring option MaxPermSize=256m; support was removed
in 8.0
Running org.apache.hadoop.hbase.regionserver.TestRegionServerReportForDuty
Tests run: 2, Failures: 0, Errors: 0, Skipped: 0, Time elapsed: 99.501 sec - in org.apache.hadoop.hbase.regionserver.TestCorruptedRegionStoreFile
Java HotSpot(TM) 64-Bit Server VM warning: ignoring option MaxPermSize=256m; support was removed
in 8.0
Java HotSpot(TM) 64-Bit Server VM warning: ignoring option MaxPermSize=256m; support was removed
in 8.0
Tests run: 1, Failures: 0, Errors: 0, Skipped: 0, Time elapsed: 25.153 sec - in org.apache.hadoop.hbase.regionserver.TestRegionServerReportForDuty
Java HotSpot(TM) 64-Bit Server VM warning: ignoring option MaxPermSize=256m; support was removed
in 8.0
Java HotSpot(TM) 64-Bit Server VM warning: ignoring option MaxPermSize=256m; support was removed
in 8.0
Java HotSpot(TM) 64-Bit Server VM warning: ignoring option MaxPermSize=256m; support was removed
in 8.0
Java HotSpot(TM) 64-Bit Server VM warning: ignoring option MaxPermSize=256m; support was removed
in 8.0
Running org.apache.hadoop.hbase.regionserver.TestHRegion
Running org.apache.hadoop.hbase.regionserver.TestMobStoreScanner
Tests run: 5, Failures: 0, Errors: 0, Skipped: 0, Time elapsed: 284.199 sec - in org.apache.hadoop.hbase.regionserver.wal.TestLogRolling
Java HotSpot(TM) 64-Bit Server VM warning: ignoring option MaxPermSize=256m; support was removed
in 8.0
Java HotSpot(TM) 64-Bit Server VM warning: ignoring option MaxPermSize=256m; support was removed
in 8.0
Java HotSpot(TM) 64-Bit Server VM warning: ignoring option MaxPermSize=256m; support was removed
in 8.0
Java HotSpot(TM) 64-Bit Server VM warning: ignoring option MaxPermSize=256m; support was removed
in 8.0
Java HotSpot(TM) 64-Bit Server VM warning: ignoring option MaxPermSize=256m; support was removed
in 8.0
Running org.apache.hadoop.hbase.regionserver.compactions.TestCompactedHFilesDischarger
Tests run: 3, Failures: 0, Errors: 0, Skipped: 0, Time elapsed: 2.579 sec - in org.apache.hadoop.hbase.regionserver.compactions.TestCompactedHFilesDischarger
Java HotSpot(TM) 64-Bit Server VM warning: ignoring option MaxPermSize=256m; support was removed
in 8.0
Running org.apache.hadoop.hbase.regionserver.compactions.TestFIFOCompactionPolicy
Tests run: 6, Failures: 0, Errors: 0, Skipped: 0, Time elapsed: 45.549 sec - in org.apache.hadoop.hbase.regionserver.TestMobStoreScanner
Java HotSpot(TM) 64-Bit Server VM warning: ignoring option MaxPermSize=256m; support was removed
in 8.0
Running org.apache.hadoop.hbase.regionserver.TestAtomicOperation
Tests run: 4, Failures: 0, Errors: 0, Skipped: 0, Time elapsed: 48.405 sec - in org.apache.hadoop.hbase.regionserver.compactions.TestFIFOCompactionPolicy
Java HotSpot(TM) 64-Bit Server VM warning: ignoring option MaxPermSize=256m; support was removed
in 8.0
Java HotSpot(TM) 64-Bit Server VM warning: ignoring option MaxPermSize=256m; support was removed
in 8.0
Running org.apache.hadoop.hbase.regionserver.TestDeleteMobTable
Tests run: 8, Failures: 0, Errors: 0, Skipped: 0, Time elapsed: 39.803 sec - in org.apache.hadoop.hbase.regionserver.TestAtomicOperation
Java HotSpot(TM) 64-Bit Server VM warning: ignoring option MaxPermSize=256m; support was removed
in 8.0
Running org.apache.hadoop.hbase.regionserver.TestTimestampFilterSeekHint
Tests run: 1, Failures: 0, Errors: 0, Skipped: 0, Time elapsed: 160.664 sec - in org.apache.hadoop.hbase.regionserver.TestRemoveRegionMetrics
Java HotSpot(TM) 64-Bit Server VM warning: ignoring option MaxPermSize=256m; support was removed
in 8.0
Running org.apache.hadoop.hbase.regionserver.TestCompactingMemStore
Tests run: 3, Failures: 0, Errors: 0, Skipped: 0, Time elapsed: 161.885 sec - in org.apache.hadoop.hbase.regionserver.TestCompoundBloomFilter
Java HotSpot(TM) 64-Bit Server VM warning: ignoring option MaxPermSize=256m; support was removed
in 8.0
Java HotSpot(TM) 64-Bit Server VM warning: ignoring option MaxPermSize=256m; support was removed
in 8.0
Running org.apache.hadoop.hbase.regionserver.TestFSErrorsExposed
Tests run: 3, Failures: 0, Errors: 0, Skipped: 0, Time elapsed: 21.027 sec - in org.apache.hadoop.hbase.regionserver.TestDeleteMobTable
Java HotSpot(TM) 64-Bit Server VM warning: ignoring option MaxPermSize=256m; support was removed
in 8.0
Running org.apache.hadoop.hbase.regionserver.TestRSKilledWhenInitializing
Tests run: 2, Failures: 0, Errors: 0, Skipped: 0, Time elapsed: 24.007 sec - in org.apache.hadoop.hbase.regionserver.TestTimestampFilterSeekHint
Java HotSpot(TM) 64-Bit Server VM warning: ignoring option MaxPermSize=256m; support was removed
in 8.0
Java HotSpot(TM) 64-Bit Server VM warning: ignoring option MaxPermSize=256m; support was removed
in 8.0
Running org.apache.hadoop.hbase.regionserver.TestMultiColumnScanner
Tests run: 29, Failures: 0, Errors: 0, Skipped: 0, Time elapsed: 27.738 sec - in org.apache.hadoop.hbase.regionserver.TestCompactingMemStore
Java HotSpot(TM) 64-Bit Server VM warning: ignoring option MaxPermSize=256m; support was removed
in 8.0
Java HotSpot(TM) 64-Bit Server VM warning: ignoring option MaxPermSize=256m; support was removed
in 8.0
Java HotSpot(TM) 64-Bit Server VM warning: ignoring option MaxPermSize=256m; support was removed
in 8.0
Running org.apache.hadoop.hbase.regionserver.TestFlushRegionEntry
Tests run: 1, Failures: 0, Errors: 0, Skipped: 0, Time elapsed: 0.523 sec - in org.apache.hadoop.hbase.regionserver.TestFlushRegionEntry
Java HotSpot(TM) 64-Bit Server VM warning: ignoring option MaxPermSize=256m; support was removed
in 8.0
Running org.apache.hadoop.hbase.regionserver.TestStore
Tests run: 1, Failures: 0, Errors: 0, Skipped: 0, Time elapsed: 28.75 sec - in org.apache.hadoop.hbase.regionserver.TestRSKilledWhenInitializing
Tests run: 18, Failures: 0, Errors: 0, Skipped: 0, Time elapsed: 12.606 sec - in org.apache.hadoop.hbase.regionserver.TestStore
Java HotSpot(TM) 64-Bit Server VM warning: ignoring option MaxPermSize=256m; support was removed
in 8.0
Java HotSpot(TM) 64-Bit Server VM warning: ignoring option MaxPermSize=256m; support was removed
in 8.0
Java HotSpot(TM) 64-Bit Server VM warning: ignoring option MaxPermSize=256m; support was removed
in 8.0
Running org.apache.hadoop.hbase.TestMetaTableLocator
Tests run: 7, Failures: 0, Errors: 0, Skipped: 0, Time elapsed: 3.732 sec - in org.apache.hadoop.hbase.TestMetaTableLocator
Java HotSpot(TM) 64-Bit Server VM warning: ignoring option MaxPermSize=256m; support was removed
in 8.0
Java HotSpot(TM) 64-Bit Server VM warning: ignoring option MaxPermSize=256m; support was removed
in 8.0
Java HotSpot(TM) 64-Bit Server VM warning: ignoring option MaxPermSize=256m; support was removed
in 8.0
Java HotSpot(TM) 64-Bit Server VM warning: ignoring option MaxPermSize=256m; support was removed
in 8.0
Java HotSpot(TM) 64-Bit Server VM warning: ignoring option MaxPermSize=256m; support was removed
in 8.0
Tests run: 12, Failures: 0, Errors: 0, Skipped: 0, Time elapsed: 48.605 sec - in org.apache.hadoop.hbase.regionserver.TestMultiColumnScanner
Java HotSpot(TM) 64-Bit Server VM warning: ignoring option MaxPermSize=256m; support was removed
in 8.0
Running org.apache.hadoop.hbase.namespace.TestNamespaceAuditor
Java HotSpot(TM) 64-Bit Server VM warning: ignoring option MaxPermSize=256m; support was removed
in 8.0
Running org.apache.hadoop.hbase.TestStochasticBalancerJmxMetrics
Tests run: 1, Failures: 0, Errors: 0, Skipped: 1, Time elapsed: 0.001 sec - in org.apache.hadoop.hbase.TestStochasticBalancerJmxMetrics
Java HotSpot(TM) 64-Bit Server VM warning: ignoring option MaxPermSize=256m; support was removed
in 8.0
Tests run: 3, Failures: 0, Errors: 0, Skipped: 0, Time elapsed: 61.93 sec - in org.apache.hadoop.hbase.regionserver.TestFSErrorsExposed
Tests run: 12, Failures: 0, Errors: 0, Skipped: 0, Time elapsed: 154.809 sec - in org.apache.hadoop.hbase.namespace.TestNamespaceAuditor
Tests run: 66, Failures: 0, Errors: 1, Skipped: 0, Time elapsed: 600.002 sec <<<
FAILURE! - in org.apache.hadoop.hbase.regionserver.TestHRegion
org.apache.hadoop.hbase.regionserver.TestHRegion  Time elapsed: 545.745 sec  <<<
ERROR!
org.junit.runners.model.TestTimedOutException: test timed out after 10 minutes
	at java.lang.Object.wait(Native Method)
	at org.apache.hadoop.hbase.regionserver.MultiVersionConcurrencyControl.waitForRead(MultiVersionConcurrencyControl.java:218)
	at org.apache.hadoop.hbase.regionserver.MultiVersionConcurrencyControl.completeAndWait(MultiVersionConcurrencyControl.java:149)
	at org.apache.hadoop.hbase.regionserver.HRegion.getNextSequenceId(HRegion.java:2605)
	at org.apache.hadoop.hbase.regionserver.HRegion.internalPrepareFlushCache(HRegion.java:2322)
	at org.apache.hadoop.hbase.regionserver.HRegion.internalFlushcache(HRegion.java:2218)
	at org.apache.hadoop.hbase.regionserver.HRegion.internalFlushcache(HRegion.java:2189)
	at org.apache.hadoop.hbase.regionserver.HRegion.internalFlushcache(HRegion.java:2179)
	at org.apache.hadoop.hbase.regionserver.HRegion.doClose(HRegion.java:1485)
	at org.apache.hadoop.hbase.regionserver.HRegion.close(HRegion.java:1413)
	at org.apache.hadoop.hbase.regionserver.HRegion.close(HRegion.java:1363)
	at org.apache.hadoop.hbase.HBaseTestingUtility.closeRegionAndWAL(HBaseTestingUtility.java:370)
	at org.apache.hadoop.hbase.regionserver.TestHRegion.testFlushCacheWhileScanning(TestHRegion.java:3820)


Results :

Tests in error: 
  TestHRegion.testFlushCacheWhileScanning:3820->Object.wait:-2 » TestTimedOut te...

Tests run: 2626, Failures: 0, Errors: 1, Skipped: 49

[INFO] ------------------------------------------------------------------------
[INFO] Reactor Summary:
[INFO] 
[INFO] Apache HBase ...................................... SUCCESS [  2.732 s]
[INFO] Apache HBase - Checkstyle ......................... SUCCESS [  0.475 s]
[INFO] Apache HBase - Resource Bundle .................... SUCCESS [  0.130 s]
[INFO] Apache HBase - Annotations ........................ SUCCESS [  0.136 s]
[INFO] Apache HBase - Protocol ........................... SUCCESS [  2.432 s]
[INFO] Apache HBase - Common ............................. SUCCESS [01:26 min]
[INFO] Apache HBase - Procedure .......................... SUCCESS [01:39 min]
[INFO] Apache HBase - Client ............................. SUCCESS [ 35.694 s]
[INFO] Apache HBase - Hadoop Compatibility ............... SUCCESS [  7.449 s]
[INFO] Apache HBase - Hadoop Two Compatibility ........... SUCCESS [  9.120 s]
[INFO] Apache HBase - Prefix Tree ........................ SUCCESS [  8.257 s]
[INFO] Apache HBase - Server ............................. FAILURE [  01:40 h]
[INFO] Apache HBase - Testing Util ....................... SKIPPED
[INFO] Apache HBase - Thrift ............................. SKIPPED
[INFO] Apache HBase - RSGroup ............................ SKIPPED
[INFO] Apache HBase - Shell .............................. SKIPPED
[INFO] Apache HBase - Integration Tests .................. SKIPPED
[INFO] Apache HBase - Examples ........................... SKIPPED
[INFO] Apache HBase - Rest ............................... SKIPPED
[INFO] Apache HBase - External Block Cache ............... SKIPPED
[INFO] Apache HBase - Spark .............................. SKIPPED
[INFO] Apache HBase - Assembly ........................... SKIPPED
[INFO] Apache HBase - Shaded ............................. SKIPPED
[INFO] Apache HBase - Shaded - Client .................... SKIPPED
[INFO] Apache HBase - Shaded - Server .................... SKIPPED
[INFO] Apache HBase - Archetypes ......................... SKIPPED
[INFO] Apache HBase - Exemplar for hbase-client archetype  SKIPPED
[INFO] Apache HBase - Exemplar for hbase-shaded-client archetype  SKIPPED
[INFO] Apache HBase - Archetype builder .................. SKIPPED
[INFO] ------------------------------------------------------------------------
[INFO] BUILD FAILURE
[INFO] ------------------------------------------------------------------------
[INFO] Total time: 01:44 h
[INFO] Finished at: 2016-06-27T03:22:51+00:00
[INFO] Final Memory: 70M/3447M
[INFO] ------------------------------------------------------------------------
[ERROR] Failed to execute goal org.apache.maven.plugins:maven-surefire-plugin:2.18.1:test
(secondPartTestsExecution) on project hbase-server: There are test failures.
[ERROR] 
[ERROR] Please refer to <https://builds.apache.org/job/HBase-Trunk_matrix/jdk=latest1.8,label=yahoo-not-h2/ws/hbase-server/target/surefire-reports>
for the individual test results.
[ERROR] -> [Help 1]
[ERROR] 
[ERROR] To see the full stack trace of the errors, re-run Maven with the -e switch.
[ERROR] Re-run Maven using the -X switch to enable full debug logging.
[ERROR] 
[ERROR] For more information about the errors and possible solutions, please read the following
articles:
[ERROR] [Help 1] http://cwiki.apache.org/confluence/display/MAVEN/MojoFailureException
[ERROR] 
[ERROR] After correcting the problems, you can resume the build with the command
[ERROR]   mvn <goals> -rf :hbase-server
Build step 'Invoke top-level Maven targets' marked build as failure
Performing Post build task...
Match found for :.* : True
Logical operation result is TRUE
Running script  : # Run zombie detector script
./dev-support/zombie-detector.sh --jenkins ${BUILD_ID}
[yahoo-not-h2] $ /bin/bash -xe /tmp/hudson8860502383888192820.sh
+ ./dev-support/zombie-detector.sh --jenkins 1121
Mon Jun 27 03:22:52 UTC 2016 We're ok: there is no zombie test


    {color:green}+1 zombies{color}. No zombie tests found running at the end of the build.
POST BUILD TASK : SUCCESS
END OF POST BUILD TASK : 0
Archiving artifacts
Recording test results
[FINDBUGS] Skipping publisher since build result is FAILURE
[CHECKSTYLE] Skipping publisher since build result is FAILURE

Mime
View raw message