hbase-builds mailing list archives

Site index · List index
Message view « Date » · « Thread »
Top « Date » · « Thread »
From Apache Jenkins Server <jenk...@builds.apache.org>
Subject Build failed in Jenkins: HBase-1.4 » latest1.8,yahoo-not-h2 #220
Date Fri, 17 Jun 2016 05:30:12 GMT
See <https://builds.apache.org/job/HBase-1.4/jdk=latest1.8,label=yahoo-not-h2/220/changes>

Changes:

[tedyu] HBASE-5291 Addendum 2 passes correct path to deleteRecursively

------------------------------------------
[...truncated 49269 lines...]
Java HotSpot(TM) 64-Bit Server VM warning: ignoring option MaxPermSize=256m; support was removed
in 8.0
Tests run: 1, Failures: 0, Errors: 0, Skipped: 0, Time elapsed: 39.673 sec - in org.apache.hadoop.hbase.replication.TestMultiSlaveReplication
Java HotSpot(TM) 64-Bit Server VM warning: ignoring option MaxPermSize=256m; support was removed
in 8.0
Running org.apache.hadoop.hbase.replication.TestReplicationTrackerZKImpl
Tests run: 5, Failures: 0, Errors: 0, Skipped: 0, Time elapsed: 1.017 sec - in org.apache.hadoop.hbase.replication.TestReplicationTrackerZKImpl
Java HotSpot(TM) 64-Bit Server VM warning: ignoring option MaxPermSize=256m; support was removed
in 8.0
Running org.apache.hadoop.hbase.replication.TestReplicationDisableInactivePeer
Running org.apache.hadoop.hbase.replication.TestReplicationEndpoint
Tests run: 4, Failures: 0, Errors: 0, Skipped: 0, Time elapsed: 9.325 sec - in org.apache.hadoop.hbase.replication.TestReplicationEndpoint
Java HotSpot(TM) 64-Bit Server VM warning: ignoring option MaxPermSize=256m; support was removed
in 8.0
Tests run: 1, Failures: 0, Errors: 0, Skipped: 0, Time elapsed: 20.365 sec - in org.apache.hadoop.hbase.replication.TestReplicationDisableInactivePeer
Java HotSpot(TM) 64-Bit Server VM warning: ignoring option MaxPermSize=256m; support was removed
in 8.0
Java HotSpot(TM) 64-Bit Server VM warning: ignoring option MaxPermSize=256m; support was removed
in 8.0
Running org.apache.hadoop.hbase.coprocessor.TestMasterCoprocessorExceptionWithRemove
Tests run: 1, Failures: 0, Errors: 0, Skipped: 0, Time elapsed: 6.269 sec - in org.apache.hadoop.hbase.coprocessor.TestMasterCoprocessorExceptionWithRemove
Java HotSpot(TM) 64-Bit Server VM warning: ignoring option MaxPermSize=256m; support was removed
in 8.0
Tests run: 13, Failures: 0, Errors: 0, Skipped: 0, Time elapsed: 70.484 sec - in org.apache.hadoop.hbase.replication.TestReplicationSmallTests
Running org.apache.hadoop.hbase.replication.TestReplicationSyncUpToolWithBulkLoadedData
Java HotSpot(TM) 64-Bit Server VM warning: ignoring option MaxPermSize=256m; support was removed
in 8.0
Running org.apache.hadoop.hbase.coprocessor.TestWALObserver
Running org.apache.hadoop.hbase.coprocessor.TestRegionObserverInterface
Tests run: 7, Failures: 0, Errors: 0, Skipped: 0, Time elapsed: 8.338 sec - in org.apache.hadoop.hbase.coprocessor.TestWALObserver
Java HotSpot(TM) 64-Bit Server VM warning: ignoring option MaxPermSize=256m; support was removed
in 8.0
Tests run: 8, Failures: 0, Errors: 0, Skipped: 0, Time elapsed: 203.708 sec - in org.apache.hadoop.hbase.replication.regionserver.TestReplicationWALReaderManager
Java HotSpot(TM) 64-Bit Server VM warning: ignoring option MaxPermSize=256m; support was removed
in 8.0
Running org.apache.hadoop.hbase.coprocessor.TestRegionServerObserver
Running org.apache.hadoop.hbase.coprocessor.TestBatchCoprocessorEndpoint
Tests run: 4, Failures: 0, Errors: 0, Skipped: 0, Time elapsed: 2.092 sec - in org.apache.hadoop.hbase.coprocessor.TestBatchCoprocessorEndpoint
Java HotSpot(TM) 64-Bit Server VM warning: ignoring option MaxPermSize=256m; support was removed
in 8.0
Java HotSpot(TM) 64-Bit Server VM warning: ignoring option MaxPermSize=256m; support was removed
in 8.0
Tests run: 1, Failures: 0, Errors: 0, Skipped: 0, Time elapsed: 37.416 sec - in org.apache.hadoop.hbase.replication.TestReplicationSyncUpToolWithBulkLoadedData
Java HotSpot(TM) 64-Bit Server VM warning: ignoring option MaxPermSize=256m; support was removed
in 8.0
Tests run: 1, Failures: 0, Errors: 0, Skipped: 0, Time elapsed: 16.348 sec - in org.apache.hadoop.hbase.coprocessor.TestRegionServerObserver
Java HotSpot(TM) 64-Bit Server VM warning: ignoring option MaxPermSize=256m; support was removed
in 8.0
Running org.apache.hadoop.hbase.coprocessor.TestRegionObserverForAddingMutationsFromCoprocessors
Running org.apache.hadoop.hbase.coprocessor.TestDoubleColumnInterpreter
Running org.apache.hadoop.hbase.coprocessor.TestHTableWrapper
Tests run: 5, Failures: 0, Errors: 0, Skipped: 0, Time elapsed: 9.418 sec - in org.apache.hadoop.hbase.coprocessor.TestRegionObserverForAddingMutationsFromCoprocessors
Java HotSpot(TM) 64-Bit Server VM warning: ignoring option MaxPermSize=256m; support was removed
in 8.0
Java HotSpot(TM) 64-Bit Server VM warning: ignoring option MaxPermSize=256m; support was removed
in 8.0
Java HotSpot(TM) 64-Bit Server VM warning: ignoring option MaxPermSize=256m; support was removed
in 8.0
Tests run: 38, Failures: 0, Errors: 0, Skipped: 0, Time elapsed: 4.776 sec - in org.apache.hadoop.hbase.coprocessor.TestDoubleColumnInterpreter
Java HotSpot(TM) 64-Bit Server VM warning: ignoring option MaxPermSize=256m; support was removed
in 8.0
Running org.apache.hadoop.hbase.coprocessor.TestRegionObserverScannerOpenHook
Tests run: 1, Failures: 0, Errors: 0, Skipped: 0, Time elapsed: 7.44 sec - in org.apache.hadoop.hbase.coprocessor.TestHTableWrapper
Java HotSpot(TM) 64-Bit Server VM warning: ignoring option MaxPermSize=256m; support was removed
in 8.0
Running org.apache.hadoop.hbase.coprocessor.TestAggregateProtocol
Running org.apache.hadoop.hbase.coprocessor.TestCoprocessorStop
Tests run: 3, Failures: 0, Errors: 0, Skipped: 0, Time elapsed: 14.537 sec - in org.apache.hadoop.hbase.coprocessor.TestRegionObserverScannerOpenHook
Java HotSpot(TM) 64-Bit Server VM warning: ignoring option MaxPermSize=256m; support was removed
in 8.0
Java HotSpot(TM) 64-Bit Server VM warning: ignoring option MaxPermSize=256m; support was removed
in 8.0
Tests run: 44, Failures: 0, Errors: 0, Skipped: 0, Time elapsed: 5.623 sec - in org.apache.hadoop.hbase.coprocessor.TestAggregateProtocol
Java HotSpot(TM) 64-Bit Server VM warning: ignoring option MaxPermSize=256m; support was removed
in 8.0
Running org.apache.hadoop.hbase.coprocessor.TestMasterCoprocessorExceptionWithAbort
Running org.apache.hadoop.hbase.coprocessor.TestMasterObserver
Tests run: 7, Failures: 0, Errors: 0, Skipped: 0, Time elapsed: 155.984 sec - in org.apache.hadoop.hbase.replication.TestMasterReplication
Java HotSpot(TM) 64-Bit Server VM warning: ignoring option MaxPermSize=256m; support was removed
in 8.0
Tests run: 14, Failures: 0, Errors: 0, Skipped: 2, Time elapsed: 76.295 sec - in org.apache.hadoop.hbase.coprocessor.TestRegionObserverInterface
Java HotSpot(TM) 64-Bit Server VM warning: ignoring option MaxPermSize=256m; support was removed
in 8.0
Tests run: 1, Failures: 0, Errors: 0, Skipped: 0, Time elapsed: 17.097 sec - in org.apache.hadoop.hbase.coprocessor.TestCoprocessorStop
Java HotSpot(TM) 64-Bit Server VM warning: ignoring option MaxPermSize=256m; support was removed
in 8.0
Running org.apache.hadoop.hbase.coprocessor.TestRegionServerCoprocessorExceptionWithAbort
Running org.apache.hadoop.hbase.coprocessor.TestOpenTableInCoprocessor
Running org.apache.hadoop.hbase.coprocessor.TestRegionServerCoprocessorEndpoint
Tests run: 1, Failures: 0, Errors: 0, Skipped: 0, Time elapsed: 18.498 sec - in org.apache.hadoop.hbase.coprocessor.TestMasterCoprocessorExceptionWithAbort
Java HotSpot(TM) 64-Bit Server VM warning: ignoring option MaxPermSize=256m; support was removed
in 8.0
Tests run: 2, Failures: 0, Errors: 0, Skipped: 0, Time elapsed: 1.466 sec - in org.apache.hadoop.hbase.coprocessor.TestRegionServerCoprocessorEndpoint
Java HotSpot(TM) 64-Bit Server VM warning: ignoring option MaxPermSize=256m; support was removed
in 8.0
Running org.apache.hadoop.hbase.coprocessor.TestCoprocessorTableEndpoint
Tests run: 2, Failures: 0, Errors: 0, Skipped: 0, Time elapsed: 24.969 sec - in org.apache.hadoop.hbase.coprocessor.TestRegionServerCoprocessorExceptionWithAbort
Java HotSpot(TM) 64-Bit Server VM warning: ignoring option MaxPermSize=256m; support was removed
in 8.0
Running org.apache.hadoop.hbase.coprocessor.TestCoprocessorEndpoint
Tests run: 6, Failures: 0, Errors: 0, Skipped: 0, Time elapsed: 1.942 sec - in org.apache.hadoop.hbase.coprocessor.TestCoprocessorEndpoint
Java HotSpot(TM) 64-Bit Server VM warning: ignoring option MaxPermSize=256m; support was removed
in 8.0
Tests run: 2, Failures: 0, Errors: 0, Skipped: 0, Time elapsed: 19.451 sec - in org.apache.hadoop.hbase.coprocessor.TestOpenTableInCoprocessor
Java HotSpot(TM) 64-Bit Server VM warning: ignoring option MaxPermSize=256m; support was removed
in 8.0
Tests run: 2, Failures: 0, Errors: 0, Skipped: 0, Time elapsed: 11.119 sec - in org.apache.hadoop.hbase.coprocessor.TestCoprocessorTableEndpoint
Java HotSpot(TM) 64-Bit Server VM warning: ignoring option MaxPermSize=256m; support was removed
in 8.0
Running org.apache.hadoop.hbase.coprocessor.TestBigDecimalColumnInterpreter
Tests run: 9, Failures: 0, Errors: 0, Skipped: 0, Time elapsed: 42.47 sec - in org.apache.hadoop.hbase.coprocessor.TestMasterObserver
Java HotSpot(TM) 64-Bit Server VM warning: ignoring option MaxPermSize=256m; support was removed
in 8.0
Running org.apache.hadoop.hbase.coprocessor.TestIncrementTimeRange
Running org.apache.hadoop.hbase.coprocessor.TestClassLoading
Tests run: 38, Failures: 0, Errors: 0, Skipped: 0, Time elapsed: 5.803 sec - in org.apache.hadoop.hbase.coprocessor.TestBigDecimalColumnInterpreter
Java HotSpot(TM) 64-Bit Server VM warning: ignoring option MaxPermSize=256m; support was removed
in 8.0
Tests run: 1, Failures: 0, Errors: 0, Skipped: 0, Time elapsed: 6.411 sec - in org.apache.hadoop.hbase.coprocessor.TestIncrementTimeRange
Java HotSpot(TM) 64-Bit Server VM warning: ignoring option MaxPermSize=256m; support was removed
in 8.0
Running org.apache.hadoop.hbase.TestStochasticBalancerJmxMetrics
Tests run: 1, Failures: 0, Errors: 0, Skipped: 1, Time elapsed: 0.001 sec - in org.apache.hadoop.hbase.TestStochasticBalancerJmxMetrics
Java HotSpot(TM) 64-Bit Server VM warning: ignoring option MaxPermSize=256m; support was removed
in 8.0
Running org.apache.hadoop.hbase.coprocessor.TestRegionObserverBypass
Running org.apache.hadoop.hbase.coprocessor.TestRowProcessorEndpoint
Tests run: 2, Failures: 0, Errors: 0, Skipped: 0, Time elapsed: 7.396 sec - in org.apache.hadoop.hbase.coprocessor.TestRegionObserverBypass
Java HotSpot(TM) 64-Bit Server VM warning: ignoring option MaxPermSize=256m; support was removed
in 8.0
Running org.apache.hadoop.hbase.coprocessor.TestRegionServerCoprocessorExceptionWithRemove
Running org.apache.hadoop.hbase.TestMetaTableLocator
Running org.apache.hadoop.hbase.TestJMXListener
Tests run: 7, Failures: 0, Errors: 0, Skipped: 0, Time elapsed: 3.263 sec - in org.apache.hadoop.hbase.TestMetaTableLocator
Java HotSpot(TM) 64-Bit Server VM warning: ignoring option MaxPermSize=256m; support was removed
in 8.0
Running org.apache.hadoop.hbase.TestHBaseTestingUtility
Tests run: 4, Failures: 0, Errors: 0, Skipped: 0, Time elapsed: 19.151 sec - in org.apache.hadoop.hbase.coprocessor.TestRowProcessorEndpoint
Java HotSpot(TM) 64-Bit Server VM warning: ignoring option MaxPermSize=256m; support was removed
in 8.0
Tests run: 1, Failures: 0, Errors: 0, Skipped: 0, Time elapsed: 15.868 sec - in org.apache.hadoop.hbase.coprocessor.TestRegionServerCoprocessorExceptionWithRemove
Tests run: 9, Failures: 0, Errors: 0, Skipped: 0, Time elapsed: 30.133 sec - in org.apache.hadoop.hbase.coprocessor.TestClassLoading
Tests run: 2, Failures: 0, Errors: 0, Skipped: 0, Time elapsed: 16.552 sec - in org.apache.hadoop.hbase.TestJMXListener
Running org.apache.hadoop.hbase.namespace.TestNamespaceAuditor
Tests run: 11, Failures: 0, Errors: 0, Skipped: 0, Time elapsed: 64.276 sec - in org.apache.hadoop.hbase.TestHBaseTestingUtility
Tests run: 12, Failures: 0, Errors: 0, Skipped: 1, Time elapsed: 106.905 sec - in org.apache.hadoop.hbase.namespace.TestNamespaceAuditor

Results :

Failed tests: 
org.apache.hadoop.hbase.regionserver.TestHRegion.testFlushSizeAccounting(org.apache.hadoop.hbase.regionserver.TestHRegion)
  Run 1: TestHRegion.testFlushSizeAccounting:465 expected:<384> but was:<368>
  Run 2: TestHRegion.testFlushSizeAccounting:465 expected:<384> but was:<368>
  Run 3: TestHRegion.testFlushSizeAccounting:465 expected:<384> but was:<368>

org.apache.hadoop.hbase.regionserver.TestHRegion.testMemstoreSizeAccountingWithFailedPostBatchMutate(org.apache.hadoop.hbase.regionserver.TestHRegion)
  Run 1: TestHRegion.testMemstoreSizeAccountingWithFailedPostBatchMutate:434 memstoreSize
should be incremented expected:<448> but was:<432>
  Run 2: TestHRegion.testMemstoreSizeAccountingWithFailedPostBatchMutate:434 memstoreSize
should be incremented expected:<448> but was:<432>
  Run 3: TestHRegion.testMemstoreSizeAccountingWithFailedPostBatchMutate:434 memstoreSize
should be incremented expected:<448> but was:<432>

Flaked tests: 
org.apache.hadoop.hbase.master.TestTableLockManager.testReapAllTableLocks(org.apache.hadoop.hbase.master.TestTableLockManager)
  Run 1: TestTableLockManager.testReapAllTableLocks:283 » LockTimeout Timed out acquiri...
  Run 2: TestTableLockManager.testReapAllTableLocks:283 » LockTimeout Timed out acquiri...
  Run 3: PASS


Tests run: 2567, Failures: 2, Errors: 0, Skipped: 56, Flakes: 1

[INFO] ------------------------------------------------------------------------
[INFO] Reactor Summary:
[INFO] 
[INFO] Apache HBase ...................................... SUCCESS [51.317s]
[INFO] Apache HBase - Checkstyle ......................... SUCCESS [4.352s]
[INFO] Apache HBase - Resource Bundle .................... SUCCESS [0.143s]
[INFO] Apache HBase - Annotations ........................ SUCCESS [0.929s]
[INFO] Apache HBase - Protocol ........................... SUCCESS [15.389s]
[INFO] Apache HBase - Common ............................. SUCCESS [1:54.016s]
[INFO] Apache HBase - Procedure .......................... SUCCESS [3:11.316s]
[INFO] Apache HBase - Client ............................. SUCCESS [1:18.811s]
[INFO] Apache HBase - Hadoop Compatibility ............... SUCCESS [8.027s]
[INFO] Apache HBase - Hadoop Two Compatibility ........... SUCCESS [10.225s]
[INFO] Apache HBase - Prefix Tree ........................ SUCCESS [7.732s]
[INFO] Apache HBase - Server ............................. FAILURE [1:18:43.216s]
[INFO] Apache HBase - Testing Util ....................... SKIPPED
[INFO] Apache HBase - Thrift ............................. SKIPPED
[INFO] Apache HBase - Rest ............................... SKIPPED
[INFO] Apache HBase - Shell .............................. SKIPPED
[INFO] Apache HBase - Integration Tests .................. SKIPPED
[INFO] Apache HBase - Examples ........................... SKIPPED
[INFO] Apache HBase - External Block Cache ............... SKIPPED
[INFO] Apache HBase - Assembly ........................... SKIPPED
[INFO] Apache HBase - Shaded ............................. SKIPPED
[INFO] Apache HBase - Shaded - Client .................... SKIPPED
[INFO] Apache HBase - Shaded - Server .................... SKIPPED
[INFO] ------------------------------------------------------------------------
[INFO] BUILD FAILURE
[INFO] ------------------------------------------------------------------------
[INFO] Total time: 1:27:01.423s
[INFO] Finished at: Fri Jun 17 05:27:33 UTC 2016
[INFO] Final Memory: 97M/714M
[INFO] ------------------------------------------------------------------------
[ERROR] Failed to execute goal org.apache.maven.plugins:maven-surefire-plugin:2.18.1:test
(secondPartTestsExecution) on project hbase-server: There are test failures.
[ERROR] 
[ERROR] Please refer to <https://builds.apache.org/job/HBase-1.4/jdk=latest1.8,label=yahoo-not-h2/ws/hbase-server/target/surefire-reports>
for the individual test results.
[ERROR] -> [Help 1]
[ERROR] 
[ERROR] To see the full stack trace of the errors, re-run Maven with the -e switch.
[ERROR] Re-run Maven using the -X switch to enable full debug logging.
[ERROR] 
[ERROR] For more information about the errors and possible solutions, please read the following
articles:
[ERROR] [Help 1] http://cwiki.apache.org/confluence/display/MAVEN/MojoFailureException
[ERROR] 
[ERROR] After correcting the problems, you can resume the build with the command
[ERROR]   mvn <goals> -rf :hbase-server
Build step 'Invoke top-level Maven targets' marked build as failure
Performing Post build task...
Match found for :.* : True
Logical operation result is TRUE
Running script  : # Post-build task script. TODO: Check this in and have all builds reference
check-in.
pwd && ls
# NOTE!!!! The below code has been copied and pasted from ./dev-tools/run-test.sh
# Do not change here without syncing there and vice-versa.
ZOMBIE_TESTS_COUNT=`jps -v | grep surefirebooter | grep -e '-Dhbase.test' | wc -l`
if [[ $ZOMBIE_TESTS_COUNT != 0 ]] ; then
 echo "Suspicious java process found - waiting 30s to see if there are just slow to stop"
 sleep 30
 ZOMBIE_TESTS_COUNT=`jps -v | grep surefirebooter | grep -e '-Dhbase.test' | wc -l`
 if [[ $ZOMBIE_TESTS_COUNT != 0 ]] ; then
   echo " {color:red}There appear to be $ZOMBIE_TESTS_COUNT zombie tests{color}, they should
have been killed by surefire but survived"
   jps -v | grep surefirebooter | grep -e '-Dhbase.test'
   jps -v | grep surefirebooter | grep -e '-Dhbase.test' | cut -d ' ' -f 1 | xargs -n 1 jstack
   # Exit with error
   exit 1
 else
   echo "We're ok: there is no zombie test, but some tests took some time to stop"
 fi
else
  echo "We're ok: there is no zombie test"
fi
[yahoo-not-h2] $ /bin/bash -xe /tmp/hudson3727370151310054382.sh
+ pwd
<https://builds.apache.org/job/HBase-1.4/jdk=latest1.8,label=yahoo-not-h2/ws/>
+ ls
bin
CHANGES.txt
conf
dev-support
hbase-annotations
hbase-assembly
hbase-checkstyle
hbase-client
hbase-common
hbase-examples
hbase-external-blockcache
hbase-hadoop2-compat
hbase-hadoop-compat
hbase-it
hbase-native-client
hbase-prefix-tree
hbase-procedure
hbase-protocol
hbase-resource-bundle
hbase-rest
hbase-server
hbase-shaded
hbase-shell
hbase-testing-util
hbase-thrift
LICENSE.txt
NOTICE.txt
pom.xml
README.txt
src
target
++ jps -v
++ grep surefirebooter
++ grep -e -Dhbase.test
++ wc -l
+ ZOMBIE_TESTS_COUNT=0
+ [[ 0 != 0 ]]
+ echo 'We'\''re ok: there is no zombie test'
We're ok: there is no zombie test
POST BUILD TASK : SUCCESS
END OF POST BUILD TASK : 0
Archiving artifacts
Recording test results

Mime
View raw message