hbase-builds mailing list archives

Site index · List index
Message view « Date » · « Thread »
Top « Date » · « Thread »
From Apache Jenkins Server <jenk...@builds.apache.org>
Subject Build failed in Jenkins: HBase-Trunk_matrix » latest1.8,yahoo-not-h2 #1055
Date Thu, 16 Jun 2016 03:16:49 GMT
See <https://builds.apache.org/job/HBase-Trunk_matrix/jdk=latest1.8,label=yahoo-not-h2/1055/changes>

Changes:

[tedyu] HBASE-5291 Addendum removes duplicate spnego (Josh Elser)

[appy] HBASE-16038 Ignore JVM crashes or machine shutdown failures in

[apurtell] HBASE-15977 Failed variable substitution on home page

------------------------------------------
[...truncated 7181 lines...]
Java HotSpot(TM) 64-Bit Server VM warning: ignoring option MaxPermSize=256m; support was removed
in 8.0
Java HotSpot(TM) 64-Bit Server VM warning: ignoring option MaxPermSize=256m; support was removed
in 8.0
Running org.apache.hadoop.hbase.io.TestFileLink
Tests run: 3, Failures: 0, Errors: 0, Skipped: 0, Time elapsed: 268.971 sec - in org.apache.hadoop.hbase.io.encoding.TestChangingEncoding
Java HotSpot(TM) 64-Bit Server VM warning: ignoring option MaxPermSize=256m; support was removed
in 8.0
Tests run: 72, Failures: 0, Errors: 0, Skipped: 0, Time elapsed: 153.957 sec - in org.apache.hadoop.hbase.io.hfile.TestCacheOnWrite
Java HotSpot(TM) 64-Bit Server VM warning: ignoring option MaxPermSize=256m; support was removed
in 8.0
Java HotSpot(TM) 64-Bit Server VM warning: ignoring option MaxPermSize=256m; support was removed
in 8.0
Running org.apache.hadoop.hbase.io.asyncfs.TestSaslFanOutOneBlockAsyncDFSOutput
Tests run: 5, Failures: 0, Errors: 0, Skipped: 0, Time elapsed: 21.876 sec - in org.apache.hadoop.hbase.io.TestFileLink
Java HotSpot(TM) 64-Bit Server VM warning: ignoring option MaxPermSize=256m; support was removed
in 8.0
Java HotSpot(TM) 64-Bit Server VM warning: ignoring option MaxPermSize=256m; support was removed
in 8.0
Java HotSpot(TM) 64-Bit Server VM warning: ignoring option MaxPermSize=256m; support was removed
in 8.0
Running org.apache.hadoop.hbase.io.asyncfs.TestFanOutOneBlockAsyncDFSOutput
Tests run: 28, Failures: 0, Errors: 0, Skipped: 0, Time elapsed: 90.96 sec - in org.apache.hadoop.hbase.io.hfile.TestHFileBlock
Java HotSpot(TM) 64-Bit Server VM warning: ignoring option MaxPermSize=256m; support was removed
in 8.0
Java HotSpot(TM) 64-Bit Server VM warning: ignoring option MaxPermSize=256m; support was removed
in 8.0
Java HotSpot(TM) 64-Bit Server VM warning: ignoring option MaxPermSize=256m; support was removed
in 8.0
Java HotSpot(TM) 64-Bit Server VM warning: ignoring option MaxPermSize=256m; support was removed
in 8.0
Java HotSpot(TM) 64-Bit Server VM warning: ignoring option MaxPermSize=256m; support was removed
in 8.0
Running org.apache.hadoop.hbase.constraint.TestConstraint
Running org.apache.hadoop.hbase.filter.TestFuzzyRowAndColumnRangeFilter
Tests run: 1, Failures: 0, Errors: 0, Skipped: 0, Time elapsed: 3.278 sec - in org.apache.hadoop.hbase.filter.TestFuzzyRowAndColumnRangeFilter
Java HotSpot(TM) 64-Bit Server VM warning: ignoring option MaxPermSize=256m; support was removed
in 8.0
Java HotSpot(TM) 64-Bit Server VM warning: ignoring option MaxPermSize=256m; support was removed
in 8.0
Tests run: 5, Failures: 0, Errors: 0, Skipped: 0, Time elapsed: 22.829 sec - in org.apache.hadoop.hbase.constraint.TestConstraint
Java HotSpot(TM) 64-Bit Server VM warning: ignoring option MaxPermSize=256m; support was removed
in 8.0
Java HotSpot(TM) 64-Bit Server VM warning: ignoring option MaxPermSize=256m; support was removed
in 8.0
Java HotSpot(TM) 64-Bit Server VM warning: ignoring option MaxPermSize=256m; support was removed
in 8.0
Java HotSpot(TM) 64-Bit Server VM warning: ignoring option MaxPermSize=256m; support was removed
in 8.0
Java HotSpot(TM) 64-Bit Server VM warning: ignoring option MaxPermSize=256m; support was removed
in 8.0
Running org.apache.hadoop.hbase.filter.TestFuzzyRowFilterEndToEnd
Tests run: 5, Failures: 0, Errors: 0, Skipped: 0, Time elapsed: 40.921 sec - in org.apache.hadoop.hbase.io.asyncfs.TestFanOutOneBlockAsyncDFSOutput
Java HotSpot(TM) 64-Bit Server VM warning: ignoring option MaxPermSize=256m; support was removed
in 8.0
Running org.apache.hadoop.hbase.filter.TestMultiRowRangeFilter
Running org.apache.hadoop.hbase.filter.TestFilterWithScanLimits
Tests run: 4, Failures: 0, Errors: 0, Skipped: 0, Time elapsed: 511.108 sec - in org.apache.hadoop.hbase.master.balancer.TestStochasticLoadBalancer2
Java HotSpot(TM) 64-Bit Server VM warning: ignoring option MaxPermSize=256m; support was removed
in 8.0
Java HotSpot(TM) 64-Bit Server VM warning: ignoring option MaxPermSize=256m; support was removed
in 8.0
Java HotSpot(TM) 64-Bit Server VM warning: ignoring option MaxPermSize=256m; support was removed
in 8.0
Java HotSpot(TM) 64-Bit Server VM warning: ignoring option MaxPermSize=256m; support was removed
in 8.0
Java HotSpot(TM) 64-Bit Server VM warning: ignoring option MaxPermSize=256m; support was removed
in 8.0
Java HotSpot(TM) 64-Bit Server VM warning: ignoring option MaxPermSize=256m; support was removed
in 8.0
Tests run: 36, Failures: 0, Errors: 0, Skipped: 0, Time elapsed: 79.901 sec - in org.apache.hadoop.hbase.io.asyncfs.TestSaslFanOutOneBlockAsyncDFSOutput
Java HotSpot(TM) 64-Bit Server VM warning: ignoring option MaxPermSize=256m; support was removed
in 8.0
Java HotSpot(TM) 64-Bit Server VM warning: ignoring option MaxPermSize=256m; support was removed
in 8.0
Java HotSpot(TM) 64-Bit Server VM warning: ignoring option MaxPermSize=256m; support was removed
in 8.0
Java HotSpot(TM) 64-Bit Server VM warning: ignoring option MaxPermSize=256m; support was removed
in 8.0
Java HotSpot(TM) 64-Bit Server VM warning: ignoring option MaxPermSize=256m; support was removed
in 8.0
Java HotSpot(TM) 64-Bit Server VM warning: ignoring option MaxPermSize=256m; support was removed
in 8.0
Java HotSpot(TM) 64-Bit Server VM warning: ignoring option MaxPermSize=256m; support was removed
in 8.0
Java HotSpot(TM) 64-Bit Server VM warning: ignoring option MaxPermSize=256m; support was removed
in 8.0
Java HotSpot(TM) 64-Bit Server VM warning: ignoring option MaxPermSize=256m; support was removed
in 8.0
Running org.apache.hadoop.hbase.filter.TestScanRowPrefix
Java HotSpot(TM) 64-Bit Server VM warning: ignoring option MaxPermSize=256m; support was removed
in 8.0
Java HotSpot(TM) 64-Bit Server VM warning: ignoring option MaxPermSize=256m; support was removed
in 8.0
Tests run: 20, Failures: 0, Errors: 0, Skipped: 0, Time elapsed: 21.931 sec - in org.apache.hadoop.hbase.filter.TestMultiRowRangeFilter
Java HotSpot(TM) 64-Bit Server VM warning: ignoring option MaxPermSize=256m; support was removed
in 8.0
Tests run: 1, Failures: 0, Errors: 0, Skipped: 0, Time elapsed: 7.557 sec - in org.apache.hadoop.hbase.filter.TestScanRowPrefix
Java HotSpot(TM) 64-Bit Server VM warning: ignoring option MaxPermSize=256m; support was removed
in 8.0
Java HotSpot(TM) 64-Bit Server VM warning: ignoring option MaxPermSize=256m; support was removed
in 8.0
Java HotSpot(TM) 64-Bit Server VM warning: ignoring option MaxPermSize=256m; support was removed
in 8.0
Running org.apache.hadoop.hbase.TestGlobalMemStoreSize
Running org.apache.hadoop.hbase.filter.TestFilterWrapper
Running org.apache.hadoop.hbase.filter.TestFilterListOrOperatorWithBlkCnt
Tests run: 1, Failures: 0, Errors: 0, Skipped: 0, Time elapsed: 5.197 sec - in org.apache.hadoop.hbase.filter.TestFilterWrapper
Java HotSpot(TM) 64-Bit Server VM warning: ignoring option MaxPermSize=256m; support was removed
in 8.0
Running org.apache.hadoop.hbase.TestHBaseOnOtherDfsCluster
Tests run: 1, Failures: 0, Errors: 0, Skipped: 0, Time elapsed: 16.365 sec - in org.apache.hadoop.hbase.TestGlobalMemStoreSize
Java HotSpot(TM) 64-Bit Server VM warning: ignoring option MaxPermSize=256m; support was removed
in 8.0
Tests run: 1, Failures: 0, Errors: 0, Skipped: 0, Time elapsed: 13.218 sec - in org.apache.hadoop.hbase.filter.TestFilterListOrOperatorWithBlkCnt
Java HotSpot(TM) 64-Bit Server VM warning: ignoring option MaxPermSize=256m; support was removed
in 8.0
Java HotSpot(TM) 64-Bit Server VM warning: ignoring option MaxPermSize=256m; support was removed
in 8.0
Running org.apache.hadoop.hbase.tool.TestCanaryTool
Tests run: 1, Failures: 0, Errors: 0, Skipped: 0, Time elapsed: 52.178 sec - in org.apache.hadoop.hbase.filter.TestFilterWithScanLimits
Java HotSpot(TM) 64-Bit Server VM warning: ignoring option MaxPermSize=256m; support was removed
in 8.0
Java HotSpot(TM) 64-Bit Server VM warning: ignoring option MaxPermSize=256m; support was removed
in 8.0
Java HotSpot(TM) 64-Bit Server VM warning: ignoring option MaxPermSize=256m; support was removed
in 8.0
Java HotSpot(TM) 64-Bit Server VM warning: ignoring option MaxPermSize=256m; support was removed
in 8.0
Java HotSpot(TM) 64-Bit Server VM warning: ignoring option MaxPermSize=256m; support was removed
in 8.0
Tests run: 1, Failures: 0, Errors: 0, Skipped: 0, Time elapsed: 15.413 sec - in org.apache.hadoop.hbase.TestHBaseOnOtherDfsCluster
Java HotSpot(TM) 64-Bit Server VM warning: ignoring option MaxPermSize=256m; support was removed
in 8.0
Java HotSpot(TM) 64-Bit Server VM warning: ignoring option MaxPermSize=256m; support was removed
in 8.0
Running org.apache.hadoop.hbase.TestNamespace
Running org.apache.hadoop.hbase.replication.TestReplicationSource
Tests run: 1, Failures: 0, Errors: 0, Skipped: 0, Time elapsed: 0.681 sec - in org.apache.hadoop.hbase.replication.TestReplicationSource
Java HotSpot(TM) 64-Bit Server VM warning: ignoring option MaxPermSize=256m; support was removed
in 8.0
Running org.apache.hadoop.hbase.replication.TestReplicationWithTags
Running org.apache.hadoop.hbase.replication.TestPerTableCFReplication
Tests run: 1, Failures: 0, Errors: 0, Skipped: 0, Time elapsed: 4 sec - in org.apache.hadoop.hbase.replication.TestReplicationWithTags
Java HotSpot(TM) 64-Bit Server VM warning: ignoring option MaxPermSize=256m; support was removed
in 8.0
Tests run: 4, Failures: 0, Errors: 0, Skipped: 0, Time elapsed: 45.795 sec - in org.apache.hadoop.hbase.tool.TestCanaryTool
Java HotSpot(TM) 64-Bit Server VM warning: ignoring option MaxPermSize=256m; support was removed
in 8.0
Tests run: 8, Failures: 0, Errors: 0, Skipped: 0, Time elapsed: 38.25 sec - in org.apache.hadoop.hbase.TestNamespace
Java HotSpot(TM) 64-Bit Server VM warning: ignoring option MaxPermSize=256m; support was removed
in 8.0
Running org.apache.hadoop.hbase.replication.TestMultiSlaveReplication
Running org.apache.hadoop.hbase.replication.TestReplicationSmallTests
Running org.apache.hadoop.hbase.replication.TestReplicationSyncUpToolWithBulkLoadedData
Tests run: 3, Failures: 0, Errors: 0, Skipped: 0, Time elapsed: 41.769 sec - in org.apache.hadoop.hbase.replication.TestPerTableCFReplication
Java HotSpot(TM) 64-Bit Server VM warning: ignoring option MaxPermSize=256m; support was removed
in 8.0
Tests run: 1, Failures: 0, Errors: 0, Skipped: 0, Time elapsed: 38.353 sec - in org.apache.hadoop.hbase.replication.TestMultiSlaveReplication
Java HotSpot(TM) 64-Bit Server VM warning: ignoring option MaxPermSize=256m; support was removed
in 8.0
Running org.apache.hadoop.hbase.replication.regionserver.TestReplicationWALReaderManager
Running org.apache.hadoop.hbase.replication.TestReplicationKillSlaveRS
Tests run: 1, Failures: 0, Errors: 0, Skipped: 0, Time elapsed: 52.614 sec - in org.apache.hadoop.hbase.replication.TestReplicationSyncUpToolWithBulkLoadedData
Java HotSpot(TM) 64-Bit Server VM warning: ignoring option MaxPermSize=256m; support was removed
in 8.0
Java HotSpot(TM) 64-Bit Server VM warning: ignoring option MaxPermSize=256m; support was removed
in 8.0
Tests run: 1, Failures: 0, Errors: 0, Skipped: 0, Time elapsed: 21.025 sec - in org.apache.hadoop.hbase.replication.TestReplicationKillSlaveRS
Java HotSpot(TM) 64-Bit Server VM warning: ignoring option MaxPermSize=256m; support was removed
in 8.0
Running org.apache.hadoop.hbase.replication.regionserver.TestReplicationSourceManager
Tests run: 7, Failures: 0, Errors: 0, Skipped: 0, Time elapsed: 4.559 sec - in org.apache.hadoop.hbase.replication.regionserver.TestReplicationSourceManager
Java HotSpot(TM) 64-Bit Server VM warning: ignoring option MaxPermSize=256m; support was removed
in 8.0
Running org.apache.hadoop.hbase.replication.regionserver.TestRegionReplicaReplicationEndpointNoMaster
Running org.apache.hadoop.hbase.replication.regionserver.TestReplicationSink
Tests run: 14, Failures: 0, Errors: 0, Skipped: 0, Time elapsed: 94.567 sec - in org.apache.hadoop.hbase.replication.TestReplicationSmallTests
Java HotSpot(TM) 64-Bit Server VM warning: ignoring option MaxPermSize=256m; support was removed
in 8.0
Tests run: 6, Failures: 0, Errors: 0, Skipped: 0, Time elapsed: 5.464 sec - in org.apache.hadoop.hbase.replication.regionserver.TestReplicationSink
Java HotSpot(TM) 64-Bit Server VM warning: ignoring option MaxPermSize=256m; support was removed
in 8.0
Java HotSpot(TM) 64-Bit Server VM warning: ignoring option MaxPermSize=256m; support was removed
in 8.0
Java HotSpot(TM) 64-Bit Server VM warning: ignoring option MaxPermSize=256m; support was removed
in 8.0
Running org.apache.hadoop.hbase.replication.regionserver.TestRegionReplicaReplicationEndpoint
Running org.apache.hadoop.hbase.replication.multiwal.TestReplicationKillMasterRSCompressedWithMultipleWAL
Tests run: 4, Failures: 0, Errors: 0, Skipped: 0, Time elapsed: 45.174 sec - in org.apache.hadoop.hbase.replication.regionserver.TestRegionReplicaReplicationEndpointNoMaster
Java HotSpot(TM) 64-Bit Server VM warning: ignoring option MaxPermSize=256m; support was removed
in 8.0
Running org.apache.hadoop.hbase.replication.multiwal.TestReplicationKillMasterRSCompressedWithMultipleAsyncWAL
Tests run: 1, Failures: 0, Errors: 0, Skipped: 0, Time elapsed: 16.198 sec - in org.apache.hadoop.hbase.replication.multiwal.TestReplicationKillMasterRSCompressedWithMultipleAsyncWAL
Java HotSpot(TM) 64-Bit Server VM warning: ignoring option MaxPermSize=256m; support was removed
in 8.0
Running org.apache.hadoop.hbase.replication.multiwal.TestReplicationEndpointWithMultipleWAL
Tests run: 1, Failures: 0, Errors: 0, Skipped: 0, Time elapsed: 81.49 sec - in org.apache.hadoop.hbase.replication.multiwal.TestReplicationKillMasterRSCompressedWithMultipleWAL
Java HotSpot(TM) 64-Bit Server VM warning: ignoring option MaxPermSize=256m; support was removed
in 8.0
Tests run: 4, Failures: 0, Errors: 0, Skipped: 0, Time elapsed: 14.952 sec - in org.apache.hadoop.hbase.replication.multiwal.TestReplicationEndpointWithMultipleWAL
Java HotSpot(TM) 64-Bit Server VM warning: ignoring option MaxPermSize=256m; support was removed
in 8.0
Running org.apache.hadoop.hbase.replication.multiwal.TestReplicationSyncUpToolWithMultipleAsyncWAL
Running org.apache.hadoop.hbase.replication.multiwal.TestReplicationEndpointWithMultipleAsyncWAL
Tests run: 9, Failures: 0, Errors: 0, Skipped: 0, Time elapsed: 145.99 sec - in org.apache.hadoop.hbase.replication.regionserver.TestRegionReplicaReplicationEndpoint
Java HotSpot(TM) 64-Bit Server VM warning: ignoring option MaxPermSize=256m; support was removed
in 8.0
Tests run: 4, Failures: 0, Errors: 0, Skipped: 0, Time elapsed: 9.581 sec - in org.apache.hadoop.hbase.replication.multiwal.TestReplicationEndpointWithMultipleAsyncWAL
Java HotSpot(TM) 64-Bit Server VM warning: ignoring option MaxPermSize=256m; support was removed
in 8.0
Running org.apache.hadoop.hbase.replication.TestReplicationStateZKImpl
Tests run: 9, Failures: 0, Errors: 0, Skipped: 0, Time elapsed: 1.602 sec - in org.apache.hadoop.hbase.replication.TestReplicationStateZKImpl
Java HotSpot(TM) 64-Bit Server VM warning: ignoring option MaxPermSize=256m; support was removed
in 8.0
Running org.apache.hadoop.hbase.replication.multiwal.TestReplicationSyncUpToolWithMultipleWAL
Tests run: 8, Failures: 0, Errors: 0, Skipped: 0, Time elapsed: 261.278 sec - in org.apache.hadoop.hbase.replication.regionserver.TestReplicationWALReaderManager
Java HotSpot(TM) 64-Bit Server VM warning: ignoring option MaxPermSize=256m; support was removed
in 8.0
Tests run: 1, Failures: 0, Errors: 0, Skipped: 0, Time elapsed: 60.945 sec - in org.apache.hadoop.hbase.replication.multiwal.TestReplicationSyncUpToolWithMultipleAsyncWAL
Java HotSpot(TM) 64-Bit Server VM warning: ignoring option MaxPermSize=256m; support was removed
in 8.0
Running org.apache.hadoop.hbase.replication.TestReplicationEndpoint
Java HotSpot(TM) 64-Bit Server VM warning: ignoring option MaxPermSize=256m; support was removed
in 8.0
Tests run: 4, Failures: 0, Errors: 0, Skipped: 0, Time elapsed: 15.006 sec - in org.apache.hadoop.hbase.replication.TestReplicationEndpoint
Java HotSpot(TM) 64-Bit Server VM warning: ignoring option MaxPermSize=256m; support was removed
in 8.0
Running org.apache.hadoop.hbase.replication.TestReplicationTrackerZKImpl
Running org.apache.hadoop.hbase.replication.TestReplicationStateHBaseImpl
Tests run: 5, Failures: 0, Errors: 0, Skipped: 0, Time elapsed: 1.043 sec - in org.apache.hadoop.hbase.replication.TestReplicationTrackerZKImpl
Java HotSpot(TM) 64-Bit Server VM warning: ignoring option MaxPermSize=256m; support was removed
in 8.0
Tests run: 4, Failures: 0, Errors: 0, Skipped: 0, Time elapsed: 7.116 sec - in org.apache.hadoop.hbase.replication.TestReplicationStateHBaseImpl
Java HotSpot(TM) 64-Bit Server VM warning: ignoring option MaxPermSize=256m; support was removed
in 8.0
Running org.apache.hadoop.hbase.replication.TestReplicationSyncUpTool
Tests run: 4, Failures: 0, Errors: 0, Skipped: 0, Time elapsed: 481.962 sec - in org.apache.hadoop.hbase.filter.TestFuzzyRowFilterEndToEnd
Running org.apache.hadoop.hbase.replication.TestReplicationKillMasterRSCompressed
Tests run: 1, Failures: 0, Errors: 0, Skipped: 0, Time elapsed: 66.827 sec - in org.apache.hadoop.hbase.replication.multiwal.TestReplicationSyncUpToolWithMultipleWAL
Running org.apache.hadoop.hbase.replication.TestReplicationDisableInactivePeer
Tests run: 1, Failures: 0, Errors: 0, Skipped: 0, Time elapsed: 19.772 sec - in org.apache.hadoop.hbase.replication.TestReplicationKillMasterRSCompressed
Tests run: 1, Failures: 0, Errors: 0, Skipped: 0, Time elapsed: 19.973 sec - in org.apache.hadoop.hbase.replication.TestReplicationDisableInactivePeer
Tests run: 1, Failures: 0, Errors: 0, Skipped: 0, Time elapsed: 58.044 sec - in org.apache.hadoop.hbase.replication.TestReplicationSyncUpTool

Results :

Tests in error: 
org.apache.hadoop.hbase.client.TestMobSnapshotCloneIndependence.testOnlineSnapshotAppendIndependent(org.apache.hadoop.hbase.client.TestMobSnapshotCloneIndependence)
  Run 1: TestMobSnapshotCloneIndependence>TestSnapshotCloneIndependence.setup:133->createTable:64
» Runtime
  Run 2: TestMobSnapshotCloneIndependence>TestSnapshotCloneIndependence.tearDown:142 »
TableNotFound

  TestTableMapReduce>TestTableMapReduceBase.testMultiRegionTable:99->runTestOnTable:90
» IO
  TestPerColumnFamilyFlush.testCompareStoreFileCount:619->doPut:558 » TestTimedOut
  TestPerColumnFamilyFlush.testFlushingWhenLogRolling:466 » IllegalState A mini-...
  TestPerColumnFamilyFlush.testLogReplayWithDistributedLogSplit:430->doTestLogReplay:342
» IllegalState

Tests run: 2490, Failures: 0, Errors: 5, Skipped: 33

[INFO] ------------------------------------------------------------------------
[INFO] Reactor Summary:
[INFO] 
[INFO] Apache HBase ...................................... SUCCESS [  2.492 s]
[INFO] Apache HBase - Checkstyle ......................... SUCCESS [  0.491 s]
[INFO] Apache HBase - Resource Bundle .................... SUCCESS [  0.151 s]
[INFO] Apache HBase - Annotations ........................ SUCCESS [  0.180 s]
[INFO] Apache HBase - Protocol ........................... SUCCESS [  2.446 s]
[INFO] Apache HBase - Common ............................. SUCCESS [01:28 min]
[INFO] Apache HBase - Procedure .......................... SUCCESS [01:38 min]
[INFO] Apache HBase - Client ............................. SUCCESS [ 36.520 s]
[INFO] Apache HBase - Hadoop Compatibility ............... SUCCESS [  7.543 s]
[INFO] Apache HBase - Hadoop Two Compatibility ........... SUCCESS [  9.183 s]
[INFO] Apache HBase - Prefix Tree ........................ SUCCESS [  8.167 s]
[INFO] Apache HBase - Server ............................. FAILURE [  01:24 h]
[INFO] Apache HBase - Testing Util ....................... SKIPPED
[INFO] Apache HBase - Thrift ............................. SKIPPED
[INFO] Apache HBase - RSGroup ............................ SKIPPED
[INFO] Apache HBase - Shell .............................. SKIPPED
[INFO] Apache HBase - Integration Tests .................. SKIPPED
[INFO] Apache HBase - Examples ........................... SKIPPED
[INFO] Apache HBase - Rest ............................... SKIPPED
[INFO] Apache HBase - External Block Cache ............... SKIPPED
[INFO] Apache HBase - Spark .............................. SKIPPED
[INFO] Apache HBase - Assembly ........................... SKIPPED
[INFO] Apache HBase - Shaded ............................. SKIPPED
[INFO] Apache HBase - Shaded - Client .................... SKIPPED
[INFO] Apache HBase - Shaded - Server .................... SKIPPED
[INFO] Apache HBase - Archetypes ......................... SKIPPED
[INFO] Apache HBase - Exemplar for hbase-client archetype  SKIPPED
[INFO] Apache HBase - Exemplar for hbase-shaded-client archetype  SKIPPED
[INFO] Apache HBase - Archetype builder .................. SKIPPED
[INFO] ------------------------------------------------------------------------
[INFO] BUILD FAILURE
[INFO] ------------------------------------------------------------------------
[INFO] Total time: 01:28 h
[INFO] Finished at: 2016-06-16T03:13:53+00:00
[INFO] Final Memory: 70M/2229M
[INFO] ------------------------------------------------------------------------
[ERROR] Failed to execute goal org.apache.maven.plugins:maven-surefire-plugin:2.18.1:test
(secondPartTestsExecution) on project hbase-server: There are test failures.
[ERROR] 
[ERROR] Please refer to <https://builds.apache.org/job/HBase-Trunk_matrix/jdk=latest1.8,label=yahoo-not-h2/ws/hbase-server/target/surefire-reports>
for the individual test results.
[ERROR] -> [Help 1]
[ERROR] 
[ERROR] To see the full stack trace of the errors, re-run Maven with the -e switch.
[ERROR] Re-run Maven using the -X switch to enable full debug logging.
[ERROR] 
[ERROR] For more information about the errors and possible solutions, please read the following
articles:
[ERROR] [Help 1] http://cwiki.apache.org/confluence/display/MAVEN/MojoFailureException
[ERROR] 
[ERROR] After correcting the problems, you can resume the build with the command
[ERROR]   mvn <goals> -rf :hbase-server
Build step 'Invoke top-level Maven targets' marked build as failure
Performing Post build task...
Match found for :.* : True
Logical operation result is TRUE
Running script  : # Run zombie detector script
./dev-support/zombie-detector.sh --jenkins ${BUILD_ID}
[yahoo-not-h2] $ /bin/bash -xe /tmp/hudson2164645849368522418.sh
+ ./dev-support/zombie-detector.sh --jenkins 1055
Thu Jun 16 03:13:54 UTC 2016 We're ok: there is no zombie test


    {color:green}+1 zombies{color}. No zombie tests found running at the end of the build.
POST BUILD TASK : SUCCESS
END OF POST BUILD TASK : 0
Archiving artifacts
Recording test results
[FINDBUGS] Skipping publisher since build result is FAILURE
[CHECKSTYLE] Skipping publisher since build result is FAILURE

Mime
View raw message