hbase-builds mailing list archives

Site index · List index
Message view « Date » · « Thread »
Top « Date » · « Thread »
From Apache Jenkins Server <jenk...@builds.apache.org>
Subject Build failed in Jenkins: HBase-1.4 » latest1.7,yahoo-not-h2 #188
Date Thu, 02 Jun 2016 04:43:43 GMT
See <https://builds.apache.org/job/HBase-1.4/jdk=latest1.7,label=yahoo-not-h2/188/changes>

Changes:

[liyu] HBASE-15931 Add log for long-running tasks in AsyncProcess

------------------------------------------
[...truncated 46724 lines...]
	at org.apache.hadoop.hbase.regionserver.TestHRegion.testParallelIncrementWithMemStoreFlush(TestHRegion.java:4553)

testOpenRegionWrittenToWALForLogReplay(org.apache.hadoop.hbase.regionserver.TestHRegion) 
Time elapsed: 0.041 sec  <<< ERROR!
java.lang.NoClassDefFoundError: org/apache/hadoop/hbase/master/TableLockManager
	at java.net.URLClassLoader$1.run(URLClassLoader.java:366)
	at java.net.URLClassLoader$1.run(URLClassLoader.java:355)
	at java.security.AccessController.doPrivileged(Native Method)
	at java.net.URLClassLoader.findClass(URLClassLoader.java:354)
	at java.lang.ClassLoader.loadClass(ClassLoader.java:425)
	at sun.misc.Launcher$AppClassLoader.loadClass(Launcher.java:308)
	at java.lang.ClassLoader.loadClass(ClassLoader.java:358)
	at org.apache.hadoop.hbase.HBaseTestingUtility.createMockRegionServerService(HBaseTestingUtility.java:2751)
	at org.apache.hadoop.hbase.regionserver.TestHRegion.testOpenRegionWrittenToWALForLogReplay(TestHRegion.java:6095)

testMemstoreSizeAccountingWithFailedPostBatchMutate(org.apache.hadoop.hbase.regionserver.TestHRegion)
 Time elapsed: 0.072 sec  <<< ERROR!
java.lang.NoClassDefFoundError: org/apache/hadoop/hbase/regionserver/MiniBatchOperationInProgress
	at java.net.URLClassLoader$1.run(URLClassLoader.java:366)
	at java.net.URLClassLoader$1.run(URLClassLoader.java:355)
	at java.security.AccessController.doPrivileged(Native Method)
	at java.net.URLClassLoader.findClass(URLClassLoader.java:354)
	at java.lang.ClassLoader.loadClass(ClassLoader.java:425)
	at sun.misc.Launcher$AppClassLoader.loadClass(Launcher.java:308)
	at java.lang.ClassLoader.loadClass(ClassLoader.java:358)
	at java.lang.Class.getDeclaredMethods0(Native Method)
	at java.lang.Class.privateGetDeclaredMethods(Class.java:2625)
	at java.lang.Class.getDeclaredMethods(Class.java:1868)
	at org.mockito.cglib.core.ReflectUtils.addAllMethods(ReflectUtils.java:349)
	at org.mockito.cglib.proxy.Enhancer.getMethods(Enhancer.java:422)
	at org.mockito.cglib.proxy.Enhancer.generateClass(Enhancer.java:457)
	at org.mockito.cglib.core.DefaultGeneratorStrategy.generate(DefaultGeneratorStrategy.java:25)
	at org.mockito.cglib.core.AbstractClassGenerator.create(AbstractClassGenerator.java:217)
	at org.mockito.cglib.proxy.Enhancer.createHelper(Enhancer.java:378)
	at org.mockito.cglib.proxy.Enhancer.createClass(Enhancer.java:318)
	at org.mockito.internal.creation.jmock.ClassImposterizer.createProxyClass(ClassImposterizer.java:124)
	at org.mockito.internal.creation.jmock.ClassImposterizer.imposterise(ClassImposterizer.java:60)
	at org.mockito.internal.creation.jmock.ClassImposterizer.imposterise(ClassImposterizer.java:52)
	at org.mockito.internal.creation.CglibMockMaker.createMock(CglibMockMaker.java:24)
	at org.mockito.internal.util.MockUtil.createMock(MockUtil.java:32)
	at org.mockito.internal.MockitoCore.mock(MockitoCore.java:59)
	at org.mockito.Mockito.mock(Mockito.java:1258)
	at org.mockito.Mockito.mock(Mockito.java:1135)
	at org.apache.hadoop.hbase.regionserver.TestHRegion.testMemstoreSizeAccountingWithFailedPostBatchMutate(TestHRegion.java:422)

testOpenRegionWrittenToWAL(org.apache.hadoop.hbase.regionserver.TestHRegion)  Time elapsed:
0.04 sec  <<< ERROR!
java.lang.NoClassDefFoundError: org/apache/hadoop/hbase/master/TableLockManager
	at java.net.URLClassLoader$1.run(URLClassLoader.java:366)
	at java.net.URLClassLoader$1.run(URLClassLoader.java:355)
	at java.security.AccessController.doPrivileged(Native Method)
	at java.net.URLClassLoader.findClass(URLClassLoader.java:354)
	at java.lang.ClassLoader.loadClass(ClassLoader.java:425)
	at sun.misc.Launcher$AppClassLoader.loadClass(Launcher.java:308)
	at java.lang.ClassLoader.loadClass(ClassLoader.java:358)
	at org.apache.hadoop.hbase.HBaseTestingUtility.createMockRegionServerService(HBaseTestingUtility.java:2751)
	at org.apache.hadoop.hbase.regionserver.TestHRegion.testOpenRegionWrittenToWAL(TestHRegion.java:5992)


Results :

Tests in error: 
org.apache.hadoop.hbase.regionserver.TestHRegion.testBatchMutateWithWrongRegionException(org.apache.hadoop.hbase.regionserver.TestHRegion)
  Run 1: TestHRegion.testBatchMutateWithWrongRegionException:6551 NoClassDefFound org/a...
  Run 2: TestHRegion.testBatchMutateWithWrongRegionException:6551 NoClassDefFound org/a...
  Run 3: TestHRegion.testBatchMutateWithWrongRegionException:6551 NoClassDefFound org/a...

org.apache.hadoop.hbase.regionserver.TestHRegion.testCloseRegionWrittenToWAL(org.apache.hadoop.hbase.regionserver.TestHRegion)
  Run 1: TestHRegion.testCloseRegionWrittenToWAL:6204 » NoClassDefFound org/apache/hado...
  Run 2: TestHRegion.testCloseRegionWrittenToWAL:6204 » NoClassDefFound org/apache/hado...
  Run 3: TestHRegion.testCloseRegionWrittenToWAL:6204 » NoClassDefFound org/apache/hado...

org.apache.hadoop.hbase.regionserver.TestHRegion.testCloseWithFailingFlush(org.apache.hadoop.hbase.regionserver.TestHRegion)
  Run 1: TestHRegion.testCloseWithFailingFlush:538 NoClassDefFound org/apache/hadoop/hb...
  Run 2: TestHRegion.testCloseWithFailingFlush:538 NoClassDefFound org/apache/hadoop/hb...
  Run 3: TestHRegion.testCloseWithFailingFlush:538 NoClassDefFound org/apache/hadoop/hb...

org.apache.hadoop.hbase.regionserver.TestHRegion.testDurability(org.apache.hadoop.hbase.regionserver.TestHRegion)
  Run 1: TestHRegion.testDurability:4762->durabilityTest:4833 NoClassDefFound org/apach...
  Run 2: TestHRegion.testDurability:4762->durabilityTest:4833 NoClassDefFound org/apach...
  Run 3: TestHRegion.testDurability:4762->durabilityTest:4833 NoClassDefFound org/apach...

org.apache.hadoop.hbase.regionserver.TestHRegion.testFlushSizeAccounting(org.apache.hadoop.hbase.regionserver.TestHRegion)
  Run 1: TestHRegion.testFlushSizeAccounting » DamagedWAL Append sequenceId=5, requesti...
  Run 2: TestHRegion.testFlushSizeAccounting » DamagedWAL Append sequenceId=5, requesti...
  Run 3: TestHRegion.testFlushSizeAccounting » DamagedWAL Append sequenceId=5, requesti...

org.apache.hadoop.hbase.regionserver.TestHRegion.testMemstoreSizeAccountingWithFailedPostBatchMutate(org.apache.hadoop.hbase.regionserver.TestHRegion)
  Run 1: TestHRegion.testMemstoreSizeAccountingWithFailedPostBatchMutate:422 » NoClassDefFound
  Run 2: TestHRegion.testMemstoreSizeAccountingWithFailedPostBatchMutate:422 » NoClassDefFound
  Run 3: TestHRegion.testMemstoreSizeAccountingWithFailedPostBatchMutate:422 » NoClassDefFound

org.apache.hadoop.hbase.regionserver.TestHRegion.testMemstoreSizeWithFlushCanceling(org.apache.hadoop.hbase.regionserver.TestHRegion)
  Run 1: TestHRegion.testMemstoreSizeWithFlushCanceling:386 » NoClassDefFound org/apach...
  Run 2: TestHRegion.testMemstoreSizeWithFlushCanceling:386 » NoClassDefFound org/apach...
  Run 3: TestHRegion.testMemstoreSizeWithFlushCanceling:386 » NoClassDefFound org/apach...

org.apache.hadoop.hbase.regionserver.TestHRegion.testMemstoreSnapshotSize(org.apache.hadoop.hbase.regionserver.TestHRegion)
  Run 1: TestHRegion.testMemstoreSnapshotSize:334 NoClassDefFound org/apache/hadoop/hba...
  Run 2: TestHRegion.testMemstoreSnapshotSize:334 NoClassDefFound org/apache/hadoop/hba...
  Run 3: TestHRegion.testMemstoreSnapshotSize:334 NoClassDefFound org/apache/hadoop/hba...

org.apache.hadoop.hbase.regionserver.TestHRegion.testOpenRegionWrittenToWAL(org.apache.hadoop.hbase.regionserver.TestHRegion)
  Run 1: TestHRegion.testOpenRegionWrittenToWAL:5992 » NoClassDefFound org/apache/hadoo...
  Run 2: TestHRegion.testOpenRegionWrittenToWAL:5992 » NoClassDefFound org/apache/hadoo...
  Run 3: TestHRegion.testOpenRegionWrittenToWAL:5992 » NoClassDefFound org/apache/hadoo...

org.apache.hadoop.hbase.regionserver.TestHRegion.testOpenRegionWrittenToWALForLogReplay(org.apache.hadoop.hbase.regionserver.TestHRegion)
  Run 1: TestHRegion.testOpenRegionWrittenToWALForLogReplay:6095 » NoClassDefFound org/...
  Run 2: TestHRegion.testOpenRegionWrittenToWALForLogReplay:6095 » NoClassDefFound org/...
  Run 3: TestHRegion.testOpenRegionWrittenToWALForLogReplay:6095 » NoClassDefFound org/...

org.apache.hadoop.hbase.regionserver.TestHRegion.testParallelIncrementWithMemStoreFlush(org.apache.hadoop.hbase.regionserver.TestHRegion)
  Run 1: TestHRegion.testParallelIncrementWithMemStoreFlush:4553 NoClassDefFound org/ap...
  Run 2: TestHRegion.testParallelIncrementWithMemStoreFlush:4553 NoClassDefFound org/ap...
  Run 3: TestHRegion.testParallelIncrementWithMemStoreFlush:4553 NoClassDefFound org/ap...

org.apache.hadoop.hbase.regionserver.TestHRegion.testWeirdCacheBehaviour(org.apache.hadoop.hbase.regionserver.TestHRegion)
  Run 1: TestHRegion.testWeirdCacheBehaviour:1363->getNumberOfRows:1451 » NoClassDefFound
  Run 2: TestHRegion.testWeirdCacheBehaviour:1363->getNumberOfRows:1451 » NoClassDefFound
  Run 3: TestHRegion.testWeirdCacheBehaviour:1363->getNumberOfRows:1451 » NoClassDefFound

org.apache.hadoop.hbase.regionserver.TestHRegion.testgetHDFSBlocksDistribution(org.apache.hadoop.hbase.regionserver.TestHRegion)
  Run 1: TestHRegion.testgetHDFSBlocksDistribution:4373 » NoClassDefFound org/apache/ha...
  Run 2: TestHRegion.testgetHDFSBlocksDistribution:4373 » NoClassDefFound org/apache/ha...
  Run 3: TestHRegion.testgetHDFSBlocksDistribution:4373 » NoClassDefFound org/apache/ha...

  TestLogRollPeriod.setUpBeforeClass:61 » Runtime Could not create  interface or...
org.apache.hadoop.hbase.regionserver.wal.TestLogRolling.testCompactionRecordDoesntBlockRolling(org.apache.hadoop.hbase.regionserver.wal.TestLogRolling)
  Run 1: TestLogRolling.setUp:156 » IO Unable to initialize WebAppContext
  Run 2: TestLogRolling.setUp:156 » IO Unable to initialize WebAppContext
  Run 3: TestLogRolling.setUp:156 » IO Unable to initialize WebAppContext

org.apache.hadoop.hbase.regionserver.wal.TestLogRolling.testLogRollOnDatanodeDeath(org.apache.hadoop.hbase.regionserver.wal.TestLogRolling)
  Run 1: TestLogRolling.setUp:156 » IO Unable to initialize WebAppContext
  Run 2: TestLogRolling.setUp:156 » IO Unable to initialize WebAppContext
  Run 3: TestLogRolling.setUp:156 » IO Unable to initialize WebAppContext

org.apache.hadoop.hbase.regionserver.wal.TestLogRolling.testLogRollOnNothingWritten(org.apache.hadoop.hbase.regionserver.wal.TestLogRolling)
  Run 1: TestLogRolling.setUp:156 » IO Unable to initialize WebAppContext
  Run 2: TestLogRolling.setUp:156 » IO Unable to initialize WebAppContext
  Run 3: TestLogRolling.setUp:156 » IO Unable to initialize WebAppContext

org.apache.hadoop.hbase.regionserver.wal.TestLogRolling.testLogRollOnPipelineRestart(org.apache.hadoop.hbase.regionserver.wal.TestLogRolling)
  Run 1: TestLogRolling.setUp:156 » IO Unable to initialize WebAppContext
  Run 2: TestLogRolling.setUp:156 » IO Unable to initialize WebAppContext
  Run 3: TestLogRolling.setUp:156 » IO Unable to initialize WebAppContext

org.apache.hadoop.hbase.regionserver.wal.TestLogRolling.testLogRolling(org.apache.hadoop.hbase.regionserver.wal.TestLogRolling)
  Run 1: TestLogRolling.setUp:156 » IO Unable to initialize WebAppContext
  Run 2: TestLogRolling.setUp:156 » IO Unable to initialize WebAppContext
  Run 3: TestLogRolling.setUp:156 » IO Unable to initialize WebAppContext

Flaked tests: 
org.apache.hadoop.hbase.coprocessor.TestRowProcessorEndpoint.testMultipleRows(org.apache.hadoop.hbase.coprocessor.TestRowProcessorEndpoint)
  Run 1: TestRowProcessorEndpoint.testMultipleRows:246 expected:<3> but was:<2>
  Run 2: PASS

org.apache.hadoop.hbase.regionserver.TestHRegion.testCellTTLs(org.apache.hadoop.hbase.regionserver.TestHRegion)
  Run 1: TestHRegion.testCellTTLs:6332 » ExitCode chmod: cannot access '/home/jenkins/j...
  Run 2: PASS


Tests run: 561, Failures: 0, Errors: 19, Skipped: 5, Flakes: 2

[INFO] ------------------------------------------------------------------------
[INFO] Reactor Summary:
[INFO] 
[INFO] Apache HBase ...................................... SUCCESS [1:31.469s]
[INFO] Apache HBase - Checkstyle ......................... SUCCESS [8.426s]
[INFO] Apache HBase - Resource Bundle .................... SUCCESS [0.234s]
[INFO] Apache HBase - Annotations ........................ SUCCESS [1.029s]
[INFO] Apache HBase - Protocol ........................... SUCCESS [22.964s]
[INFO] Apache HBase - Common ............................. SUCCESS [2:43.295s]
[INFO] Apache HBase - Procedure .......................... SUCCESS [3:07.934s]
[INFO] Apache HBase - Client ............................. SUCCESS [1:23.510s]
[INFO] Apache HBase - Hadoop Compatibility ............... SUCCESS [8.043s]
[INFO] Apache HBase - Hadoop Two Compatibility ........... SUCCESS [11.468s]
[INFO] Apache HBase - Prefix Tree ........................ SUCCESS [9.643s]
[INFO] Apache HBase - Server ............................. FAILURE [32:33.829s]
[INFO] Apache HBase - Testing Util ....................... SKIPPED
[INFO] Apache HBase - Thrift ............................. SKIPPED
[INFO] Apache HBase - Rest ............................... SKIPPED
[INFO] Apache HBase - Shell .............................. SKIPPED
[INFO] Apache HBase - Integration Tests .................. SKIPPED
[INFO] Apache HBase - Examples ........................... SKIPPED
[INFO] Apache HBase - External Block Cache ............... SKIPPED
[INFO] Apache HBase - Assembly ........................... SKIPPED
[INFO] Apache HBase - Shaded ............................. SKIPPED
[INFO] Apache HBase - Shaded - Client .................... SKIPPED
[INFO] Apache HBase - Shaded - Server .................... SKIPPED
[INFO] ------------------------------------------------------------------------
[INFO] BUILD FAILURE
[INFO] ------------------------------------------------------------------------
[INFO] Total time: 42:48.571s
[INFO] Finished at: Thu Jun 02 04:43:22 UTC 2016
[INFO] Final Memory: 95M/522M
[INFO] ------------------------------------------------------------------------
[ERROR] Failed to execute goal org.apache.maven.plugins:maven-surefire-plugin:2.18.1:test
(secondPartTestsExecution) on project hbase-server: ExecutionException: java.lang.RuntimeException:
The forked VM terminated without properly saying goodbye. VM crash or System.exit called?
[ERROR] Command was /bin/sh -c cd <https://builds.apache.org/job/HBase-1.4/jdk=latest1.7,label=yahoo-not-h2/ws/hbase-server>
&& /home/jenkins/jenkins-slave/tools/hudson.model.JDK/latest1.7/jre/bin/java -enableassertions
-Dhbase.test -Xmx2800m -XX:MaxPermSize=256m -Djava.security.egd=file:/dev/./urandom -Djava.net.preferIPv4Stack=true
-Djava.awt.headless=true -jar <https://builds.apache.org/job/HBase-1.4/jdk=latest1.7,label=yahoo-not-h2/ws/hbase-server/target/surefire/surefirebooter2094686061809044201.jar>
<https://builds.apache.org/job/HBase-1.4/jdk=latest1.7,label=yahoo-not-h2/ws/hbase-server/target/surefire/surefire2749843949416677232tmp>
<https://builds.apache.org/job/HBase-1.4/jdk=latest1.7,label=yahoo-not-h2/ws/hbase-server/target/surefire/surefire_8758834604962041023810tmp>
[ERROR] -> [Help 1]
[ERROR] 
[ERROR] To see the full stack trace of the errors, re-run Maven with the -e switch.
[ERROR] Re-run Maven using the -X switch to enable full debug logging.
[ERROR] 
[ERROR] For more information about the errors and possible solutions, please read the following
articles:
[ERROR] [Help 1] http://cwiki.apache.org/confluence/display/MAVEN/MojoFailureException
[ERROR] 
[ERROR] After correcting the problems, you can resume the build with the command
[ERROR]   mvn <goals> -rf :hbase-server
Build step 'Invoke top-level Maven targets' marked build as failure
Performing Post build task...
Match found for :.* : True
Logical operation result is TRUE
Running script  : # Post-build task script. TODO: Check this in and have all builds reference
check-in.
pwd && ls
# NOTE!!!! The below code has been copied and pasted from ./dev-tools/run-test.sh
# Do not change here without syncing there and vice-versa.
ZOMBIE_TESTS_COUNT=`jps -v | grep surefirebooter | grep -e '-Dhbase.test' | wc -l`
if [[ $ZOMBIE_TESTS_COUNT != 0 ]] ; then
 echo "Suspicious java process found - waiting 30s to see if there are just slow to stop"
 sleep 30
 ZOMBIE_TESTS_COUNT=`jps -v | grep surefirebooter | grep -e '-Dhbase.test' | wc -l`
 if [[ $ZOMBIE_TESTS_COUNT != 0 ]] ; then
   echo " {color:red}There appear to be $ZOMBIE_TESTS_COUNT zombie tests{color}, they should
have been killed by surefire but survived"
   jps -v | grep surefirebooter | grep -e '-Dhbase.test'
   jps -v | grep surefirebooter | grep -e '-Dhbase.test' | cut -d ' ' -f 1 | xargs -n 1 jstack
   # Exit with error
   exit 1
 else
   echo "We're ok: there is no zombie test, but some tests took some time to stop"
 fi
else
  echo "We're ok: there is no zombie test"
fi
[yahoo-not-h2] $ /bin/bash -xe /tmp/hudson3334714792667814877.sh
+ pwd
<https://builds.apache.org/job/HBase-1.4/jdk=latest1.7,label=yahoo-not-h2/ws/>
+ ls
hbase-server
++ jps -v
++ grep surefirebooter
++ wc -l
++ grep -e -Dhbase.test
+ ZOMBIE_TESTS_COUNT=0
+ [[ 0 != 0 ]]
+ echo 'We'\''re ok: there is no zombie test'
We're ok: there is no zombie test
POST BUILD TASK : SUCCESS
END OF POST BUILD TASK : 0
Archiving artifacts
Recording test results

Mime
View raw message