hbase-builds mailing list archives

Site index · List index
Message view « Date » · « Thread »
Top « Date » · « Thread »
From Apache Jenkins Server <jenk...@builds.apache.org>
Subject Build failed in Jenkins: HBase-Trunk_matrix » latest1.8,yahoo-not-h2 #1129
Date Tue, 28 Jun 2016 11:00:07 GMT
See <https://builds.apache.org/job/HBase-Trunk_matrix/jdk=latest1.8,label=yahoo-not-h2/1129/changes>

Changes:

[jingcheng.du] HBASE-15976 RegionServerMetricsWrapperRunnable will be failure  when

------------------------------------------
[...truncated 7040 lines...]
Tests run: 12, Failures: 0, Errors: 0, Skipped: 0, Time elapsed: 129.374 sec - in org.apache.hadoop.hbase.client.TestMetaWithReplicas
Java HotSpot(TM) 64-Bit Server VM warning: ignoring option MaxPermSize=256m; support was removed
in 8.0
Running org.apache.hadoop.hbase.client.TestHTableMultiplexerFlushCache
Running org.apache.hadoop.hbase.TestMultiVersions
Running org.apache.hadoop.hbase.TestHColumnDescriptorDefaultVersions
Tests run: 2, Failures: 0, Errors: 0, Skipped: 0, Time elapsed: 8.446 sec - in org.apache.hadoop.hbase.client.TestHTableMultiplexerFlushCache
Java HotSpot(TM) 64-Bit Server VM warning: ignoring option MaxPermSize=256m; support was removed
in 8.0
Java HotSpot(TM) 64-Bit Server VM warning: ignoring option MaxPermSize=256m; support was removed
in 8.0
Java HotSpot(TM) 64-Bit Server VM warning: ignoring option MaxPermSize=256m; support was removed
in 8.0
Java HotSpot(TM) 64-Bit Server VM warning: ignoring option MaxPermSize=256m; support was removed
in 8.0
Java HotSpot(TM) 64-Bit Server VM warning: ignoring option MaxPermSize=256m; support was removed
in 8.0
Running org.apache.hadoop.hbase.procedure.TestZKProcedure
Tests run: 4, Failures: 0, Errors: 0, Skipped: 0, Time elapsed: 1.858 sec - in org.apache.hadoop.hbase.procedure.TestZKProcedure
Java HotSpot(TM) 64-Bit Server VM warning: ignoring option MaxPermSize=256m; support was removed
in 8.0
Tests run: 3, Failures: 0, Errors: 0, Skipped: 0, Time elapsed: 8.583 sec - in org.apache.hadoop.hbase.TestMultiVersions
Java HotSpot(TM) 64-Bit Server VM warning: ignoring option MaxPermSize=256m; support was removed
in 8.0
Running org.apache.hadoop.hbase.procedure.TestZKProcedureControllers
Tests run: 4, Failures: 0, Errors: 0, Skipped: 0, Time elapsed: 1.471 sec - in org.apache.hadoop.hbase.procedure.TestZKProcedureControllers
Java HotSpot(TM) 64-Bit Server VM warning: ignoring option MaxPermSize=256m; support was removed
in 8.0
Java HotSpot(TM) 64-Bit Server VM warning: ignoring option MaxPermSize=256m; support was removed
in 8.0
Running org.apache.hadoop.hbase.TestZooKeeper
Running org.apache.hadoop.hbase.constraint.TestConstraint
Tests run: 4, Failures: 0, Errors: 0, Skipped: 0, Time elapsed: 26.853 sec - in org.apache.hadoop.hbase.TestHColumnDescriptorDefaultVersions
Java HotSpot(TM) 64-Bit Server VM warning: ignoring option MaxPermSize=256m; support was removed
in 8.0
Tests run: 5, Failures: 0, Errors: 0, Skipped: 0, Time elapsed: 24.989 sec - in org.apache.hadoop.hbase.constraint.TestConstraint
Java HotSpot(TM) 64-Bit Server VM warning: ignoring option MaxPermSize=256m; support was removed
in 8.0
Java HotSpot(TM) 64-Bit Server VM warning: ignoring option MaxPermSize=256m; support was removed
in 8.0
Java HotSpot(TM) 64-Bit Server VM warning: ignoring option MaxPermSize=256m; support was removed
in 8.0
Tests run: 5, Failures: 0, Errors: 0, Skipped: 0, Time elapsed: 108.394 sec - in org.apache.hadoop.hbase.client.TestRestoreSnapshotFromClient
Running org.apache.hadoop.hbase.snapshot.TestSecureExportSnapshot
Java HotSpot(TM) 64-Bit Server VM warning: ignoring option MaxPermSize=256m; support was removed
in 8.0
Running org.apache.hadoop.hbase.snapshot.TestSnapshotClientRetries
Running org.apache.hadoop.hbase.snapshot.TestRestoreFlushSnapshotFromClient
Tests run: 2, Failures: 0, Errors: 0, Skipped: 0, Time elapsed: 21.415 sec - in org.apache.hadoop.hbase.snapshot.TestSnapshotClientRetries
Java HotSpot(TM) 64-Bit Server VM warning: ignoring option MaxPermSize=256m; support was removed
in 8.0
Running org.apache.hadoop.hbase.snapshot.TestSnapshotDescriptionUtils
Tests run: 2, Failures: 0, Errors: 0, Skipped: 0, Time elapsed: 0.151 sec - in org.apache.hadoop.hbase.snapshot.TestSnapshotDescriptionUtils
Java HotSpot(TM) 64-Bit Server VM warning: ignoring option MaxPermSize=256m; support was removed
in 8.0
Tests run: 14, Failures: 0, Errors: 0, Skipped: 0, Time elapsed: 264.421 sec - in org.apache.hadoop.hbase.client.TestReplicasClient
Java HotSpot(TM) 64-Bit Server VM warning: ignoring option MaxPermSize=256m; support was removed
in 8.0
Java HotSpot(TM) 64-Bit Server VM warning: ignoring option MaxPermSize=256m; support was removed
in 8.0
Running org.apache.hadoop.hbase.snapshot.TestMobRestoreFlushSnapshotFromClient
Running org.apache.hadoop.hbase.snapshot.TestMobSecureExportSnapshot
Tests run: 5, Failures: 0, Errors: 0, Skipped: 0, Time elapsed: 54.412 sec - in org.apache.hadoop.hbase.snapshot.TestRestoreFlushSnapshotFromClient
Java HotSpot(TM) 64-Bit Server VM warning: ignoring option MaxPermSize=256m; support was removed
in 8.0
Running org.apache.hadoop.hbase.TestIOFencing
Tests run: 10, Failures: 0, Errors: 0, Skipped: 0, Time elapsed: 162.553 sec - in org.apache.hadoop.hbase.TestZooKeeper
Java HotSpot(TM) 64-Bit Server VM warning: ignoring option MaxPermSize=256m; support was removed
in 8.0
Running org.apache.hadoop.hbase.coprocessor.TestRegionObserverScannerOpenHook
Tests run: 5, Failures: 0, Errors: 0, Skipped: 0, Time elapsed: 90.221 sec - in org.apache.hadoop.hbase.snapshot.TestMobRestoreFlushSnapshotFromClient
Java HotSpot(TM) 64-Bit Server VM warning: ignoring option MaxPermSize=256m; support was removed
in 8.0
Tests run: 2, Failures: 0, Errors: 0, Skipped: 0, Time elapsed: 76.177 sec - in org.apache.hadoop.hbase.TestIOFencing
Java HotSpot(TM) 64-Bit Server VM warning: ignoring option MaxPermSize=256m; support was removed
in 8.0
Tests run: 3, Failures: 0, Errors: 0, Skipped: 0, Time elapsed: 16.101 sec - in org.apache.hadoop.hbase.coprocessor.TestRegionObserverScannerOpenHook
Java HotSpot(TM) 64-Bit Server VM warning: ignoring option MaxPermSize=256m; support was removed
in 8.0
Running org.apache.hadoop.hbase.coprocessor.TestOpenTableInCoprocessor
Running org.apache.hadoop.hbase.coprocessor.TestMasterCoprocessorExceptionWithAbort
Running org.apache.hadoop.hbase.coprocessor.TestCoprocessorTableEndpoint
Tests run: 2, Failures: 0, Errors: 0, Skipped: 0, Time elapsed: 18.118 sec - in org.apache.hadoop.hbase.coprocessor.TestOpenTableInCoprocessor
Java HotSpot(TM) 64-Bit Server VM warning: ignoring option MaxPermSize=256m; support was removed
in 8.0
Tests run: 2, Failures: 0, Errors: 0, Skipped: 0, Time elapsed: 9.61 sec - in org.apache.hadoop.hbase.coprocessor.TestCoprocessorTableEndpoint
Java HotSpot(TM) 64-Bit Server VM warning: ignoring option MaxPermSize=256m; support was removed
in 8.0
Java HotSpot(TM) 64-Bit Server VM warning: ignoring option MaxPermSize=256m; support was removed
in 8.0
Java HotSpot(TM) 64-Bit Server VM warning: ignoring option MaxPermSize=256m; support was removed
in 8.0
Tests run: 1, Failures: 0, Errors: 0, Skipped: 0, Time elapsed: 18.018 sec - in org.apache.hadoop.hbase.coprocessor.TestMasterCoprocessorExceptionWithAbort
Java HotSpot(TM) 64-Bit Server VM warning: ignoring option MaxPermSize=256m; support was removed
in 8.0
Running org.apache.hadoop.hbase.coprocessor.TestRegionServerCoprocessorEndpoint
Running org.apache.hadoop.hbase.coprocessor.TestIncrementTimeRange
Running org.apache.hadoop.hbase.coprocessor.TestRegionObserverInterface
Tests run: 2, Failures: 0, Errors: 0, Skipped: 0, Time elapsed: 2.442 sec - in org.apache.hadoop.hbase.coprocessor.TestRegionServerCoprocessorEndpoint
Java HotSpot(TM) 64-Bit Server VM warning: ignoring option MaxPermSize=256m; support was removed
in 8.0
Tests run: 1, Failures: 0, Errors: 0, Skipped: 0, Time elapsed: 3.075 sec - in org.apache.hadoop.hbase.coprocessor.TestIncrementTimeRange
Java HotSpot(TM) 64-Bit Server VM warning: ignoring option MaxPermSize=256m; support was removed
in 8.0
Running org.apache.hadoop.hbase.coprocessor.TestMasterCoprocessorExceptionWithRemove
Running org.apache.hadoop.hbase.coprocessor.TestAggregateProtocol
Tests run: 1, Failures: 0, Errors: 0, Skipped: 0, Time elapsed: 6.051 sec - in org.apache.hadoop.hbase.coprocessor.TestMasterCoprocessorExceptionWithRemove
Java HotSpot(TM) 64-Bit Server VM warning: ignoring option MaxPermSize=256m; support was removed
in 8.0
Tests run: 44, Failures: 0, Errors: 0, Skipped: 0, Time elapsed: 5.958 sec - in org.apache.hadoop.hbase.coprocessor.TestAggregateProtocol
Java HotSpot(TM) 64-Bit Server VM warning: ignoring option MaxPermSize=256m; support was removed
in 8.0
Running org.apache.hadoop.hbase.coprocessor.TestBatchCoprocessorEndpoint
Running org.apache.hadoop.hbase.coprocessor.TestHTableWrapper
Tests run: 4, Failures: 0, Errors: 0, Skipped: 0, Time elapsed: 1.663 sec - in org.apache.hadoop.hbase.coprocessor.TestBatchCoprocessorEndpoint
Java HotSpot(TM) 64-Bit Server VM warning: ignoring option MaxPermSize=256m; support was removed
in 8.0
Running org.apache.hadoop.hbase.coprocessor.TestRegionServerObserver
Tests run: 1, Failures: 0, Errors: 0, Skipped: 0, Time elapsed: 5.943 sec - in org.apache.hadoop.hbase.coprocessor.TestHTableWrapper
Java HotSpot(TM) 64-Bit Server VM warning: ignoring option MaxPermSize=256m; support was removed
in 8.0
Java HotSpot(TM) 64-Bit Server VM warning: ignoring option MaxPermSize=256m; support was removed
in 8.0
Java HotSpot(TM) 64-Bit Server VM warning: ignoring option MaxPermSize=256m; support was removed
in 8.0
Tests run: 1, Failures: 0, Errors: 0, Skipped: 0, Time elapsed: 17.564 sec - in org.apache.hadoop.hbase.coprocessor.TestRegionServerObserver
Java HotSpot(TM) 64-Bit Server VM warning: ignoring option MaxPermSize=256m; support was removed
in 8.0
Running org.apache.hadoop.hbase.coprocessor.TestClassLoading
Running org.apache.hadoop.hbase.coprocessor.TestRegionObserverForAddingMutationsFromCoprocessors
Tests run: 5, Failures: 0, Errors: 0, Skipped: 0, Time elapsed: 9.495 sec - in org.apache.hadoop.hbase.coprocessor.TestRegionObserverForAddingMutationsFromCoprocessors
Java HotSpot(TM) 64-Bit Server VM warning: ignoring option MaxPermSize=256m; support was removed
in 8.0
Tests run: 9, Failures: 0, Errors: 0, Skipped: 0, Time elapsed: 31.782 sec - in org.apache.hadoop.hbase.coprocessor.TestClassLoading
Java HotSpot(TM) 64-Bit Server VM warning: ignoring option MaxPermSize=256m; support was removed
in 8.0
Running org.apache.hadoop.hbase.coprocessor.TestDoubleColumnInterpreter
Tests run: 38, Failures: 0, Errors: 0, Skipped: 0, Time elapsed: 5.654 sec - in org.apache.hadoop.hbase.coprocessor.TestDoubleColumnInterpreter
Java HotSpot(TM) 64-Bit Server VM warning: ignoring option MaxPermSize=256m; support was removed
in 8.0
Running org.apache.hadoop.hbase.coprocessor.TestRegionObserverBypass
Tests run: 2, Failures: 0, Errors: 0, Skipped: 0, Time elapsed: 6.321 sec - in org.apache.hadoop.hbase.coprocessor.TestRegionObserverBypass
Java HotSpot(TM) 64-Bit Server VM warning: ignoring option MaxPermSize=256m; support was removed
in 8.0
Running org.apache.hadoop.hbase.coprocessor.TestRowProcessorEndpoint
Tests run: 9, Failures: 0, Errors: 0, Skipped: 0, Time elapsed: 284.016 sec - in org.apache.hadoop.hbase.snapshot.TestSecureExportSnapshot
Java HotSpot(TM) 64-Bit Server VM warning: ignoring option MaxPermSize=256m; support was removed
in 8.0
Running org.apache.hadoop.hbase.coprocessor.TestCoprocessorStop
Running org.apache.hadoop.hbase.coprocessor.TestRegionServerCoprocessorExceptionWithRemove
Tests run: 4, Failures: 0, Errors: 0, Skipped: 0, Time elapsed: 20.502 sec - in org.apache.hadoop.hbase.coprocessor.TestRowProcessorEndpoint
Java HotSpot(TM) 64-Bit Server VM warning: ignoring option MaxPermSize=256m; support was removed
in 8.0
Tests run: 1, Failures: 0, Errors: 0, Skipped: 0, Time elapsed: 14.217 sec - in org.apache.hadoop.hbase.coprocessor.TestRegionServerCoprocessorExceptionWithRemove
Tests run: 1, Failures: 0, Errors: 0, Skipped: 0, Time elapsed: 17.48 sec - in org.apache.hadoop.hbase.coprocessor.TestCoprocessorStop
Java HotSpot(TM) 64-Bit Server VM warning: ignoring option MaxPermSize=256m; support was removed
in 8.0
Java HotSpot(TM) 64-Bit Server VM warning: ignoring option MaxPermSize=256m; support was removed
in 8.0
Running org.apache.hadoop.hbase.coprocessor.TestBigDecimalColumnInterpreter
Running org.apache.hadoop.hbase.coprocessor.TestMasterObserver
Tests run: 38, Failures: 0, Errors: 0, Skipped: 0, Time elapsed: 5.778 sec - in org.apache.hadoop.hbase.coprocessor.TestBigDecimalColumnInterpreter
Java HotSpot(TM) 64-Bit Server VM warning: ignoring option MaxPermSize=256m; support was removed
in 8.0
Running org.apache.hadoop.hbase.coprocessor.TestCoprocessorEndpoint
Tests run: 6, Failures: 0, Errors: 0, Skipped: 0, Time elapsed: 6.026 sec - in org.apache.hadoop.hbase.coprocessor.TestCoprocessorEndpoint
Java HotSpot(TM) 64-Bit Server VM warning: ignoring option MaxPermSize=256m; support was removed
in 8.0
Running org.apache.hadoop.hbase.TestGlobalMemStoreSize
Running org.apache.hadoop.hbase.coprocessor.TestWALObserver
Tests run: 14, Failures: 0, Errors: 0, Skipped: 0, Time elapsed: 157.697 sec - in org.apache.hadoop.hbase.coprocessor.TestRegionObserverInterface
Java HotSpot(TM) 64-Bit Server VM warning: ignoring option MaxPermSize=256m; support was removed
in 8.0
Tests run: 9, Failures: 0, Errors: 0, Skipped: 0, Time elapsed: 285.684 sec - in org.apache.hadoop.hbase.snapshot.TestMobSecureExportSnapshot
Java HotSpot(TM) 64-Bit Server VM warning: ignoring option MaxPermSize=256m; support was removed
in 8.0
Running org.apache.hadoop.hbase.TestStochasticBalancerJmxMetrics
Tests run: 1, Failures: 0, Errors: 0, Skipped: 1, Time elapsed: 0.003 sec - in org.apache.hadoop.hbase.TestStochasticBalancerJmxMetrics
Java HotSpot(TM) 64-Bit Server VM warning: ignoring option MaxPermSize=256m; support was removed
in 8.0
Java HotSpot(TM) 64-Bit Server VM warning: ignoring option MaxPermSize=256m; support was removed
in 8.0
Java HotSpot(TM) 64-Bit Server VM warning: ignoring option MaxPermSize=256m; support was removed
in 8.0
Java HotSpot(TM) 64-Bit Server VM warning: ignoring option MaxPermSize=256m; support was removed
in 8.0
Tests run: 7, Failures: 0, Errors: 0, Skipped: 0, Time elapsed: 9.854 sec - in org.apache.hadoop.hbase.coprocessor.TestWALObserver
Running org.apache.hadoop.hbase.TestMetaTableLocator
Java HotSpot(TM) 64-Bit Server VM warning: ignoring option MaxPermSize=256m; support was removed
in 8.0
Tests run: 1, Failures: 0, Errors: 0, Skipped: 0, Time elapsed: 15.194 sec - in org.apache.hadoop.hbase.TestGlobalMemStoreSize
Tests run: 7, Failures: 0, Errors: 0, Skipped: 0, Time elapsed: 3.383 sec - in org.apache.hadoop.hbase.TestMetaTableLocator
Java HotSpot(TM) 64-Bit Server VM warning: ignoring option MaxPermSize=256m; support was removed
in 8.0
Java HotSpot(TM) 64-Bit Server VM warning: ignoring option MaxPermSize=256m; support was removed
in 8.0
Running org.apache.hadoop.hbase.TestJMXListener
Running org.apache.hadoop.hbase.zookeeper.TestZKMulti
Running org.apache.hadoop.hbase.zookeeper.lock.TestZKInterProcessReadWriteLock
Tests run: 12, Failures: 0, Errors: 0, Skipped: 0, Time elapsed: 1.286 sec - in org.apache.hadoop.hbase.zookeeper.TestZKMulti
Java HotSpot(TM) 64-Bit Server VM warning: ignoring option MaxPermSize=256m; support was removed
in 8.0
Running org.apache.hadoop.hbase.zookeeper.TestZKLeaderManager
Tests run: 1, Failures: 0, Errors: 0, Skipped: 0, Time elapsed: 0.107 sec - in org.apache.hadoop.hbase.zookeeper.TestZKLeaderManager
Java HotSpot(TM) 64-Bit Server VM warning: ignoring option MaxPermSize=256m; support was removed
in 8.0
Java HotSpot(TM) 64-Bit Server VM warning: ignoring option MaxPermSize=256m; support was removed
in 8.0
Running org.apache.hadoop.hbase.zookeeper.TestRecoverableZooKeeper
Tests run: 1, Failures: 0, Errors: 0, Skipped: 0, Time elapsed: 1.191 sec - in org.apache.hadoop.hbase.zookeeper.TestRecoverableZooKeeper
Java HotSpot(TM) 64-Bit Server VM warning: ignoring option MaxPermSize=256m; support was removed
in 8.0
Running org.apache.hadoop.hbase.zookeeper.TestZooKeeperACL
Tests run: 7, Failures: 0, Errors: 0, Skipped: 0, Time elapsed: 0.436 sec - in org.apache.hadoop.hbase.zookeeper.TestZooKeeperACL
Running org.apache.hadoop.hbase.zookeeper.TestZooKeeperNodeTracker
Tests run: 3, Failures: 0, Errors: 0, Skipped: 0, Time elapsed: 0.678 sec - in org.apache.hadoop.hbase.zookeeper.TestZooKeeperNodeTracker
Java HotSpot(TM) 64-Bit Server VM warning: ignoring option MaxPermSize=256m; support was removed
in 8.0
Java HotSpot(TM) 64-Bit Server VM warning: ignoring option MaxPermSize=256m; support was removed
in 8.0
Running org.apache.hadoop.hbase.TestClusterBootOrder
Running org.apache.hadoop.hbase.zookeeper.TestHQuorumPeer
Tests run: 3, Failures: 0, Errors: 0, Skipped: 0, Time elapsed: 0.483 sec - in org.apache.hadoop.hbase.zookeeper.TestHQuorumPeer
Java HotSpot(TM) 64-Bit Server VM warning: ignoring option MaxPermSize=256m; support was removed
in 8.0
Tests run: 9, Failures: 0, Errors: 0, Skipped: 0, Time elapsed: 39.702 sec - in org.apache.hadoop.hbase.coprocessor.TestMasterObserver
Java HotSpot(TM) 64-Bit Server VM warning: ignoring option MaxPermSize=256m; support was removed
in 8.0
Java HotSpot(TM) 64-Bit Server VM warning: ignoring option MaxPermSize=256m; support was removed
in 8.0
Tests run: 2, Failures: 0, Errors: 0, Skipped: 0, Time elapsed: 16.355 sec - in org.apache.hadoop.hbase.TestJMXListener
Running org.apache.hadoop.hbase.TestServerSideScanMetricsFromClientSide
Tests run: 2, Failures: 0, Errors: 0, Skipped: 0, Time elapsed: 2.906 sec - in org.apache.hadoop.hbase.TestServerSideScanMetricsFromClientSide
Tests run: 6, Failures: 0, Errors: 0, Skipped: 0, Time elapsed: 24.504 sec - in org.apache.hadoop.hbase.zookeeper.lock.TestZKInterProcessReadWriteLock
Tests run: 2, Failures: 0, Errors: 0, Skipped: 0, Time elapsed: 29.579 sec - in org.apache.hadoop.hbase.TestClusterBootOrder

Results :

Tests in error: 
  TestMultiTableInputFormat>MultiTableInputFormatTestBase.setUpBeforeClass:89 » RetriesExhaustedWithDetails
  TestAssignmentManagerOnCluster.testRoundRobinAssignmentFailed:572->Object.wait:460->Object.wait:-2
» TestTimedOut
  TestReplicationSyncUpToolWithMultipleAsyncWAL>TestReplicationSyncUpTool.testSyncUpTool:122->TestReplicationSyncUpTool.putAndReplicateRows:241
» RetriesExhaustedWithDetails

Tests run: 2220, Failures: 0, Errors: 3, Skipped: 41

[INFO] ------------------------------------------------------------------------
[INFO] Reactor Summary:
[INFO] 
[INFO] Apache HBase ...................................... SUCCESS [  2.413 s]
[INFO] Apache HBase - Checkstyle ......................... SUCCESS [  0.530 s]
[INFO] Apache HBase - Resource Bundle .................... SUCCESS [  0.125 s]
[INFO] Apache HBase - Annotations ........................ SUCCESS [  0.128 s]
[INFO] Apache HBase - Protocol ........................... SUCCESS [  2.331 s]
[INFO] Apache HBase - Common ............................. SUCCESS [01:30 min]
[INFO] Apache HBase - Procedure .......................... SUCCESS [01:38 min]
[INFO] Apache HBase - Client ............................. SUCCESS [ 36.116 s]
[INFO] Apache HBase - Hadoop Compatibility ............... SUCCESS [  7.522 s]
[INFO] Apache HBase - Hadoop Two Compatibility ........... SUCCESS [  9.055 s]
[INFO] Apache HBase - Prefix Tree ........................ SUCCESS [  8.098 s]
[INFO] Apache HBase - Server ............................. FAILURE [  01:13 h]
[INFO] Apache HBase - Testing Util ....................... SKIPPED
[INFO] Apache HBase - Thrift ............................. SKIPPED
[INFO] Apache HBase - RSGroup ............................ SKIPPED
[INFO] Apache HBase - Shell .............................. SKIPPED
[INFO] Apache HBase - Integration Tests .................. SKIPPED
[INFO] Apache HBase - Examples ........................... SKIPPED
[INFO] Apache HBase - Rest ............................... SKIPPED
[INFO] Apache HBase - External Block Cache ............... SKIPPED
[INFO] Apache HBase - Spark .............................. SKIPPED
[INFO] Apache HBase - Assembly ........................... SKIPPED
[INFO] Apache HBase - Shaded ............................. SKIPPED
[INFO] Apache HBase - Shaded - Client .................... SKIPPED
[INFO] Apache HBase - Shaded - Server .................... SKIPPED
[INFO] Apache HBase - Archetypes ......................... SKIPPED
[INFO] Apache HBase - Exemplar for hbase-client archetype  SKIPPED
[INFO] Apache HBase - Exemplar for hbase-shaded-client archetype  SKIPPED
[INFO] Apache HBase - Archetype builder .................. SKIPPED
[INFO] ------------------------------------------------------------------------
[INFO] BUILD FAILURE
[INFO] ------------------------------------------------------------------------
[INFO] Total time: 01:17 h
[INFO] Finished at: 2016-06-28T10:56:47+00:00
[INFO] Final Memory: 71M/2178M
[INFO] ------------------------------------------------------------------------
[ERROR] Failed to execute goal org.apache.maven.plugins:maven-surefire-plugin:2.18.1:test
(secondPartTestsExecution) on project hbase-server: There are test failures.
[ERROR] 
[ERROR] Please refer to <https://builds.apache.org/job/HBase-Trunk_matrix/jdk=latest1.8,label=yahoo-not-h2/ws/hbase-server/target/surefire-reports>
for the individual test results.
[ERROR] -> [Help 1]
[ERROR] 
[ERROR] To see the full stack trace of the errors, re-run Maven with the -e switch.
[ERROR] Re-run Maven using the -X switch to enable full debug logging.
[ERROR] 
[ERROR] For more information about the errors and possible solutions, please read the following
articles:
[ERROR] [Help 1] http://cwiki.apache.org/confluence/display/MAVEN/MojoFailureException
[ERROR] 
[ERROR] After correcting the problems, you can resume the build with the command
[ERROR]   mvn <goals> -rf :hbase-server
Build step 'Invoke top-level Maven targets' marked build as failure
Performing Post build task...
Match found for :.* : True
Logical operation result is TRUE
Running script  : # Run zombie detector script
./dev-support/zombie-detector.sh --jenkins ${BUILD_ID}
[yahoo-not-h2] $ /bin/bash -xe /tmp/hudson4331502779004047704.sh
+ ./dev-support/zombie-detector.sh --jenkins 1129
Tue Jun 28 10:56:50 UTC 2016 We're ok: there is no zombie test


    {color:green}+1 zombies{color}. No zombie tests found running at the end of the build.
POST BUILD TASK : SUCCESS
END OF POST BUILD TASK : 0
Archiving artifacts
Recording test results
[FINDBUGS] Skipping publisher since build result is FAILURE
[CHECKSTYLE] Skipping publisher since build result is FAILURE

Mime
View raw message