hbase-builds mailing list archives

Site index · List index
Message view « Date » · « Thread »
Top « Date » · « Thread »
From Apache Jenkins Server <jenk...@builds.apache.org>
Subject Build failed in Jenkins: HBase-1.4 » latest1.7,yahoo-not-h2 #223
Date Sat, 18 Jun 2016 01:36:05 GMT
See <https://builds.apache.org/job/HBase-1.4/jdk=latest1.7,label=yahoo-not-h2/223/changes>

Changes:

[matteo.bertozzi] HBASE-16056 Procedure v2 - fix master crash for FileNotFound

[antonov] HBASE-15224 Undo "hbase.increment.fast.but.narrow.consistency" option;

------------------------------------------
[...truncated 47292 lines...]
Running org.apache.hadoop.hbase.TestHBaseOnOtherDfsCluster
Tests run: 5, Failures: 0, Errors: 0, Skipped: 0, Time elapsed: 13.321 sec - in org.apache.hadoop.hbase.io.TestFileLink
Running org.apache.hadoop.hbase.procedure.TestZKProcedureControllers
Tests run: 4, Failures: 0, Errors: 0, Skipped: 0, Time elapsed: 2.173 sec - in org.apache.hadoop.hbase.procedure.TestZKProcedureControllers
Running org.apache.hadoop.hbase.ipc.TestHBaseClient
Tests run: 1, Failures: 0, Errors: 0, Skipped: 0, Time elapsed: 0.553 sec - in org.apache.hadoop.hbase.ipc.TestHBaseClient
Running org.apache.hadoop.hbase.ipc.TestProtoBufRpc
Running org.apache.hadoop.hbase.TestLocalHBaseCluster
Tests run: 1, Failures: 0, Errors: 0, Skipped: 0, Time elapsed: 2.488 sec - in org.apache.hadoop.hbase.ipc.TestProtoBufRpc
Running org.apache.hadoop.hbase.TestAcidGuarantees
Tests run: 1, Failures: 0, Errors: 0, Skipped: 0, Time elapsed: 15.518 sec - in org.apache.hadoop.hbase.TestHBaseOnOtherDfsCluster
Tests run: 1, Failures: 0, Errors: 0, Skipped: 0, Time elapsed: 12.177 sec - in org.apache.hadoop.hbase.TestLocalHBaseCluster
Tests run: 4, Failures: 0, Errors: 0, Skipped: 0, Time elapsed: 34.472 sec - in org.apache.hadoop.hbase.io.hfile.TestForceCacheImportantBlocks
Running org.apache.hadoop.hbase.zookeeper.TestRecoverableZooKeeper
Tests run: 1, Failures: 0, Errors: 0, Skipped: 0, Time elapsed: 1.272 sec - in org.apache.hadoop.hbase.zookeeper.TestRecoverableZooKeeper
Running org.apache.hadoop.hbase.zookeeper.TestZooKeeperNodeTracker
Tests run: 3, Failures: 0, Errors: 0, Skipped: 0, Time elapsed: 1.527 sec - in org.apache.hadoop.hbase.zookeeper.TestZooKeeperNodeTracker
Running org.apache.hadoop.hbase.zookeeper.TestZKTableStateManager
Running org.apache.hadoop.hbase.TestServerSideScanMetricsFromClientSide
Tests run: 1, Failures: 0, Errors: 0, Skipped: 0, Time elapsed: 1.095 sec - in org.apache.hadoop.hbase.zookeeper.TestZKTableStateManager
Running org.apache.hadoop.hbase.zookeeper.TestHQuorumPeer
Tests run: 4, Failures: 0, Errors: 0, Skipped: 0, Time elapsed: 1.515 sec - in org.apache.hadoop.hbase.zookeeper.TestHQuorumPeer
Tests run: 2, Failures: 0, Errors: 0, Skipped: 0, Time elapsed: 3.742 sec - in org.apache.hadoop.hbase.TestServerSideScanMetricsFromClientSide
Running org.apache.hadoop.hbase.zookeeper.TestZooKeeperACL
Tests run: 7, Failures: 0, Errors: 0, Skipped: 0, Time elapsed: 0.426 sec - in org.apache.hadoop.hbase.zookeeper.TestZooKeeperACL
Running org.apache.hadoop.hbase.zookeeper.TestZKLeaderManager
Tests run: 1, Failures: 0, Errors: 0, Skipped: 0, Time elapsed: 0.167 sec - in org.apache.hadoop.hbase.zookeeper.TestZKLeaderManager
Running org.apache.hadoop.hbase.zookeeper.TestZKMulti
Running org.apache.hadoop.hbase.zookeeper.lock.TestZKInterProcessReadWriteLock
Tests run: 12, Failures: 0, Errors: 0, Skipped: 0, Time elapsed: 2.124 sec - in org.apache.hadoop.hbase.zookeeper.TestZKMulti
Running org.apache.hadoop.hbase.TestMetaTableAccessorNoCluster
Tests run: 2, Failures: 0, Errors: 0, Skipped: 0, Time elapsed: 2.961 sec - in org.apache.hadoop.hbase.TestMetaTableAccessorNoCluster
Running org.apache.hadoop.hbase.TestZooKeeper
Running org.apache.hadoop.hbase.TestJMXListener
Tests run: 6, Failures: 0, Errors: 0, Skipped: 0, Time elapsed: 24.698 sec - in org.apache.hadoop.hbase.zookeeper.lock.TestZKInterProcessReadWriteLock
Tests run: 2, Failures: 0, Errors: 0, Skipped: 0, Time elapsed: 16.45 sec - in org.apache.hadoop.hbase.TestJMXListener
Running org.apache.hadoop.hbase.replication.regionserver.TestReplicationWALReaderManager
Running org.apache.hadoop.hbase.replication.regionserver.TestRegionReplicaReplicationEndpoint
Tests run: 72, Failures: 0, Errors: 0, Skipped: 0, Time elapsed: 151.847 sec - in org.apache.hadoop.hbase.io.hfile.TestCacheOnWrite
Running org.apache.hadoop.hbase.replication.regionserver.TestRegionReplicaReplicationEndpointNoMaster
Tests run: 3, Failures: 0, Errors: 0, Skipped: 0, Time elapsed: 94.862 sec - in org.apache.hadoop.hbase.TestAcidGuarantees
Running org.apache.hadoop.hbase.replication.regionserver.TestReplicationSink
Tests run: 6, Failures: 0, Errors: 0, Skipped: 0, Time elapsed: 5.848 sec - in org.apache.hadoop.hbase.replication.regionserver.TestReplicationSink
Running org.apache.hadoop.hbase.replication.regionserver.TestReplicationSourceManager
Tests run: 7, Failures: 0, Errors: 0, Skipped: 0, Time elapsed: 4.348 sec - in org.apache.hadoop.hbase.replication.regionserver.TestReplicationSourceManager
Tests run: 4, Failures: 0, Errors: 0, Skipped: 0, Time elapsed: 43.087 sec - in org.apache.hadoop.hbase.replication.regionserver.TestRegionReplicaReplicationEndpointNoMaster
Running org.apache.hadoop.hbase.replication.TestReplicationTrackerZKImpl
Tests run: 5, Failures: 0, Errors: 0, Skipped: 0, Time elapsed: 1.41 sec - in org.apache.hadoop.hbase.replication.TestReplicationTrackerZKImpl
Running org.apache.hadoop.hbase.replication.TestReplicationSyncUpToolWithBulkLoadedData
Tests run: 9, Failures: 0, Errors: 0, Skipped: 0, Time elapsed: 86.761 sec - in org.apache.hadoop.hbase.replication.regionserver.TestRegionReplicaReplicationEndpoint
Running org.apache.hadoop.hbase.replication.TestReplicationKillMasterRSCompressed
Running org.apache.hadoop.hbase.replication.TestReplicationKillMasterRS
Tests run: 1, Failures: 0, Errors: 0, Skipped: 0, Time elapsed: 17.521 sec - in org.apache.hadoop.hbase.replication.TestReplicationKillMasterRSCompressed
Running org.apache.hadoop.hbase.replication.TestMultiSlaveReplication
Tests run: 1, Failures: 0, Errors: 0, Skipped: 0, Time elapsed: 37.618 sec - in org.apache.hadoop.hbase.replication.TestReplicationSyncUpToolWithBulkLoadedData
Tests run: 1, Failures: 0, Errors: 0, Skipped: 0, Time elapsed: 15.044 sec - in org.apache.hadoop.hbase.replication.TestReplicationKillMasterRS
Running org.apache.hadoop.hbase.replication.TestReplicationChangingPeerRegionservers
Running org.apache.hadoop.hbase.replication.TestReplicationKillSlaveRS
Tests run: 1, Failures: 0, Errors: 0, Skipped: 0, Time elapsed: 5.266 sec - in org.apache.hadoop.hbase.replication.TestReplicationChangingPeerRegionservers
Tests run: 1, Failures: 0, Errors: 0, Skipped: 0, Time elapsed: 38.264 sec - in org.apache.hadoop.hbase.replication.TestMultiSlaveReplication
Tests run: 10, Failures: 0, Errors: 0, Skipped: 0, Time elapsed: 186.214 sec - in org.apache.hadoop.hbase.TestZooKeeper
Tests run: 1, Failures: 0, Errors: 0, Skipped: 0, Time elapsed: 13.817 sec - in org.apache.hadoop.hbase.replication.TestReplicationKillSlaveRS
Running org.apache.hadoop.hbase.replication.multiwal.TestReplicationKillMasterRSCompressedWithMultipleWAL
Running org.apache.hadoop.hbase.replication.multiwal.TestReplicationEndpointWithMultipleWAL
Running org.apache.hadoop.hbase.replication.multiwal.TestReplicationSyncUpToolWithMultipleWAL
Running org.apache.hadoop.hbase.replication.TestPerTableCFReplication
Tests run: 4, Failures: 0, Errors: 0, Skipped: 0, Time elapsed: 14.038 sec - in org.apache.hadoop.hbase.replication.multiwal.TestReplicationEndpointWithMultipleWAL
Tests run: 1, Failures: 0, Errors: 0, Skipped: 0, Time elapsed: 20.144 sec - in org.apache.hadoop.hbase.replication.multiwal.TestReplicationKillMasterRSCompressedWithMultipleWAL
Running org.apache.hadoop.hbase.replication.TestMasterReplication
Tests run: 8, Failures: 0, Errors: 0, Skipped: 0, Time elapsed: 212.202 sec - in org.apache.hadoop.hbase.replication.regionserver.TestReplicationWALReaderManager
Running org.apache.hadoop.hbase.replication.TestReplicationDisableInactivePeer
Tests run: 2, Failures: 0, Errors: 0, Skipped: 0, Time elapsed: 37.359 sec - in org.apache.hadoop.hbase.replication.TestPerTableCFReplication
Running org.apache.hadoop.hbase.replication.TestReplicationWithTags
Tests run: 1, Failures: 0, Errors: 0, Skipped: 0, Time elapsed: 2.836 sec - in org.apache.hadoop.hbase.replication.TestReplicationWithTags
Tests run: 1, Failures: 0, Errors: 0, Skipped: 0, Time elapsed: 54.929 sec - in org.apache.hadoop.hbase.replication.multiwal.TestReplicationSyncUpToolWithMultipleWAL
Tests run: 1, Failures: 0, Errors: 0, Skipped: 0, Time elapsed: 20.539 sec - in org.apache.hadoop.hbase.replication.TestReplicationDisableInactivePeer
Running org.apache.hadoop.hbase.replication.TestReplicationSource
Tests run: 1, Failures: 0, Errors: 0, Skipped: 0, Time elapsed: 0.653 sec - in org.apache.hadoop.hbase.replication.TestReplicationSource
Running org.apache.hadoop.hbase.replication.TestReplicationStateZKImpl
Tests run: 9, Failures: 0, Errors: 0, Skipped: 0, Time elapsed: 1.626 sec - in org.apache.hadoop.hbase.replication.TestReplicationStateZKImpl
Running org.apache.hadoop.hbase.replication.TestReplicationEndpoint
Running org.apache.hadoop.hbase.fs.TestBlockReorder
Running org.apache.hadoop.hbase.replication.TestReplicationSmallTests
Tests run: 4, Failures: 0, Errors: 0, Skipped: 0, Time elapsed: 10.838 sec - in org.apache.hadoop.hbase.replication.TestReplicationEndpoint
Running org.apache.hadoop.hbase.replication.TestReplicationSyncUpTool
Running org.apache.hadoop.hbase.trace.TestHTraceHooks
Tests run: 3, Failures: 0, Errors: 0, Skipped: 0, Time elapsed: 27.339 sec - in org.apache.hadoop.hbase.fs.TestBlockReorder
Tests run: 1, Failures: 0, Errors: 0, Skipped: 0, Time elapsed: 2.412 sec - in org.apache.hadoop.hbase.trace.TestHTraceHooks
Running org.apache.hadoop.hbase.TestMovedRegionsCleaner
Tests run: 1, Failures: 0, Errors: 0, Skipped: 0, Time elapsed: 12.215 sec - in org.apache.hadoop.hbase.TestMovedRegionsCleaner
Running org.apache.hadoop.hbase.TestMetaTableLocator
Tests run: 7, Failures: 0, Errors: 0, Skipped: 0, Time elapsed: 4.256 sec - in org.apache.hadoop.hbase.TestMetaTableLocator
Running org.apache.hadoop.hbase.namespace.TestNamespaceAuditor
Tests run: 1, Failures: 0, Errors: 0, Skipped: 0, Time elapsed: 53.269 sec - in org.apache.hadoop.hbase.replication.TestReplicationSyncUpTool
Tests run: 13, Failures: 0, Errors: 0, Skipped: 0, Time elapsed: 72.762 sec - in org.apache.hadoop.hbase.replication.TestReplicationSmallTests
Running org.apache.hadoop.hbase.mapred.TestTableSnapshotInputFormat
Running org.apache.hadoop.hbase.mapred.TestTableMapReduceUtil
Running org.apache.hadoop.hbase.mapred.TestMultiTableSnapshotInputFormat
Tests run: 7, Failures: 0, Errors: 0, Skipped: 0, Time elapsed: 161.827 sec - in org.apache.hadoop.hbase.replication.TestMasterReplication
Tests run: 4, Failures: 0, Errors: 0, Skipped: 0, Time elapsed: 38.778 sec - in org.apache.hadoop.hbase.mapred.TestMultiTableSnapshotInputFormat
Running org.apache.hadoop.hbase.mapred.TestTableInputFormat
Running org.apache.hadoop.hbase.mapred.TestTableMapReduce
Tests run: 12, Failures: 0, Errors: 0, Skipped: 1, Time elapsed: 107.493 sec - in org.apache.hadoop.hbase.namespace.TestNamespaceAuditor
Tests run: 2, Failures: 0, Errors: 0, Skipped: 0, Time elapsed: 19.151 sec - in org.apache.hadoop.hbase.mapred.TestTableMapReduce
Running org.apache.hadoop.hbase.TestMultiVersions
Tests run: 4, Failures: 0, Errors: 0, Skipped: 0, Time elapsed: 97.283 sec - in org.apache.hadoop.hbase.mapred.TestTableMapReduceUtil
Tests run: 7, Failures: 0, Errors: 0, Skipped: 0, Time elapsed: 104.065 sec - in org.apache.hadoop.hbase.mapred.TestTableSnapshotInputFormat
Tests run: 3, Failures: 0, Errors: 0, Skipped: 0, Time elapsed: 10.867 sec - in org.apache.hadoop.hbase.TestMultiVersions
Tests run: 8, Failures: 0, Errors: 0, Skipped: 0, Time elapsed: 95.693 sec - in org.apache.hadoop.hbase.mapred.TestTableInputFormat

Results :

Failed tests: 
org.apache.hadoop.hbase.regionserver.TestHRegion.testFlushSizeAccounting(org.apache.hadoop.hbase.regionserver.TestHRegion)
  Run 1: TestHRegion.testFlushSizeAccounting:465 expected:<384> but was:<368>
  Run 2: TestHRegion.testFlushSizeAccounting:465 expected:<384> but was:<368>
  Run 3: TestHRegion.testFlushSizeAccounting:465 expected:<384> but was:<368>

org.apache.hadoop.hbase.regionserver.TestHRegion.testMemstoreSizeAccountingWithFailedPostBatchMutate(org.apache.hadoop.hbase.regionserver.TestHRegion)
  Run 1: TestHRegion.testMemstoreSizeAccountingWithFailedPostBatchMutate:434 memstoreSize
should be incremented expected:<448> but was:<432>
  Run 2: TestHRegion.testMemstoreSizeAccountingWithFailedPostBatchMutate:434 memstoreSize
should be incremented expected:<448> but was:<432>
  Run 3: TestHRegion.testMemstoreSizeAccountingWithFailedPostBatchMutate:434 memstoreSize
should be incremented expected:<448> but was:<432>

Flaked tests: 
org.apache.hadoop.hbase.coprocessor.TestRowProcessorEndpoint.testMultipleRows(org.apache.hadoop.hbase.coprocessor.TestRowProcessorEndpoint)
  Run 1: TestRowProcessorEndpoint.testMultipleRows:246 expected:<3> but was:<2>
  Run 2: PASS


Tests run: 2552, Failures: 2, Errors: 0, Skipped: 56, Flakes: 1

[INFO] ------------------------------------------------------------------------
[INFO] Reactor Summary:
[INFO] 
[INFO] Apache HBase ...................................... SUCCESS [49.757s]
[INFO] Apache HBase - Checkstyle ......................... SUCCESS [4.649s]
[INFO] Apache HBase - Resource Bundle .................... SUCCESS [0.227s]
[INFO] Apache HBase - Annotations ........................ SUCCESS [1.027s]
[INFO] Apache HBase - Protocol ........................... SUCCESS [14.974s]
[INFO] Apache HBase - Common ............................. SUCCESS [2:04.053s]
[INFO] Apache HBase - Procedure .......................... SUCCESS [3:06.824s]
[INFO] Apache HBase - Client ............................. SUCCESS [1:23.742s]
[INFO] Apache HBase - Hadoop Compatibility ............... SUCCESS [7.965s]
[INFO] Apache HBase - Hadoop Two Compatibility ........... SUCCESS [9.976s]
[INFO] Apache HBase - Prefix Tree ........................ SUCCESS [9.922s]
[INFO] Apache HBase - Server ............................. FAILURE [1:23:08.154s]
[INFO] Apache HBase - Testing Util ....................... SKIPPED
[INFO] Apache HBase - Thrift ............................. SKIPPED
[INFO] Apache HBase - Rest ............................... SKIPPED
[INFO] Apache HBase - Shell .............................. SKIPPED
[INFO] Apache HBase - Integration Tests .................. SKIPPED
[INFO] Apache HBase - Examples ........................... SKIPPED
[INFO] Apache HBase - External Block Cache ............... SKIPPED
[INFO] Apache HBase - Assembly ........................... SKIPPED
[INFO] Apache HBase - Shaded ............................. SKIPPED
[INFO] Apache HBase - Shaded - Client .................... SKIPPED
[INFO] Apache HBase - Shaded - Server .................... SKIPPED
[INFO] ------------------------------------------------------------------------
[INFO] BUILD FAILURE
[INFO] ------------------------------------------------------------------------
[INFO] Total time: 1:31:38.232s
[INFO] Finished at: Sat Jun 18 01:32:46 UTC 2016
[INFO] Final Memory: 95M/722M
[INFO] ------------------------------------------------------------------------
[ERROR] Failed to execute goal org.apache.maven.plugins:maven-surefire-plugin:2.18.1:test
(secondPartTestsExecution) on project hbase-server: There are test failures.
[ERROR] 
[ERROR] Please refer to <https://builds.apache.org/job/HBase-1.4/jdk=latest1.7,label=yahoo-not-h2/ws/hbase-server/target/surefire-reports>
for the individual test results.
[ERROR] -> [Help 1]
[ERROR] 
[ERROR] To see the full stack trace of the errors, re-run Maven with the -e switch.
[ERROR] Re-run Maven using the -X switch to enable full debug logging.
[ERROR] 
[ERROR] For more information about the errors and possible solutions, please read the following
articles:
[ERROR] [Help 1] http://cwiki.apache.org/confluence/display/MAVEN/MojoFailureException
[ERROR] 
[ERROR] After correcting the problems, you can resume the build with the command
[ERROR]   mvn <goals> -rf :hbase-server
Build step 'Invoke top-level Maven targets' marked build as failure
Performing Post build task...
Match found for :.* : True
Logical operation result is TRUE
Running script  : # Post-build task script. TODO: Check this in and have all builds reference
check-in.
pwd && ls
# NOTE!!!! The below code has been copied and pasted from ./dev-tools/run-test.sh
# Do not change here without syncing there and vice-versa.
ZOMBIE_TESTS_COUNT=`jps -v | grep surefirebooter | grep -e '-Dhbase.test' | wc -l`
if [[ $ZOMBIE_TESTS_COUNT != 0 ]] ; then
 echo "Suspicious java process found - waiting 30s to see if there are just slow to stop"
 sleep 30
 ZOMBIE_TESTS_COUNT=`jps -v | grep surefirebooter | grep -e '-Dhbase.test' | wc -l`
 if [[ $ZOMBIE_TESTS_COUNT != 0 ]] ; then
   echo " {color:red}There appear to be $ZOMBIE_TESTS_COUNT zombie tests{color}, they should
have been killed by surefire but survived"
   jps -v | grep surefirebooter | grep -e '-Dhbase.test'
   jps -v | grep surefirebooter | grep -e '-Dhbase.test' | cut -d ' ' -f 1 | xargs -n 1 jstack
   # Exit with error
   exit 1
 else
   echo "We're ok: there is no zombie test, but some tests took some time to stop"
 fi
else
  echo "We're ok: there is no zombie test"
fi
[yahoo-not-h2] $ /bin/bash -xe /tmp/hudson4000322533420576393.sh
+ pwd
<https://builds.apache.org/job/HBase-1.4/jdk=latest1.7,label=yahoo-not-h2/ws/>
+ ls
bin
CHANGES.txt
conf
dev-support
hbase-annotations
hbase-assembly
hbase-checkstyle
hbase-client
hbase-common
hbase-examples
hbase-external-blockcache
hbase-hadoop2-compat
hbase-hadoop-compat
hbase-it
hbase-native-client
hbase-prefix-tree
hbase-procedure
hbase-protocol
hbase-resource-bundle
hbase-rest
hbase-server
hbase-shaded
hbase-shell
hbase-testing-util
hbase-thrift
LICENSE.txt
NOTICE.txt
pom.xml
README.txt
src
target
++ jps -v
++ grep surefirebooter
++ grep -e -Dhbase.test
++ wc -l
+ ZOMBIE_TESTS_COUNT=0
+ [[ 0 != 0 ]]
+ echo 'We'\''re ok: there is no zombie test'
We're ok: there is no zombie test
POST BUILD TASK : SUCCESS
END OF POST BUILD TASK : 0
Archiving artifacts
Recording test results

Mime
View raw message