hbase-builds mailing list archives

Site index · List index
Message view « Date » · « Thread »
Top « Date » · « Thread »
From Apache Jenkins Server <jenk...@builds.apache.org>
Subject Build failed in Jenkins: HBase-Trunk_matrix » latest1.7,yahoo-not-h2 #1084
Date Tue, 21 Jun 2016 00:17:58 GMT
See <https://builds.apache.org/job/HBase-Trunk_matrix/jdk=latest1.7,label=yahoo-not-h2/1084/changes>

Changes:

[tedyu] HBASE-16059 Region normalizer fails to trigger merge action where one of

[matteo.bertozzi] HBASE-14644 Region in transition metric is broken -- addendum (Huaxiang

[jerryjch] HBASE-15870 Specify columns in REST multi gets (Matt Warhaftig)

------------------------------------------
[...truncated 5753 lines...]
Running org.apache.hadoop.hbase.client.TestCheckAndMutate
Tests run: 1, Failures: 0, Errors: 0, Skipped: 0, Time elapsed: 5.31 sec - in org.apache.hadoop.hbase.client.TestCheckAndMutate
Running org.apache.hadoop.hbase.client.TestMetaCache
Tests run: 2, Failures: 0, Errors: 0, Skipped: 0, Time elapsed: 9.426 sec - in org.apache.hadoop.hbase.client.TestMetaCache
Tests run: 9, Failures: 0, Errors: 0, Skipped: 0, Time elapsed: 210.302 sec - in org.apache.hadoop.hbase.client.TestMobSnapshotFromClient
Running org.apache.hadoop.hbase.client.replication.TestReplicationAdminWithClusters
Tests run: 9, Failures: 0, Errors: 0, Skipped: 0, Time elapsed: 106.639 sec - in org.apache.hadoop.hbase.client.TestFromClientSide3
Running org.apache.hadoop.hbase.client.replication.TestReplicationAdminWithTwoDifferentZKClusters
Running org.apache.hadoop.hbase.client.replication.TestReplicationAdmin
Tests run: 6, Failures: 0, Errors: 0, Skipped: 0, Time elapsed: 1.112 sec - in org.apache.hadoop.hbase.client.replication.TestReplicationAdmin
Tests run: 2, Failures: 0, Errors: 0, Skipped: 0, Time elapsed: 20.382 sec - in org.apache.hadoop.hbase.client.replication.TestReplicationAdminWithTwoDifferentZKClusters
Running org.apache.hadoop.hbase.client.TestClientScannerRPCTimeout
Tests run: 10, Failures: 0, Errors: 0, Skipped: 0, Time elapsed: 53.44 sec - in org.apache.hadoop.hbase.client.replication.TestReplicationAdminWithClusters
Tests run: 1, Failures: 0, Errors: 0, Skipped: 0, Time elapsed: 14.878 sec - in org.apache.hadoop.hbase.client.TestClientScannerRPCTimeout
Running org.apache.hadoop.hbase.client.TestIncrementFromClientSideWithCoprocessor
Running org.apache.hadoop.hbase.client.TestAdmin2
Tests run: 6, Failures: 0, Errors: 0, Skipped: 0, Time elapsed: 14.62 sec - in org.apache.hadoop.hbase.client.TestIncrementFromClientSideWithCoprocessor
Running org.apache.hadoop.hbase.client.TestRpcControllerFactory
Tests run: 2, Failures: 0, Errors: 0, Skipped: 0, Time elapsed: 3.394 sec - in org.apache.hadoop.hbase.client.TestRpcControllerFactory
Tests run: 5, Failures: 0, Errors: 0, Skipped: 0, Time elapsed: 240.385 sec - in org.apache.hadoop.hbase.client.TestCloneSnapshotFromClientWithRegionReplicas
Running org.apache.hadoop.hbase.client.TestClientOperationInterrupt
Running org.apache.hadoop.hbase.client.TestRestoreSnapshotFromClient
Running org.apache.hadoop.hbase.mob.TestMobDataBlockEncoding
Tests run: 1, Failures: 0, Errors: 0, Skipped: 0, Time elapsed: 15.162 sec - in org.apache.hadoop.hbase.mob.TestMobDataBlockEncoding
Running org.apache.hadoop.hbase.mob.compactions.TestPartitionedMobCompactor
Tests run: 1, Failures: 0, Errors: 0, Skipped: 0, Time elapsed: 54.441 sec - in org.apache.hadoop.hbase.client.TestClientOperationInterrupt
Tests run: 6, Failures: 0, Errors: 0, Skipped: 0, Time elapsed: 26.402 sec - in org.apache.hadoop.hbase.mob.compactions.TestPartitionedMobCompactor
Tests run: 75, Failures: 0, Errors: 0, Skipped: 4, Time elapsed: 355.986 sec - in org.apache.hadoop.hbase.client.TestFromClientSide
Running org.apache.hadoop.hbase.mob.TestExpiredMobFileCleaner
Running org.apache.hadoop.hbase.mob.mapreduce.TestMobSweepReducer
Tests run: 1, Failures: 0, Errors: 0, Skipped: 0, Time elapsed: 9.158 sec - in org.apache.hadoop.hbase.mob.mapreduce.TestMobSweepReducer
Running org.apache.hadoop.hbase.mob.mapreduce.TestMobSweepJob
Tests run: 3, Failures: 0, Errors: 0, Skipped: 0, Time elapsed: 3.267 sec - in org.apache.hadoop.hbase.mob.mapreduce.TestMobSweepJob
Tests run: 26, Failures: 0, Errors: 0, Skipped: 0, Time elapsed: 125.392 sec - in org.apache.hadoop.hbase.client.TestAdmin2
Tests run: 1, Failures: 0, Errors: 0, Skipped: 0, Time elapsed: 26.309 sec - in org.apache.hadoop.hbase.mob.TestExpiredMobFileCleaner
Running org.apache.hadoop.hbase.mob.TestDefaultMobStoreFlusher
Tests run: 2, Failures: 0, Errors: 0, Skipped: 0, Time elapsed: 6.532 sec - in org.apache.hadoop.hbase.mob.TestDefaultMobStoreFlusher
Running org.apache.hadoop.hbase.master.TestWarmupRegion
Running org.apache.hadoop.hbase.master.procedure.TestDisableTableProcedure
Running org.apache.hadoop.hbase.master.procedure.TestAddColumnFamilyProcedure
Running org.apache.hadoop.hbase.master.procedure.TestCreateNamespaceProcedure
Tests run: 4, Failures: 0, Errors: 0, Skipped: 0, Time elapsed: 11.55 sec - in org.apache.hadoop.hbase.master.procedure.TestDisableTableProcedure
Tests run: 8, Failures: 0, Errors: 0, Skipped: 0, Time elapsed: 10.345 sec - in org.apache.hadoop.hbase.master.procedure.TestCreateNamespaceProcedure
Tests run: 6, Failures: 0, Errors: 0, Skipped: 0, Time elapsed: 20.357 sec - in org.apache.hadoop.hbase.master.procedure.TestAddColumnFamilyProcedure
Running org.apache.hadoop.hbase.master.procedure.TestProcedureAdmin
Tests run: 5, Failures: 0, Errors: 0, Skipped: 0, Time elapsed: 10.673 sec - in org.apache.hadoop.hbase.master.procedure.TestProcedureAdmin
Running org.apache.hadoop.hbase.master.procedure.TestDeleteColumnFamilyProcedure
Running org.apache.hadoop.hbase.master.procedure.TestDeleteNamespaceProcedure
Tests run: 1, Failures: 0, Errors: 0, Skipped: 0, Time elapsed: 49.925 sec - in org.apache.hadoop.hbase.master.TestWarmupRegion
Tests run: 7, Failures: 0, Errors: 0, Skipped: 0, Time elapsed: 14.365 sec - in org.apache.hadoop.hbase.master.procedure.TestDeleteNamespaceProcedure
Running org.apache.hadoop.hbase.master.procedure.TestDeleteColumnFamilyProcedureFromClient
Running org.apache.hadoop.hbase.master.procedure.TestEnableTableProcedure
Tests run: 8, Failures: 0, Errors: 0, Skipped: 0, Time elapsed: 25.875 sec - in org.apache.hadoop.hbase.master.procedure.TestDeleteColumnFamilyProcedure
Running org.apache.hadoop.hbase.master.procedure.TestMasterProcedureEvents
Tests run: 5, Failures: 0, Errors: 0, Skipped: 0, Time elapsed: 20.459 sec - in org.apache.hadoop.hbase.master.procedure.TestEnableTableProcedure
Tests run: 2, Failures: 0, Errors: 0, Skipped: 0, Time elapsed: 23.405 sec - in org.apache.hadoop.hbase.master.procedure.TestDeleteColumnFamilyProcedureFromClient
Running org.apache.hadoop.hbase.master.procedure.TestModifyColumnFamilyProcedure
Tests run: 2, Failures: 0, Errors: 0, Skipped: 0, Time elapsed: 16.236 sec - in org.apache.hadoop.hbase.master.procedure.TestMasterProcedureEvents
Running org.apache.hadoop.hbase.master.procedure.TestWALProcedureStoreOnHDFS
Running org.apache.hadoop.hbase.master.procedure.TestCreateTableProcedure
Running org.apache.hadoop.hbase.master.procedure.TestTableDescriptorModificationFromClient
Tests run: 5, Failures: 0, Errors: 0, Skipped: 0, Time elapsed: 21.214 sec - in org.apache.hadoop.hbase.master.procedure.TestModifyColumnFamilyProcedure
Running org.apache.hadoop.hbase.master.procedure.TestTruncateTableProcedure
Tests run: 9, Failures: 0, Errors: 0, Skipped: 0, Time elapsed: 32.944 sec - in org.apache.hadoop.hbase.master.procedure.TestCreateTableProcedure
Running org.apache.hadoop.hbase.master.TestMasterFailoverBalancerPersistence
Tests run: 7, Failures: 0, Errors: 0, Skipped: 0, Time elapsed: 36.243 sec - in org.apache.hadoop.hbase.master.procedure.TestTableDescriptorModificationFromClient
Running org.apache.hadoop.hbase.master.TestMasterFailover
Tests run: 3, Failures: 0, Errors: 0, Skipped: 0, Time elapsed: 42.942 sec - in org.apache.hadoop.hbase.master.procedure.TestWALProcedureStoreOnHDFS
Tests run: 6, Failures: 0, Errors: 0, Skipped: 0, Time elapsed: 30.88 sec - in org.apache.hadoop.hbase.master.procedure.TestTruncateTableProcedure
Tests run: 1, Failures: 0, Errors: 0, Skipped: 0, Time elapsed: 23.744 sec - in org.apache.hadoop.hbase.master.TestMasterFailoverBalancerPersistence
Running org.apache.hadoop.hbase.master.TestTableStateManager
Running org.apache.hadoop.hbase.master.TestMasterShutdown
Running org.apache.hadoop.hbase.master.TestMetaShutdownHandler
Tests run: 1, Failures: 0, Errors: 0, Skipped: 0, Time elapsed: 24.559 sec - in org.apache.hadoop.hbase.master.TestTableStateManager
Tests run: 2, Failures: 0, Errors: 0, Skipped: 0, Time elapsed: 24.744 sec - in org.apache.hadoop.hbase.master.TestMasterShutdown
Tests run: 5, Failures: 0, Errors: 0, Skipped: 0, Time elapsed: 299.189 sec - in org.apache.hadoop.hbase.client.TestRestoreSnapshotFromClient
Running org.apache.hadoop.hbase.master.TestMasterNoCluster
Running org.apache.hadoop.hbase.master.balancer.TestStochasticLoadBalancer
Tests run: 3, Failures: 0, Errors: 0, Skipped: 0, Time elapsed: 52.706 sec - in org.apache.hadoop.hbase.master.TestMasterFailover
Tests run: 1, Failures: 0, Errors: 0, Skipped: 0, Time elapsed: 33.101 sec - in org.apache.hadoop.hbase.master.TestMetaShutdownHandler
Running org.apache.hadoop.hbase.master.balancer.TestDefaultLoadBalancer
Running org.apache.hadoop.hbase.master.balancer.TestStochasticLoadBalancer2
Tests run: 1, Failures: 0, Errors: 0, Skipped: 0, Time elapsed: 5.391 sec - in org.apache.hadoop.hbase.master.balancer.TestDefaultLoadBalancer
Running org.apache.hadoop.hbase.master.TestMasterFileSystem
Tests run: 1, Failures: 0, Errors: 0, Skipped: 0, Time elapsed: 1.613 sec - in org.apache.hadoop.hbase.master.TestMasterFileSystem
Tests run: 3, Failures: 0, Errors: 0, Skipped: 0, Time elapsed: 16.83 sec - in org.apache.hadoop.hbase.master.TestMasterNoCluster
Running org.apache.hadoop.hbase.master.balancer.TestBaseLoadBalancer
Tests run: 6, Failures: 0, Errors: 0, Skipped: 0, Time elapsed: 1.443 sec - in org.apache.hadoop.hbase.master.balancer.TestBaseLoadBalancer
Running org.apache.hadoop.hbase.master.TestActiveMasterManager
Tests run: 2, Failures: 0, Errors: 0, Skipped: 0, Time elapsed: 2.798 sec - in org.apache.hadoop.hbase.master.TestActiveMasterManager
Running org.apache.hadoop.hbase.master.TestRestartCluster
Running org.apache.hadoop.hbase.master.TestMasterWalManager
Running org.apache.hadoop.hbase.master.TestRegionPlacement2
Tests run: 1, Failures: 0, Errors: 0, Skipped: 0, Time elapsed: 2.333 sec - in org.apache.hadoop.hbase.master.TestMasterWalManager
Running org.apache.hadoop.hbase.master.TestMasterTransitions
Tests run: 3, Failures: 0, Errors: 0, Skipped: 3, Time elapsed: 0.004 sec - in org.apache.hadoop.hbase.master.TestMasterTransitions
Tests run: 2, Failures: 0, Errors: 0, Skipped: 0, Time elapsed: 4 sec - in org.apache.hadoop.hbase.master.TestRegionPlacement2
Running org.apache.hadoop.hbase.master.TestTableLockManager
Running org.apache.hadoop.hbase.master.handler.TestEnableTableHandler
Tests run: 2, Failures: 0, Errors: 0, Skipped: 0, Time elapsed: 57.453 sec - in org.apache.hadoop.hbase.master.TestRestartCluster
Running org.apache.hadoop.hbase.master.TestGetLastFlushedSequenceId
Tests run: 1, Failures: 0, Errors: 0, Skipped: 0, Time elapsed: 21.245 sec - in org.apache.hadoop.hbase.master.TestGetLastFlushedSequenceId
Running org.apache.hadoop.hbase.master.TestRollingRestart
Tests run: 2, Failures: 0, Errors: 0, Skipped: 0, Time elapsed: 103.593 sec - in org.apache.hadoop.hbase.master.handler.TestEnableTableHandler
Tests run: 1, Failures: 0, Errors: 0, Skipped: 0, Time elapsed: 42.861 sec - in org.apache.hadoop.hbase.master.TestRollingRestart
Running org.apache.hadoop.hbase.master.TestSplitLogManager
Running org.apache.hadoop.hbase.master.TestHMasterRPCException
Tests run: 1, Failures: 0, Errors: 0, Skipped: 0, Time elapsed: 6.735 sec - in org.apache.hadoop.hbase.master.TestHMasterRPCException
Tests run: 4, Failures: 0, Errors: 0, Skipped: 0, Time elapsed: 123.145 sec - in org.apache.hadoop.hbase.master.TestTableLockManager
Running org.apache.hadoop.hbase.master.TestClusterStatusPublisher
Tests run: 3, Failures: 0, Errors: 0, Skipped: 0, Time elapsed: 0.438 sec - in org.apache.hadoop.hbase.master.TestClusterStatusPublisher
Running org.apache.hadoop.hbase.master.TestGetInfoPort
Running org.apache.hadoop.hbase.master.TestMaster
Tests run: 1, Failures: 0, Errors: 0, Skipped: 0, Time elapsed: 15.027 sec - in org.apache.hadoop.hbase.master.TestGetInfoPort
Tests run: 4, Failures: 0, Errors: 0, Skipped: 0, Time elapsed: 22.351 sec - in org.apache.hadoop.hbase.master.TestMaster
Running org.apache.hadoop.hbase.master.TestDeadServer
Tests run: 4, Failures: 0, Errors: 0, Skipped: 0, Time elapsed: 2.798 sec - in org.apache.hadoop.hbase.master.TestDeadServer
Running org.apache.hadoop.hbase.master.normalizer.TestSimpleRegionNormalizerOnCluster
Running org.apache.hadoop.hbase.master.TestAssignmentManagerMetrics
Tests run: 1, Failures: 0, Errors: 0, Skipped: 0, Time elapsed: 9.508 sec - in org.apache.hadoop.hbase.master.TestAssignmentManagerMetrics
Running org.apache.hadoop.hbase.master.TestMasterStatusServlet
Tests run: 4, Failures: 0, Errors: 0, Skipped: 0, Time elapsed: 2.552 sec - in org.apache.hadoop.hbase.master.TestMasterStatusServlet
Running org.apache.hadoop.hbase.master.cleaner.TestHFileLinkCleaner
Tests run: 1, Failures: 0, Errors: 0, Skipped: 0, Time elapsed: 11.136 sec - in org.apache.hadoop.hbase.master.cleaner.TestHFileLinkCleaner
Tests run: 2, Failures: 0, Errors: 0, Skipped: 0, Time elapsed: 46.032 sec - in org.apache.hadoop.hbase.master.normalizer.TestSimpleRegionNormalizerOnCluster
Running org.apache.hadoop.hbase.master.cleaner.TestSnapshotFromMaster
Running org.apache.hadoop.hbase.master.cleaner.TestHFileCleaner
Tests run: 3, Failures: 0, Errors: 0, Skipped: 0, Time elapsed: 1.869 sec - in org.apache.hadoop.hbase.master.cleaner.TestHFileCleaner
Running org.apache.hadoop.hbase.master.cleaner.TestLogsCleaner
Tests run: 3, Failures: 0, Errors: 0, Skipped: 0, Time elapsed: 12.313 sec - in org.apache.hadoop.hbase.master.cleaner.TestLogsCleaner
Tests run: 15, Failures: 0, Errors: 0, Skipped: 1, Time elapsed: 144.456 sec - in org.apache.hadoop.hbase.master.TestSplitLogManager
Running org.apache.hadoop.hbase.master.TestDistributedLogSplitting
Tests run: 4, Failures: 0, Errors: 0, Skipped: 0, Time elapsed: 38.029 sec - in org.apache.hadoop.hbase.master.cleaner.TestSnapshotFromMaster
Running org.apache.hadoop.hbase.master.TestMasterMetrics
Tests run: 3, Failures: 0, Errors: 0, Skipped: 0, Time elapsed: 1.856 sec - in org.apache.hadoop.hbase.master.TestMasterMetrics
Running org.apache.hadoop.hbase.master.TestMasterRestartAfterDisablingTable
Running org.apache.hadoop.hbase.master.TestMasterOperationsForRegionReplicas
Tests run: 1, Failures: 0, Errors: 0, Skipped: 0, Time elapsed: 27.471 sec - in org.apache.hadoop.hbase.master.TestMasterRestartAfterDisablingTable
Running org.apache.hadoop.hbase.master.TestRegionPlacement
Tests run: 2, Failures: 0, Errors: 0, Skipped: 2, Time elapsed: 0.002 sec - in org.apache.hadoop.hbase.master.TestRegionPlacement
Tests run: 18, Failures: 0, Errors: 0, Skipped: 15, Time elapsed: 55.074 sec - in org.apache.hadoop.hbase.master.TestDistributedLogSplitting
Tests run: 2, Failures: 0, Errors: 0, Skipped: 0, Time elapsed: 33.534 sec - in org.apache.hadoop.hbase.master.TestMasterOperationsForRegionReplicas
Running org.apache.hadoop.hbase.master.TestAssignmentListener
Running org.apache.hadoop.hbase.master.snapshot.TestSnapshotFileCache
Running org.apache.hadoop.hbase.master.TestMasterMetricsWrapper
Tests run: 2, Failures: 0, Errors: 0, Skipped: 0, Time elapsed: 19.28 sec - in org.apache.hadoop.hbase.master.TestAssignmentListener
Tests run: 1, Failures: 0, Errors: 0, Skipped: 0, Time elapsed: 2.912 sec - in org.apache.hadoop.hbase.master.TestMasterMetricsWrapper
Running org.apache.hadoop.hbase.snapshot.TestSnapshotClientRetries
Tests run: 21, Failures: 0, Errors: 0, Skipped: 1, Time elapsed: 418.955 sec - in org.apache.hadoop.hbase.master.balancer.TestStochasticLoadBalancer
Running org.apache.hadoop.hbase.snapshot.TestSnapshotDescriptionUtils
Tests run: 2, Failures: 0, Errors: 0, Skipped: 0, Time elapsed: 0.165 sec - in org.apache.hadoop.hbase.snapshot.TestSnapshotDescriptionUtils
Tests run: 2, Failures: 0, Errors: 0, Skipped: 0, Time elapsed: 30.054 sec - in org.apache.hadoop.hbase.snapshot.TestSnapshotClientRetries
Running org.apache.hadoop.hbase.snapshot.TestExportSnapshot
Tests run: 4, Failures: 0, Errors: 0, Skipped: 0, Time elapsed: 61.905 sec - in org.apache.hadoop.hbase.master.snapshot.TestSnapshotFileCache
Running org.apache.hadoop.hbase.snapshot.TestMobRestoreFlushSnapshotFromClient
Running org.apache.hadoop.hbase.snapshot.TestMobSecureExportSnapshot
Running org.apache.hadoop.hbase.snapshot.TestMobExportSnapshot
Tests run: 4, Failures: 0, Errors: 0, Skipped: 0, Time elapsed: 546.715 sec - in org.apache.hadoop.hbase.master.balancer.TestStochasticLoadBalancer2
Running org.apache.hadoop.hbase.snapshot.TestRestoreFlushSnapshotFromClient
Tests run: 5, Failures: 0, Errors: 0, Skipped: 0, Time elapsed: 173.435 sec - in org.apache.hadoop.hbase.snapshot.TestMobRestoreFlushSnapshotFromClient
Running org.apache.hadoop.hbase.snapshot.TestSecureExportSnapshot
Tests run: 5, Failures: 0, Errors: 0, Skipped: 0, Time elapsed: 90.757 sec - in org.apache.hadoop.hbase.snapshot.TestRestoreFlushSnapshotFromClient
Tests run: 9, Failures: 0, Errors: 0, Skipped: 0, Time elapsed: 506.857 sec - in org.apache.hadoop.hbase.snapshot.TestExportSnapshot
Tests run: 9, Failures: 0, Errors: 0, Skipped: 0, Time elapsed: 515.076 sec - in org.apache.hadoop.hbase.snapshot.TestMobSecureExportSnapshot
Tests run: 9, Failures: 0, Errors: 0, Skipped: 0, Time elapsed: 551.503 sec - in org.apache.hadoop.hbase.snapshot.TestMobExportSnapshot
Tests run: 9, Failures: 0, Errors: 0, Skipped: 0, Time elapsed: 443.445 sec - in org.apache.hadoop.hbase.snapshot.TestSecureExportSnapshot

Results :

Failed tests: 
  TestEncryptionKeyRotation.testCFKeyRotation:150 Store file hdfs://localhost:35720/user/jenkins/test-data/2579559d-3c99-482f-823d-edf0c262e495/data/default/testCFKeyRotation/982549fde923817a4e430de72ee31b76/cf/cee30eee5d52442db8914137e6318a4e
has incorrect key
  TestReplicationKillSlaveRS.killOneSlaveRS:34->TestReplicationKillRS.loadTableAndKillRS:88
Waited too much time for queueFailover replication. Waited 16380ms.
Tests in error: 
  TestFullLogReconstruction.testReconstruction:91 » Runtime org.apache.hadoop.hb...
  TestMobRestoreSnapshotFromClient>TestRestoreSnapshotFromClient.setup:127->countRows:74
» Runtime
  TestRegionReplicas.testRegionReplicaGets:153->Object.wait:-2 » TestTimedOut te...

Tests run: 2265, Failures: 2, Errors: 3, Skipped: 45

[INFO] ------------------------------------------------------------------------
[INFO] Reactor Summary:
[INFO] 
[INFO] Apache HBase ...................................... SUCCESS [  3.987 s]
[INFO] Apache HBase - Checkstyle ......................... SUCCESS [  0.986 s]
[INFO] Apache HBase - Resource Bundle .................... SUCCESS [  0.300 s]
[INFO] Apache HBase - Annotations ........................ SUCCESS [  0.347 s]
[INFO] Apache HBase - Protocol ........................... SUCCESS [  3.555 s]
[INFO] Apache HBase - Common ............................. SUCCESS [02:00 min]
[INFO] Apache HBase - Procedure .......................... SUCCESS [01:56 min]
[INFO] Apache HBase - Client ............................. SUCCESS [ 55.229 s]
[INFO] Apache HBase - Hadoop Compatibility ............... SUCCESS [  9.031 s]
[INFO] Apache HBase - Hadoop Two Compatibility ........... SUCCESS [ 13.738 s]
[INFO] Apache HBase - Prefix Tree ........................ SUCCESS [ 15.918 s]
[INFO] Apache HBase - Server ............................. FAILURE [  02:05 h]
[INFO] Apache HBase - Testing Util ....................... SKIPPED
[INFO] Apache HBase - Thrift ............................. SKIPPED
[INFO] Apache HBase - RSGroup ............................ SKIPPED
[INFO] Apache HBase - Shell .............................. SKIPPED
[INFO] Apache HBase - Integration Tests .................. SKIPPED
[INFO] Apache HBase - Examples ........................... SKIPPED
[INFO] Apache HBase - Rest ............................... SKIPPED
[INFO] Apache HBase - External Block Cache ............... SKIPPED
[INFO] Apache HBase - Spark .............................. SKIPPED
[INFO] Apache HBase - Assembly ........................... SKIPPED
[INFO] Apache HBase - Shaded ............................. SKIPPED
[INFO] Apache HBase - Shaded - Client .................... SKIPPED
[INFO] Apache HBase - Shaded - Server .................... SKIPPED
[INFO] Apache HBase - Archetypes ......................... SKIPPED
[INFO] Apache HBase - Exemplar for hbase-client archetype  SKIPPED
[INFO] Apache HBase - Exemplar for hbase-shaded-client archetype  SKIPPED
[INFO] Apache HBase - Archetype builder .................. SKIPPED
[INFO] ------------------------------------------------------------------------
[INFO] BUILD FAILURE
[INFO] ------------------------------------------------------------------------
[INFO] Total time: 02:11 h
[INFO] Finished at: 2016-06-21T00:14:41+00:00
[INFO] Final Memory: 70M/603M
[INFO] ------------------------------------------------------------------------
[ERROR] Failed to execute goal org.apache.maven.plugins:maven-surefire-plugin:2.18.1:test
(secondPartTestsExecution) on project hbase-server: There are test failures.
[ERROR] 
[ERROR] Please refer to <https://builds.apache.org/job/HBase-Trunk_matrix/jdk=latest1.7,label=yahoo-not-h2/ws/hbase-server/target/surefire-reports>
for the individual test results.
[ERROR] -> [Help 1]
[ERROR] 
[ERROR] To see the full stack trace of the errors, re-run Maven with the -e switch.
[ERROR] Re-run Maven using the -X switch to enable full debug logging.
[ERROR] 
[ERROR] For more information about the errors and possible solutions, please read the following
articles:
[ERROR] [Help 1] http://cwiki.apache.org/confluence/display/MAVEN/MojoFailureException
[ERROR] 
[ERROR] After correcting the problems, you can resume the build with the command
[ERROR]   mvn <goals> -rf :hbase-server
Build step 'Invoke top-level Maven targets' marked build as failure
Performing Post build task...
Match found for :.* : True
Logical operation result is TRUE
Running script  : # Run zombie detector script
./dev-support/zombie-detector.sh --jenkins ${BUILD_ID}
[yahoo-not-h2] $ /bin/bash -xe /tmp/hudson8288013888320923700.sh
+ ./dev-support/zombie-detector.sh --jenkins 1084
Tue Jun 21 00:14:43 UTC 2016 We're ok: there is no zombie test


    {color:green}+1 zombies{color}. No zombie tests found running at the end of the build.
POST BUILD TASK : SUCCESS
END OF POST BUILD TASK : 0
Archiving artifacts
Recording test results
[FINDBUGS] Skipping publisher since build result is FAILURE
[CHECKSTYLE] Skipping publisher since build result is FAILURE

Mime
View raw message