hbase-builds mailing list archives

Site index · List index
Message view « Date » · « Thread »
Top « Date » · « Thread »
From Apache Jenkins Server <jenk...@builds.apache.org>
Subject Build failed in Jenkins: HBase-Trunk_matrix » latest1.7,yahoo-not-h2 #1028
Date Sat, 11 Jun 2016 11:35:01 GMT
See <https://builds.apache.org/job/HBase-Trunk_matrix/jdk=latest1.7,label=yahoo-not-h2/1028/>

------------------------------------------
[...truncated 85544 lines...]
Running org.apache.hadoop.hbase.master.procedure.TestModifyNamespaceProcedure
Running org.apache.hadoop.hbase.master.procedure.TestDeleteNamespaceProcedure
Tests run: 6, Failures: 0, Errors: 0, Skipped: 0, Time elapsed: 9.471 sec - in org.apache.hadoop.hbase.master.procedure.TestModifyNamespaceProcedure
Tests run: 7, Failures: 0, Errors: 0, Skipped: 0, Time elapsed: 51.274 sec - in org.apache.hadoop.hbase.master.procedure.TestTableDescriptorModificationFromClient
Tests run: 7, Failures: 0, Errors: 0, Skipped: 0, Time elapsed: 15.248 sec - in org.apache.hadoop.hbase.master.procedure.TestDeleteNamespaceProcedure
Running org.apache.hadoop.hbase.master.procedure.TestCreateTableProcedure
Tests run: 5, Failures: 0, Errors: 0, Skipped: 0, Time elapsed: 28.946 sec - in org.apache.hadoop.hbase.master.procedure.TestEnableTableProcedure
Running org.apache.hadoop.hbase.master.procedure.TestWALProcedureStoreOnHDFS
Running org.apache.hadoop.hbase.master.procedure.TestModifyColumnFamilyProcedure
Running org.apache.hadoop.hbase.master.procedure.TestRestoreSnapshotProcedure
Tests run: 5, Failures: 0, Errors: 0, Skipped: 0, Time elapsed: 26.843 sec - in org.apache.hadoop.hbase.master.procedure.TestModifyColumnFamilyProcedure
Tests run: 9, Failures: 0, Errors: 0, Skipped: 0, Time elapsed: 46.787 sec - in org.apache.hadoop.hbase.master.procedure.TestCreateTableProcedure
Tests run: 3, Failures: 0, Errors: 0, Skipped: 0, Time elapsed: 43.317 sec - in org.apache.hadoop.hbase.master.procedure.TestWALProcedureStoreOnHDFS
Running org.apache.hadoop.hbase.master.procedure.TestMasterProcedureEvents
Tests run: 15, Failures: 0, Errors: 0, Skipped: 1, Time elapsed: 148.318 sec - in org.apache.hadoop.hbase.master.TestSplitLogManager
Running org.apache.hadoop.hbase.master.procedure.TestDisableTableProcedure
Tests run: 2, Failures: 0, Errors: 0, Skipped: 0, Time elapsed: 13.098 sec - in org.apache.hadoop.hbase.master.procedure.TestMasterProcedureEvents
Running org.apache.hadoop.hbase.master.procedure.TestDeleteColumnFamilyProcedureFromClient
Running org.apache.hadoop.hbase.master.procedure.TestTruncateTableProcedure
Tests run: 4, Failures: 0, Errors: 0, Skipped: 0, Time elapsed: 17.232 sec - in org.apache.hadoop.hbase.master.procedure.TestDisableTableProcedure
Running org.apache.hadoop.hbase.master.procedure.TestDeleteTableProcedure
Running org.apache.hadoop.hbase.master.procedure.TestCreateNamespaceProcedure
Tests run: 2, Failures: 0, Errors: 0, Skipped: 0, Time elapsed: 26.014 sec - in org.apache.hadoop.hbase.master.procedure.TestDeleteColumnFamilyProcedureFromClient
Tests run: 7, Failures: 0, Errors: 0, Skipped: 0, Time elapsed: 20.38 sec - in org.apache.hadoop.hbase.master.procedure.TestDeleteTableProcedure
Running org.apache.hadoop.hbase.master.procedure.TestServerCrashProcedure
Tests run: 8, Failures: 0, Errors: 0, Skipped: 0, Time elapsed: 10.845 sec - in org.apache.hadoop.hbase.master.procedure.TestCreateNamespaceProcedure
Running org.apache.hadoop.hbase.master.procedure.TestCloneSnapshotProcedure
Tests run: 5, Failures: 0, Errors: 0, Skipped: 0, Time elapsed: 97.783 sec - in org.apache.hadoop.hbase.master.procedure.TestRestoreSnapshotProcedure
Running org.apache.hadoop.hbase.master.procedure.TestDeleteColumnFamilyProcedure
Tests run: 6, Failures: 0, Errors: 0, Skipped: 0, Time elapsed: 45.785 sec - in org.apache.hadoop.hbase.master.procedure.TestTruncateTableProcedure
Running org.apache.hadoop.hbase.master.TestMasterStatusServlet
Tests run: 4, Failures: 0, Errors: 0, Skipped: 0, Time elapsed: 1.591 sec - in org.apache.hadoop.hbase.master.TestMasterStatusServlet
Running org.apache.hadoop.hbase.master.handler.TestEnableTableHandler
Running org.apache.hadoop.hbase.master.procedure.TestProcedureAdmin
Tests run: 1, Failures: 0, Errors: 0, Skipped: 0, Time elapsed: 25.158 sec - in org.apache.hadoop.hbase.master.procedure.TestServerCrashProcedure
Tests run: 5, Failures: 0, Errors: 0, Skipped: 0, Time elapsed: 23.018 sec - in org.apache.hadoop.hbase.master.procedure.TestCloneSnapshotProcedure
Running org.apache.hadoop.hbase.master.TestMasterNoCluster
Tests run: 5, Failures: 0, Errors: 0, Skipped: 0, Time elapsed: 15.272 sec - in org.apache.hadoop.hbase.master.procedure.TestProcedureAdmin
Running org.apache.hadoop.hbase.master.normalizer.TestSimpleRegionNormalizerOnCluster
Tests run: 3, Failures: 0, Errors: 0, Skipped: 0, Time elapsed: 15.904 sec - in org.apache.hadoop.hbase.master.TestMasterNoCluster
Running org.apache.hadoop.hbase.master.TestGetLastFlushedSequenceId
Tests run: 8, Failures: 0, Errors: 0, Skipped: 0, Time elapsed: 37.224 sec - in org.apache.hadoop.hbase.master.procedure.TestDeleteColumnFamilyProcedure
Running org.apache.hadoop.hbase.master.TestMaster
Running org.apache.hadoop.hbase.master.snapshot.TestSnapshotFileCache
Tests run: 2, Failures: 0, Errors: 0, Skipped: 0, Time elapsed: 43.301 sec - in org.apache.hadoop.hbase.master.handler.TestEnableTableHandler
Tests run: 1, Failures: 0, Errors: 0, Skipped: 0, Time elapsed: 21.666 sec - in org.apache.hadoop.hbase.master.TestGetLastFlushedSequenceId
Tests run: 4, Failures: 0, Errors: 0, Skipped: 0, Time elapsed: 19.38 sec - in org.apache.hadoop.hbase.master.TestMaster
Running org.apache.hadoop.hbase.master.TestMasterFailoverBalancerPersistence
Running org.apache.hadoop.hbase.master.TestAssignmentManagerMetrics
Running org.apache.hadoop.hbase.master.TestMetaShutdownHandler
Tests run: 1, Failures: 0, Errors: 0, Skipped: 0, Time elapsed: 10.283 sec - in org.apache.hadoop.hbase.master.TestAssignmentManagerMetrics
Tests run: 1, Failures: 0, Errors: 0, Skipped: 0, Time elapsed: 17.616 sec - in org.apache.hadoop.hbase.master.TestMasterFailoverBalancerPersistence
Tests run: 2, Failures: 0, Errors: 0, Skipped: 0, Time elapsed: 49.434 sec - in org.apache.hadoop.hbase.master.normalizer.TestSimpleRegionNormalizerOnCluster
Running org.apache.hadoop.hbase.master.TestGetInfoPort
Running org.apache.hadoop.hbase.master.TestRollingRestart
Running org.apache.hadoop.hbase.master.TestMasterMetrics
Tests run: 4, Failures: 0, Errors: 0, Skipped: 0, Time elapsed: 45.082 sec - in org.apache.hadoop.hbase.master.snapshot.TestSnapshotFileCache
Running org.apache.hadoop.hbase.master.TestMasterShutdown
Tests run: 3, Failures: 0, Errors: 0, Skipped: 0, Time elapsed: 1.456 sec - in org.apache.hadoop.hbase.master.TestMasterMetrics
Tests run: 1, Failures: 0, Errors: 0, Skipped: 0, Time elapsed: 13.389 sec - in org.apache.hadoop.hbase.master.TestGetInfoPort
Running org.apache.hadoop.hbase.master.TestRestartCluster
Running org.apache.hadoop.hbase.master.cleaner.TestLogsCleaner
Tests run: 1, Failures: 0, Errors: 0, Skipped: 0, Time elapsed: 31.851 sec - in org.apache.hadoop.hbase.master.TestMetaShutdownHandler
Tests run: 3, Failures: 0, Errors: 0, Skipped: 0, Time elapsed: 11.803 sec - in org.apache.hadoop.hbase.master.cleaner.TestLogsCleaner
Running org.apache.hadoop.hbase.master.cleaner.TestHFileLinkCleaner
Tests run: 2, Failures: 0, Errors: 0, Skipped: 0, Time elapsed: 19.075 sec - in org.apache.hadoop.hbase.master.TestMasterShutdown
Running org.apache.hadoop.hbase.master.cleaner.TestSnapshotFromMaster
Tests run: 1, Failures: 0, Errors: 0, Skipped: 0, Time elapsed: 36.703 sec - in org.apache.hadoop.hbase.master.TestRollingRestart
Running org.apache.hadoop.hbase.master.cleaner.TestHFileCleaner
Running org.apache.hadoop.hbase.master.TestMasterTransitions
Tests run: 3, Failures: 0, Errors: 0, Skipped: 3, Time elapsed: 0.002 sec - in org.apache.hadoop.hbase.master.TestMasterTransitions
Tests run: 3, Failures: 0, Errors: 0, Skipped: 0, Time elapsed: 1.231 sec - in org.apache.hadoop.hbase.master.cleaner.TestHFileCleaner
Running org.apache.hadoop.hbase.master.TestClusterStatusPublisher
Tests run: 1, Failures: 0, Errors: 0, Skipped: 0, Time elapsed: 10.84 sec - in org.apache.hadoop.hbase.master.cleaner.TestHFileLinkCleaner
Tests run: 3, Failures: 0, Errors: 0, Skipped: 0, Time elapsed: 0.246 sec - in org.apache.hadoop.hbase.master.TestClusterStatusPublisher
Running org.apache.hadoop.hbase.master.TestHMasterRPCException
Tests run: 1, Failures: 0, Errors: 0, Skipped: 0, Time elapsed: 3.81 sec - in org.apache.hadoop.hbase.master.TestHMasterRPCException
Running org.apache.hadoop.hbase.master.TestTableLockManager
Running org.apache.hadoop.hbase.master.TestMasterMetricsWrapper
Tests run: 1, Failures: 0, Errors: 0, Skipped: 0, Time elapsed: 2.731 sec - in org.apache.hadoop.hbase.master.TestMasterMetricsWrapper
Running org.apache.hadoop.hbase.master.TestAssignmentListener
Tests run: 2, Failures: 0, Errors: 0, Skipped: 0, Time elapsed: 10.206 sec - in org.apache.hadoop.hbase.master.TestAssignmentListener
Running org.apache.hadoop.hbase.master.balancer.TestDefaultLoadBalancer
Running org.apache.hadoop.hbase.master.TestWarmupRegion
Tests run: 1, Failures: 0, Errors: 0, Skipped: 0, Time elapsed: 3.578 sec - in org.apache.hadoop.hbase.master.balancer.TestDefaultLoadBalancer
Tests run: 2, Failures: 0, Errors: 0, Skipped: 0, Time elapsed: 58.645 sec - in org.apache.hadoop.hbase.master.TestRestartCluster
Running org.apache.hadoop.hbase.master.balancer.TestStochasticLoadBalancer
Running org.apache.hadoop.hbase.master.balancer.TestBaseLoadBalancer
Tests run: 6, Failures: 0, Errors: 0, Skipped: 0, Time elapsed: 0.463 sec - in org.apache.hadoop.hbase.master.balancer.TestBaseLoadBalancer
Tests run: 4, Failures: 0, Errors: 0, Skipped: 0, Time elapsed: 43.237 sec - in org.apache.hadoop.hbase.master.cleaner.TestSnapshotFromMaster
Running org.apache.hadoop.hbase.master.balancer.TestStochasticLoadBalancer2
Running org.apache.hadoop.hbase.master.TestTableStateManager
Tests run: 1, Failures: 0, Errors: 0, Skipped: 0, Time elapsed: 20 sec - in org.apache.hadoop.hbase.master.TestTableStateManager
Running org.apache.hadoop.hbase.master.TestMasterRestartAfterDisablingTable
Tests run: 1, Failures: 0, Errors: 0, Skipped: 0, Time elapsed: 33.838 sec - in org.apache.hadoop.hbase.master.TestWarmupRegion
Running org.apache.hadoop.hbase.master.TestMasterWalManager
Tests run: 1, Failures: 0, Errors: 0, Skipped: 0, Time elapsed: 1.844 sec - in org.apache.hadoop.hbase.master.TestMasterWalManager
Tests run: 1, Failures: 0, Errors: 0, Skipped: 0, Time elapsed: 21.627 sec - in org.apache.hadoop.hbase.master.TestMasterRestartAfterDisablingTable
Running org.apache.hadoop.hbase.TestMetaTableAccessorNoCluster
Tests run: 2, Failures: 0, Errors: 0, Skipped: 0, Time elapsed: 2.416 sec - in org.apache.hadoop.hbase.TestMetaTableAccessorNoCluster
Running org.apache.hadoop.hbase.master.TestDistributedLogSplitting
Running org.apache.hadoop.hbase.mapred.TestTableSnapshotInputFormat
Tests run: 4, Failures: 0, Errors: 0, Skipped: 0, Time elapsed: 101.583 sec - in org.apache.hadoop.hbase.master.TestTableLockManager
Running org.apache.hadoop.hbase.mapred.TestMultiTableSnapshotInputFormat
Tests run: 18, Failures: 0, Errors: 0, Skipped: 15, Time elapsed: 51.454 sec - in org.apache.hadoop.hbase.master.TestDistributedLogSplitting
Running org.apache.hadoop.hbase.mapred.TestTableMapReduceUtil
Tests run: 4, Failures: 0, Errors: 0, Skipped: 0, Time elapsed: 15.477 sec - in org.apache.hadoop.hbase.mapred.TestTableMapReduceUtil
Tests run: 4, Failures: 0, Errors: 0, Skipped: 0, Time elapsed: 45.202 sec - in org.apache.hadoop.hbase.mapred.TestMultiTableSnapshotInputFormat
Running org.apache.hadoop.hbase.mapred.TestTableInputFormat
Running org.apache.hadoop.hbase.mapred.TestTableMapReduce
Tests run: 2, Failures: 0, Errors: 0, Skipped: 0, Time elapsed: 21.09 sec - in org.apache.hadoop.hbase.mapred.TestTableMapReduce
Running org.apache.hadoop.hbase.TestIOFencing
Tests run: 7, Failures: 0, Errors: 0, Skipped: 0, Time elapsed: 144.606 sec - in org.apache.hadoop.hbase.mapred.TestTableSnapshotInputFormat
Running org.apache.hadoop.hbase.TestMetaTableLocator
Tests run: 7, Failures: 0, Errors: 0, Skipped: 0, Time elapsed: 4.073 sec - in org.apache.hadoop.hbase.TestMetaTableLocator
Running org.apache.hadoop.hbase.util.TestHBaseFsckMOB
Tests run: 8, Failures: 0, Errors: 0, Skipped: 0, Time elapsed: 82.797 sec - in org.apache.hadoop.hbase.mapred.TestTableInputFormat
Tests run: 1, Failures: 0, Errors: 0, Skipped: 0, Time elapsed: 13.839 sec - in org.apache.hadoop.hbase.util.TestHBaseFsckMOB
Running org.apache.hadoop.hbase.util.TestRegionMover
Running org.apache.hadoop.hbase.util.TestRegionSplitter
Tests run: 6, Failures: 0, Errors: 0, Skipped: 0, Time elapsed: 6.483 sec - in org.apache.hadoop.hbase.util.TestRegionSplitter
Running org.apache.hadoop.hbase.util.TestFSHDFSUtils
Tests run: 3, Failures: 0, Errors: 0, Skipped: 0, Time elapsed: 7.969 sec - in org.apache.hadoop.hbase.util.TestFSHDFSUtils
Running org.apache.hadoop.hbase.util.TestFSVisitor
Tests run: 1, Failures: 0, Errors: 0, Skipped: 0, Time elapsed: 1.692 sec - in org.apache.hadoop.hbase.util.TestFSVisitor
Tests run: 2, Failures: 0, Errors: 0, Skipped: 0, Time elapsed: 85.512 sec - in org.apache.hadoop.hbase.TestIOFencing
Running org.apache.hadoop.hbase.util.TestMiniClusterLoadParallel
Running org.apache.hadoop.hbase.util.TestHBaseFsckTwoRS
Tests run: 5, Failures: 0, Errors: 0, Skipped: 0, Time elapsed: 36.26 sec - in org.apache.hadoop.hbase.util.TestRegionMover
Running org.apache.hadoop.hbase.util.TestIdReadWriteLock
Tests run: 1, Failures: 0, Errors: 0, Skipped: 0, Time elapsed: 15.534 sec - in org.apache.hadoop.hbase.util.TestIdReadWriteLock
Running org.apache.hadoop.hbase.util.hbck.TestOfflineMetaRebuildOverlap
Tests run: 1, Failures: 0, Errors: 0, Skipped: 0, Time elapsed: 30.298 sec - in org.apache.hadoop.hbase.util.hbck.TestOfflineMetaRebuildOverlap
Running org.apache.hadoop.hbase.util.hbck.TestOfflineMetaRebuildHole
Tests run: 21, Failures: 0, Errors: 0, Skipped: 1, Time elapsed: 340.447 sec - in org.apache.hadoop.hbase.master.balancer.TestStochasticLoadBalancer
Running org.apache.hadoop.hbase.util.hbck.TestOfflineMetaRebuildBase
Tests run: 4, Failures: 0, Errors: 0, Skipped: 0, Time elapsed: 63.132 sec - in org.apache.hadoop.hbase.util.TestMiniClusterLoadParallel
Running org.apache.hadoop.hbase.util.TestConnectionCache
Tests run: 1, Failures: 0, Errors: 0, Skipped: 0, Time elapsed: 29.421 sec - in org.apache.hadoop.hbase.util.hbck.TestOfflineMetaRebuildHole
Running org.apache.hadoop.hbase.util.TestFSTableDescriptors
Tests run: 1, Failures: 0, Errors: 0, Skipped: 0, Time elapsed: 20.636 sec - in org.apache.hadoop.hbase.util.TestConnectionCache
Tests run: 16, Failures: 0, Errors: 0, Skipped: 0, Time elapsed: 2.23 sec - in org.apache.hadoop.hbase.util.TestFSTableDescriptors
Running org.apache.hadoop.hbase.util.TestDefaultEnvironmentEdge
Running org.apache.hadoop.hbase.util.TestMiniClusterLoadEncoded
Tests run: 1, Failures: 0, Errors: 0, Skipped: 0, Time elapsed: 0.165 sec - in org.apache.hadoop.hbase.util.TestDefaultEnvironmentEdge
Tests run: 9, Failures: 0, Errors: 0, Skipped: 0, Time elapsed: 86.251 sec - in org.apache.hadoop.hbase.util.TestHBaseFsckTwoRS
Tests run: 1, Failures: 0, Errors: 0, Skipped: 0, Time elapsed: 29.795 sec - in org.apache.hadoop.hbase.util.hbck.TestOfflineMetaRebuildBase
Running org.apache.hadoop.hbase.util.TestTableName
Tests run: 6, Failures: 0, Errors: 0, Skipped: 0, Time elapsed: 0.391 sec - in org.apache.hadoop.hbase.util.TestTableName
Running org.apache.hadoop.hbase.util.TestMiniClusterLoadSequential
Running org.apache.hadoop.hbase.util.TestHBaseFsckOneRS
Running org.apache.hadoop.hbase.util.TestHBaseFsckReplicas
Tests run: 4, Failures: 0, Errors: 0, Skipped: 0, Time elapsed: 44.902 sec - in org.apache.hadoop.hbase.util.TestHBaseFsckReplicas
Running org.apache.hadoop.hbase.util.TestIdLock
Tests run: 4, Failures: 0, Errors: 0, Skipped: 0, Time elapsed: 64.646 sec - in org.apache.hadoop.hbase.util.TestMiniClusterLoadSequential
Tests run: 5, Failures: 0, Errors: 0, Skipped: 0, Time elapsed: 70.944 sec - in org.apache.hadoop.hbase.util.TestMiniClusterLoadEncoded
Running org.apache.hadoop.hbase.util.TestFSUtils
Tests run: 1, Failures: 0, Errors: 0, Skipped: 0, Time elapsed: 15.187 sec - in org.apache.hadoop.hbase.util.TestIdLock
Running org.apache.hadoop.hbase.util.TestMergeTool
Running org.apache.hadoop.hbase.util.TestCoprocessorScanPolicy
Tests run: 11, Failures: 0, Errors: 0, Skipped: 0, Time elapsed: 25.485 sec - in org.apache.hadoop.hbase.util.TestFSUtils
Running org.apache.hadoop.hbase.util.TestMergeTable
Tests run: 1, Failures: 0, Errors: 0, Skipped: 0, Time elapsed: 22.813 sec - in org.apache.hadoop.hbase.util.TestMergeTool
Tests run: 4, Failures: 0, Errors: 0, Skipped: 0, Time elapsed: 18.199 sec - in org.apache.hadoop.hbase.util.TestCoprocessorScanPolicy
Running org.apache.hadoop.hbase.util.TestHBaseFsckEncryption
Running org.apache.hadoop.hbase.TestMetaTableAccessor
Tests run: 1, Failures: 0, Errors: 0, Skipped: 0, Time elapsed: 18.062 sec - in org.apache.hadoop.hbase.util.TestHBaseFsckEncryption
Tests run: 1, Failures: 0, Errors: 0, Skipped: 0, Time elapsed: 26.172 sec - in org.apache.hadoop.hbase.util.TestMergeTable
Tests run: 4, Failures: 0, Errors: 0, Skipped: 0, Time elapsed: 492.638 sec - in org.apache.hadoop.hbase.master.balancer.TestStochasticLoadBalancer2
Tests run: 15, Failures: 0, Errors: 0, Skipped: 0, Time elapsed: 35.762 sec - in org.apache.hadoop.hbase.TestMetaTableAccessor
Tests run: 42, Failures: 0, Errors: 0, Skipped: 1, Time elapsed: 331.39 sec - in org.apache.hadoop.hbase.util.TestHBaseFsckOneRS

Results :

Tests in error: 
  TestImportTsv.testMROnTableWithTimestamp:137->doMROnTableTest:381->doMROnTableTest:450->validateTable:479
» Runtime

Tests run: 2446, Failures: 0, Errors: 1, Skipped: 43

[INFO] ------------------------------------------------------------------------
[INFO] Reactor Summary:
[INFO] 
[INFO] Apache HBase ...................................... SUCCESS [  6.639 s]
[INFO] Apache HBase - Checkstyle ......................... SUCCESS [  0.647 s]
[INFO] Apache HBase - Resource Bundle .................... SUCCESS [  0.233 s]
[INFO] Apache HBase - Annotations ........................ SUCCESS [  0.219 s]
[INFO] Apache HBase - Protocol ........................... SUCCESS [  3.078 s]
[INFO] Apache HBase - Common ............................. SUCCESS [01:29 min]
[INFO] Apache HBase - Procedure .......................... SUCCESS [01:34 min]
[INFO] Apache HBase - Client ............................. SUCCESS [ 41.328 s]
[INFO] Apache HBase - Hadoop Compatibility ............... SUCCESS [  7.518 s]
[INFO] Apache HBase - Hadoop Two Compatibility ........... SUCCESS [  9.472 s]
[INFO] Apache HBase - Prefix Tree ........................ SUCCESS [ 10.602 s]
[INFO] Apache HBase - Server ............................. FAILURE [  01:37 h]
[INFO] Apache HBase - Testing Util ....................... SKIPPED
[INFO] Apache HBase - Thrift ............................. SKIPPED
[INFO] Apache HBase - RSGroup ............................ SKIPPED
[INFO] Apache HBase - Shell .............................. SKIPPED
[INFO] Apache HBase - Integration Tests .................. SKIPPED
[INFO] Apache HBase - Examples ........................... SKIPPED
[INFO] Apache HBase - Rest ............................... SKIPPED
[INFO] Apache HBase - External Block Cache ............... SKIPPED
[INFO] Apache HBase - Spark .............................. SKIPPED
[INFO] Apache HBase - Assembly ........................... SKIPPED
[INFO] Apache HBase - Shaded ............................. SKIPPED
[INFO] Apache HBase - Shaded - Client .................... SKIPPED
[INFO] Apache HBase - Shaded - Server .................... SKIPPED
[INFO] Apache HBase - Archetypes ......................... SKIPPED
[INFO] Apache HBase - Exemplar for hbase-client archetype  SKIPPED
[INFO] Apache HBase - Exemplar for hbase-shaded-client archetype  SKIPPED
[INFO] Apache HBase - Archetype builder .................. SKIPPED
[INFO] ------------------------------------------------------------------------
[INFO] BUILD FAILURE
[INFO] ------------------------------------------------------------------------
[INFO] Total time: 01:41 h
[INFO] Finished at: 2016-06-11T11:32:25+00:00
[INFO] Final Memory: 71M/670M
[INFO] ------------------------------------------------------------------------
[ERROR] Failed to execute goal org.apache.maven.plugins:maven-surefire-plugin:2.18.1:test
(secondPartTestsExecution) on project hbase-server: There are test failures.
[ERROR] 
[ERROR] Please refer to <https://builds.apache.org/job/HBase-Trunk_matrix/jdk=latest1.7,label=yahoo-not-h2/ws/hbase-server/target/surefire-reports>
for the individual test results.
[ERROR] -> [Help 1]
[ERROR] 
[ERROR] To see the full stack trace of the errors, re-run Maven with the -e switch.
[ERROR] Re-run Maven using the -X switch to enable full debug logging.
[ERROR] 
[ERROR] For more information about the errors and possible solutions, please read the following
articles:
[ERROR] [Help 1] http://cwiki.apache.org/confluence/display/MAVEN/MojoFailureException
[ERROR] 
[ERROR] After correcting the problems, you can resume the build with the command
[ERROR]   mvn <goals> -rf :hbase-server
Build step 'Invoke top-level Maven targets' marked build as failure
Performing Post build task...
Match found for :.* : True
Logical operation result is TRUE
Running script  : # Run zombie detector script
./dev-support/zombie-detector.sh --jenkins ${BUILD_ID}
[yahoo-not-h2] $ /bin/bash -xe /tmp/hudson391935286442806946.sh
+ ./dev-support/zombie-detector.sh --jenkins 1028
Sat Jun 11 11:32:26 UTC 2016 We're ok: there is no zombie test


    {color:green}+1 zombies{color}. No zombie tests found running at the end of the build.
POST BUILD TASK : SUCCESS
END OF POST BUILD TASK : 0
Archiving artifacts
Recording test results
[FINDBUGS] Skipping publisher since build result is FAILURE
[CHECKSTYLE] Skipping publisher since build result is FAILURE

Mime
View raw message