hbase-builds mailing list archives

Site index · List index
Message view « Date » · « Thread »
Top « Date » · « Thread »
From Apache Jenkins Server <jenk...@builds.apache.org>
Subject Build failed in Jenkins: HBase-1.3 » latest1.8,yahoo-not-h2 #723
Date Fri, 03 Jun 2016 17:54:21 GMT
See <https://builds.apache.org/job/HBase-1.3/jdk=latest1.8,label=yahoo-not-h2/723/changes>

Changes:

[ashishsinghi] HBASE-15888 Extend HBASE-12769 for bulk load data replication

------------------------------------------
[...truncated 48179 lines...]
Tests run: 5, Failures: 0, Errors: 0, Skipped: 0, Time elapsed: 56.504 sec - in org.apache.hadoop.hbase.mapreduce.TestCopyTable
Java HotSpot(TM) 64-Bit Server VM warning: ignoring option MaxPermSize=256m; support was removed
in 8.0
Running org.apache.hadoop.hbase.mapreduce.TestSecureLoadIncrementalHFiles
Running org.apache.hadoop.hbase.mapreduce.TestTableInputFormat
Tests run: 8, Failures: 0, Errors: 0, Skipped: 0, Time elapsed: 16.386 sec - in org.apache.hadoop.hbase.mapreduce.TestTableInputFormat
Java HotSpot(TM) 64-Bit Server VM warning: ignoring option MaxPermSize=256m; support was removed
in 8.0
Running org.apache.hadoop.hbase.mapreduce.TestTimeRangeMapRed
Tests run: 1, Failures: 0, Errors: 0, Skipped: 0, Time elapsed: 6.556 sec - in org.apache.hadoop.hbase.mapreduce.TestTimeRangeMapRed
Java HotSpot(TM) 64-Bit Server VM warning: ignoring option MaxPermSize=256m; support was removed
in 8.0
Java HotSpot(TM) 64-Bit Server VM warning: ignoring option MaxPermSize=256m; support was removed
in 8.0
Running org.apache.hadoop.hbase.mapreduce.TestTableSnapshotInputFormat
Tests run: 12, Failures: 0, Errors: 0, Skipped: 0, Time elapsed: 136.438 sec - in org.apache.hadoop.hbase.mapreduce.TestImportExport
Java HotSpot(TM) 64-Bit Server VM warning: ignoring option MaxPermSize=256m; support was removed
in 8.0
Running org.apache.hadoop.hbase.mapreduce.TestImportTSVWithTTLs
Tests run: 1, Failures: 0, Errors: 0, Skipped: 0, Time elapsed: 11.398 sec - in org.apache.hadoop.hbase.mapreduce.TestImportTSVWithTTLs
Java HotSpot(TM) 64-Bit Server VM warning: ignoring option MaxPermSize=256m; support was removed
in 8.0
Running org.apache.hadoop.hbase.mapreduce.TestLoadIncrementalHFiles
Tests run: 18, Failures: 0, Errors: 0, Skipped: 0, Time elapsed: 122.96 sec - in org.apache.hadoop.hbase.mapreduce.TestImportTsv
Java HotSpot(TM) 64-Bit Server VM warning: ignoring option MaxPermSize=256m; support was removed
in 8.0
Running org.apache.hadoop.hbase.mapreduce.TestHRegionPartitioner
Tests run: 1, Failures: 0, Errors: 0, Skipped: 0, Time elapsed: 2.546 sec - in org.apache.hadoop.hbase.mapreduce.TestHRegionPartitioner
Java HotSpot(TM) 64-Bit Server VM warning: ignoring option MaxPermSize=256m; support was removed
in 8.0
Running org.apache.hadoop.hbase.mapreduce.TestLoadIncrementalHFilesSplitRecovery
Tests run: 8, Failures: 0, Errors: 0, Skipped: 0, Time elapsed: 99.77 sec - in org.apache.hadoop.hbase.mapreduce.TestTableSnapshotInputFormat
Java HotSpot(TM) 64-Bit Server VM warning: ignoring option MaxPermSize=256m; support was removed
in 8.0
Running org.apache.hadoop.hbase.mapreduce.TestImportTSVWithVisibilityLabels
Tests run: 6, Failures: 0, Errors: 0, Skipped: 0, Time elapsed: 41.671 sec - in org.apache.hadoop.hbase.mapreduce.TestLoadIncrementalHFilesSplitRecovery
Java HotSpot(TM) 64-Bit Server VM warning: ignoring option MaxPermSize=256m; support was removed
in 8.0
Running org.apache.hadoop.hbase.mapreduce.TestHFileOutputFormat
Tests run: 22, Failures: 0, Errors: 0, Skipped: 0, Time elapsed: 200.66 sec - in org.apache.hadoop.hbase.mapreduce.TestLoadIncrementalHFilesUseSecurityEndPoint
Java HotSpot(TM) 64-Bit Server VM warning: ignoring option MaxPermSize=256m; support was removed
in 8.0
Running org.apache.hadoop.hbase.mapreduce.TestMultithreadedTableMapper
Tests run: 22, Failures: 0, Errors: 0, Skipped: 0, Time elapsed: 216.978 sec - in org.apache.hadoop.hbase.mapreduce.TestSecureLoadIncrementalHFiles
Java HotSpot(TM) 64-Bit Server VM warning: ignoring option MaxPermSize=256m; support was removed
in 8.0
Java HotSpot(TM) 64-Bit Server VM warning: ignoring option MaxPermSize=256m; support was removed
in 8.0
Running org.apache.hadoop.hbase.mapreduce.TestHFileOutputFormat2
Tests run: 7, Failures: 0, Errors: 0, Skipped: 0, Time elapsed: 68.034 sec - in org.apache.hadoop.hbase.mapreduce.TestImportTSVWithVisibilityLabels
Java HotSpot(TM) 64-Bit Server VM warning: ignoring option MaxPermSize=256m; support was removed
in 8.0
Tests run: 15, Failures: 0, Errors: 0, Skipped: 14, Time elapsed: 1.464 sec - in org.apache.hadoop.hbase.mapreduce.TestHFileOutputFormat2
Java HotSpot(TM) 64-Bit Server VM warning: ignoring option MaxPermSize=256m; support was removed
in 8.0
Tests run: 13, Failures: 0, Errors: 0, Skipped: 1, Time elapsed: 73.412 sec - in org.apache.hadoop.hbase.mapreduce.TestHFileOutputFormat
Java HotSpot(TM) 64-Bit Server VM warning: ignoring option MaxPermSize=256m; support was removed
in 8.0
Tests run: 1, Failures: 0, Errors: 0, Skipped: 0, Time elapsed: 39.719 sec - in org.apache.hadoop.hbase.mapreduce.TestMultithreadedTableMapper
Running org.apache.hadoop.hbase.mapreduce.TestCellCounter
Java HotSpot(TM) 64-Bit Server VM warning: ignoring option MaxPermSize=256m; support was removed
in 8.0
Running org.apache.hadoop.hbase.mapreduce.TestTableInputFormatScan1
Running org.apache.hadoop.hbase.mapreduce.TestWALRecordReader
Tests run: 2, Failures: 0, Errors: 0, Skipped: 0, Time elapsed: 1.381 sec - in org.apache.hadoop.hbase.mapreduce.TestWALRecordReader
Java HotSpot(TM) 64-Bit Server VM warning: ignoring option MaxPermSize=256m; support was removed
in 8.0
Java HotSpot(TM) 64-Bit Server VM warning: ignoring option MaxPermSize=256m; support was removed
in 8.0
Running org.apache.hadoop.hbase.mapreduce.TestMultiTableInputFormat
Running org.apache.hadoop.hbase.mapreduce.TestSecureLoadIncrementalHFilesSplitRecovery
Tests run: 7, Failures: 0, Errors: 0, Skipped: 0, Time elapsed: 35.933 sec - in org.apache.hadoop.hbase.mapreduce.TestTableInputFormatScan1
Java HotSpot(TM) 64-Bit Server VM warning: ignoring option MaxPermSize=256m; support was removed
in 8.0
Java HotSpot(TM) 64-Bit Server VM warning: ignoring option MaxPermSize=256m; support was removed
in 8.0
Java HotSpot(TM) 64-Bit Server VM warning: ignoring option MaxPermSize=256m; support was removed
in 8.0
Java HotSpot(TM) 64-Bit Server VM warning: ignoring option MaxPermSize=256m; support was removed
in 8.0
Java HotSpot(TM) 64-Bit Server VM warning: ignoring option MaxPermSize=256m; support was removed
in 8.0
Java HotSpot(TM) 64-Bit Server VM warning: ignoring option MaxPermSize=256m; support was removed
in 8.0
Java HotSpot(TM) 64-Bit Server VM warning: ignoring option MaxPermSize=256m; support was removed
in 8.0
Java HotSpot(TM) 64-Bit Server VM warning: ignoring option MaxPermSize=256m; support was removed
in 8.0
Java HotSpot(TM) 64-Bit Server VM warning: ignoring option MaxPermSize=256m; support was removed
in 8.0
Java HotSpot(TM) 64-Bit Server VM warning: ignoring option MaxPermSize=256m; support was removed
in 8.0
Tests run: 6, Failures: 0, Errors: 0, Skipped: 0, Time elapsed: 28.706 sec - in org.apache.hadoop.hbase.mapreduce.TestSecureLoadIncrementalHFilesSplitRecovery
Java HotSpot(TM) 64-Bit Server VM warning: ignoring option MaxPermSize=256m; support was removed
in 8.0
Tests run: 4, Failures: 0, Errors: 0, Skipped: 0, Time elapsed: 30.332 sec - in org.apache.hadoop.hbase.mapreduce.TestMultiTableInputFormat
Java HotSpot(TM) 64-Bit Server VM warning: ignoring option MaxPermSize=256m; support was removed
in 8.0
Java HotSpot(TM) 64-Bit Server VM warning: ignoring option MaxPermSize=256m; support was removed
in 8.0
Java HotSpot(TM) 64-Bit Server VM warning: ignoring option MaxPermSize=256m; support was removed
in 8.0
Tests run: 22, Failures: 0, Errors: 0, Skipped: 0, Time elapsed: 199.751 sec - in org.apache.hadoop.hbase.mapreduce.TestLoadIncrementalHFiles
Java HotSpot(TM) 64-Bit Server VM warning: ignoring option MaxPermSize=256m; support was removed
in 8.0
Java HotSpot(TM) 64-Bit Server VM warning: ignoring option MaxPermSize=256m; support was removed
in 8.0
Running org.apache.hadoop.hbase.filter.TestMultiRowRangeFilter
Running org.apache.hadoop.hbase.filter.TestScanRowPrefix
Tests run: 8, Failures: 0, Errors: 0, Skipped: 0, Time elapsed: 58.796 sec - in org.apache.hadoop.hbase.mapreduce.TestCellCounter
Java HotSpot(TM) 64-Bit Server VM warning: ignoring option MaxPermSize=256m; support was removed
in 8.0
Java HotSpot(TM) 64-Bit Server VM warning: ignoring option MaxPermSize=256m; support was removed
in 8.0
Java HotSpot(TM) 64-Bit Server VM warning: ignoring option MaxPermSize=256m; support was removed
in 8.0
Java HotSpot(TM) 64-Bit Server VM warning: ignoring option MaxPermSize=256m; support was removed
in 8.0
Running org.apache.hadoop.hbase.filter.TestFilterWithScanLimits
Java HotSpot(TM) 64-Bit Server VM warning: ignoring option MaxPermSize=256m; support was removed
in 8.0
Java HotSpot(TM) 64-Bit Server VM warning: ignoring option MaxPermSize=256m; support was removed
in 8.0
Java HotSpot(TM) 64-Bit Server VM warning: ignoring option MaxPermSize=256m; support was removed
in 8.0
Tests run: 1, Failures: 0, Errors: 0, Skipped: 0, Time elapsed: 6.804 sec - in org.apache.hadoop.hbase.filter.TestScanRowPrefix
Java HotSpot(TM) 64-Bit Server VM warning: ignoring option MaxPermSize=256m; support was removed
in 8.0
Tests run: 1, Failures: 0, Errors: 0, Skipped: 0, Time elapsed: 3.988 sec - in org.apache.hadoop.hbase.filter.TestFilterWithScanLimits
Java HotSpot(TM) 64-Bit Server VM warning: ignoring option MaxPermSize=256m; support was removed
in 8.0
Java HotSpot(TM) 64-Bit Server VM warning: ignoring option MaxPermSize=256m; support was removed
in 8.0
Running org.apache.hadoop.hbase.filter.TestFuzzyRowAndColumnRangeFilter
Java HotSpot(TM) 64-Bit Server VM warning: ignoring option MaxPermSize=256m; support was removed
in 8.0
Java HotSpot(TM) 64-Bit Server VM warning: ignoring option MaxPermSize=256m; support was removed
in 8.0
Java HotSpot(TM) 64-Bit Server VM warning: ignoring option MaxPermSize=256m; support was removed
in 8.0
Java HotSpot(TM) 64-Bit Server VM warning: ignoring option MaxPermSize=256m; support was removed
in 8.0
Tests run: 1, Failures: 0, Errors: 0, Skipped: 0, Time elapsed: 3.449 sec - in org.apache.hadoop.hbase.filter.TestFuzzyRowAndColumnRangeFilter
Java HotSpot(TM) 64-Bit Server VM warning: ignoring option MaxPermSize=256m; support was removed
in 8.0
Running org.apache.hadoop.hbase.filter.TestColumnRangeFilter
Tests run: 20, Failures: 0, Errors: 0, Skipped: 0, Time elapsed: 21.858 sec - in org.apache.hadoop.hbase.filter.TestMultiRowRangeFilter
Java HotSpot(TM) 64-Bit Server VM warning: ignoring option MaxPermSize=256m; support was removed
in 8.0
Running org.apache.hadoop.hbase.filter.TestFilterWrapper
Running org.apache.hadoop.hbase.filter.TestFuzzyRowFilterEndToEnd
Running org.apache.hadoop.hbase.TestMetaTableAccessor
Tests run: 1, Failures: 0, Errors: 0, Skipped: 0, Time elapsed: 7.845 sec - in org.apache.hadoop.hbase.filter.TestColumnRangeFilter
Tests run: 1, Failures: 0, Errors: 0, Skipped: 0, Time elapsed: 4.809 sec - in org.apache.hadoop.hbase.filter.TestFilterWrapper
Tests run: 14, Failures: 0, Errors: 0, Skipped: 0, Time elapsed: 23.41 sec - in org.apache.hadoop.hbase.TestMetaTableAccessor
Tests run: 4, Failures: 0, Errors: 0, Skipped: 0, Time elapsed: 242.332 sec - in org.apache.hadoop.hbase.filter.TestFuzzyRowFilterEndToEnd

Results :

Tests in error: 
org.apache.hadoop.hbase.replication.TestMasterReplication.testCyclicReplication3(org.apache.hadoop.hbase.replication.TestMasterReplication)
  Run 1: TestMasterReplication.testCyclicReplication3:403->startMiniClusters:475 » OutOfMemory
  Run 2: TestMasterReplication.testCyclicReplication3 » OutOfMemory unable to create ne...
  Run 3: TestMasterReplication.testCyclicReplication3:427->shutDownMiniClusters:489 NullPointer

org.apache.hadoop.hbase.replication.TestMasterReplication.testHFileMultiSlaveReplication(org.apache.hadoop.hbase.replication.TestMasterReplication)
  Run 1: TestMasterReplication.testHFileMultiSlaveReplication:334->shutDownMiniClusters:489
NullPointer
  Run 2: TestMasterReplication.testHFileMultiSlaveReplication:334->shutDownMiniClusters:489
NullPointer
  Run 3: TestMasterReplication.testHFileMultiSlaveReplication:291->startMiniClusters:475
» OutOfMemory

org.apache.hadoop.hbase.replication.TestMasterReplication.testReplicateWALEntryWhenReplicationIsDisabled(org.apache.hadoop.hbase.replication.TestMasterReplication)
  Run 1: TestMasterReplication.testReplicateWALEntryWhenReplicationIsDisabled »  Unexpe...
  Run 2: TestMasterReplication.testReplicateWALEntryWhenReplicationIsDisabled »  Unexpe...
  Run 3: TestMasterReplication.testReplicateWALEntryWhenReplicationIsDisabled »  Unexpe...

  TestReplicationKillSlaveRS.killOneSlaveRS:33->TestReplicationKillRS.loadTableAndKillRS:94
» Runtime
  TestReplicationSyncUpTool.testSyncUpTool:117->putAndReplicateRows:231 » Runtime
Flaked tests: 
org.apache.hadoop.hbase.regionserver.TestHRegion.testFlushCacheWhileScanning(org.apache.hadoop.hbase.regionserver.TestHRegion)
  Run 1: TestHRegion.testFlushCacheWhileScanning:3790 i=480 expected:<48> but was:<43>
  Run 2: PASS


Tests run: 2519, Failures: 0, Errors: 5, Skipped: 41, Flakes: 1

[INFO] ------------------------------------------------------------------------
[INFO] Reactor Summary:
[INFO] 
[INFO] Apache HBase ...................................... SUCCESS [1:31.248s]
[INFO] Apache HBase - Checkstyle ......................... SUCCESS [6.191s]
[INFO] Apache HBase - Resource Bundle .................... SUCCESS [0.133s]
[INFO] Apache HBase - Annotations ........................ SUCCESS [0.944s]
[INFO] Apache HBase - Protocol ........................... SUCCESS [18.253s]
[INFO] Apache HBase - Common ............................. SUCCESS [2:10.989s]
[INFO] Apache HBase - Procedure .......................... SUCCESS [3:14.791s]
[INFO] Apache HBase - Client ............................. SUCCESS [1:19.559s]
[INFO] Apache HBase - Hadoop Compatibility ............... SUCCESS [7.945s]
[INFO] Apache HBase - Hadoop Two Compatibility ........... SUCCESS [10.130s]
[INFO] Apache HBase - Prefix Tree ........................ SUCCESS [7.653s]
[INFO] Apache HBase - Server ............................. FAILURE [1:18:18.966s]
[INFO] Apache HBase - Testing Util ....................... SKIPPED
[INFO] Apache HBase - Thrift ............................. SKIPPED
[INFO] Apache HBase - Rest ............................... SKIPPED
[INFO] Apache HBase - Shell .............................. SKIPPED
[INFO] Apache HBase - Integration Tests .................. SKIPPED
[INFO] Apache HBase - Examples ........................... SKIPPED
[INFO] Apache HBase - External Block Cache ............... SKIPPED
[INFO] Apache HBase - Assembly ........................... SKIPPED
[INFO] Apache HBase - Shaded ............................. SKIPPED
[INFO] Apache HBase - Shaded - Client .................... SKIPPED
[INFO] Apache HBase - Shaded - Server .................... SKIPPED
[INFO] ------------------------------------------------------------------------
[INFO] BUILD FAILURE
[INFO] ------------------------------------------------------------------------
[INFO] Total time: 1:28:05.812s
[INFO] Finished at: Fri Jun 03 17:51:16 UTC 2016
[INFO] Final Memory: 96M/1131M
[INFO] ------------------------------------------------------------------------
[ERROR] Failed to execute goal org.apache.maven.plugins:maven-surefire-plugin:2.18.1:test
(secondPartTestsExecution) on project hbase-server: ExecutionException: java.lang.RuntimeException:
java.lang.RuntimeException: org.apache.maven.surefire.report.ReporterException: When writing
xml report stdout/stderr: /tmp/stderr6631173795123373832deferred (No such file or directory)
-> [Help 1]
[ERROR] 
[ERROR] To see the full stack trace of the errors, re-run Maven with the -e switch.
[ERROR] Re-run Maven using the -X switch to enable full debug logging.
[ERROR] 
[ERROR] For more information about the errors and possible solutions, please read the following
articles:
[ERROR] [Help 1] http://cwiki.apache.org/confluence/display/MAVEN/MojoFailureException
[ERROR] 
[ERROR] After correcting the problems, you can resume the build with the command
[ERROR]   mvn <goals> -rf :hbase-server
Build step 'Invoke top-level Maven targets' marked build as failure
Performing Post build task...
Match found for :.* : True
Logical operation result is TRUE
Running script  : # Post-build task script. TODO: Check this in and have all builds reference
check-in.
pwd && ls
# NOTE!!!! The below code has been copied and pasted from ./dev-tools/run-test.sh
# Do not change here without syncing there and vice-versa.
ZOMBIE_TESTS_COUNT=`jps -v | grep surefirebooter | grep -e '-Dhbase.test' | wc -l`
if [[ $ZOMBIE_TESTS_COUNT != 0 ]] ; then
 echo "Suspicious java process found - waiting 30s to see if there are just slow to stop"
 sleep 30
 ZOMBIE_TESTS_COUNT=`jps -v | grep surefirebooter | grep -e '-Dhbase.test' | wc -l`
 if [[ $ZOMBIE_TESTS_COUNT != 0 ]] ; then
   echo " {color:red}There appear to be $ZOMBIE_TESTS_COUNT zombie tests{color}, they should
have been killed by surefire but survived"
   jps -v | grep surefirebooter | grep -e '-Dhbase.test'
   jps -v | grep surefirebooter | grep -e '-Dhbase.test' | cut -d ' ' -f 1 | xargs -n 1 jstack
   # Exit with error
   exit 1
 else
   echo "We're ok: there is no zombie test, but some tests took some time to stop"
 fi
else
  echo "We're ok: there is no zombie test"
fi
[yahoo-not-h2] $ /bin/bash -xe /tmp/hudson8602051710178266735.sh
+ pwd
<https://builds.apache.org/job/HBase-1.3/jdk=latest1.8,label=yahoo-not-h2/ws/>
+ ls
bin
CHANGES.txt
conf
dev-support
hbase-annotations
hbase-assembly
hbase-checkstyle
hbase-client
hbase-common
hbase-examples
hbase-external-blockcache
hbase-hadoop2-compat
hbase-hadoop-compat
hbase-it
hbase-native-client
hbase-prefix-tree
hbase-procedure
hbase-protocol
hbase-resource-bundle
hbase-rest
hbase-server
hbase-shaded
hbase-shell
hbase-testing-util
hbase-thrift
LICENSE.txt
NOTICE.txt
pom.xml
README.txt
src
target
++ jps -v
++ grep surefirebooter
++ grep -e -Dhbase.test
++ wc -l
+ ZOMBIE_TESTS_COUNT=0
+ [[ 0 != 0 ]]
+ echo 'We'\''re ok: there is no zombie test'
We're ok: there is no zombie test
POST BUILD TASK : SUCCESS
END OF POST BUILD TASK : 0
Archiving artifacts
Recording test results

Mime
View raw message