hbase-builds mailing list archives

Site index · List index
Message view « Date » · « Thread »
Top « Date » · « Thread »
From Apache Jenkins Server <jenk...@builds.apache.org>
Subject Build failed in Jenkins: HBase-Trunk_matrix » latest1.7,yahoo-not-h2 #1036
Date Sun, 12 Jun 2016 19:17:33 GMT
See <https://builds.apache.org/job/HBase-Trunk_matrix/jdk=latest1.7,label=yahoo-not-h2/1036/>

------------------------------------------
[...truncated 5637 lines...]
Running org.apache.hadoop.hbase.client.TestTableSnapshotScanner
Tests run: 12, Failures: 0, Errors: 0, Skipped: 0, Time elapsed: 70.703 sec - in org.apache.hadoop.hbase.client.TestMultiParallel
Running org.apache.hadoop.hbase.client.TestScannersFromClientSide
Running org.apache.hadoop.hbase.client.TestMultiRespectsLimits
Tests run: 4, Failures: 0, Errors: 0, Skipped: 0, Time elapsed: 44.813 sec - in org.apache.hadoop.hbase.client.TestReplicaWithCluster
Running org.apache.hadoop.hbase.client.TestSnapshotMetadata
Tests run: 2, Failures: 0, Errors: 0, Skipped: 0, Time elapsed: 26.106 sec - in org.apache.hadoop.hbase.client.TestMultiRespectsLimits
Tests run: 3, Failures: 0, Errors: 0, Skipped: 0, Time elapsed: 57.171 sec - in org.apache.hadoop.hbase.client.TestTableSnapshotScanner
Running org.apache.hadoop.hbase.client.TestMetaCache
Running org.apache.hadoop.hbase.client.TestTimestampsFilter
Tests run: 2, Failures: 0, Errors: 0, Skipped: 0, Time elapsed: 8.261 sec - in org.apache.hadoop.hbase.client.TestMetaCache
Tests run: 5, Failures: 0, Errors: 0, Skipped: 0, Time elapsed: 130.239 sec - in org.apache.hadoop.hbase.client.TestCloneSnapshotFromClient
Tests run: 4, Failures: 0, Errors: 0, Skipped: 0, Time elapsed: 35.753 sec - in org.apache.hadoop.hbase.client.TestSnapshotMetadata
Tests run: 3, Failures: 0, Errors: 0, Skipped: 0, Time elapsed: 10.183 sec - in org.apache.hadoop.hbase.client.TestTimestampsFilter
Running org.apache.hadoop.hbase.client.TestUpdateConfiguration
Tests run: 2, Failures: 0, Errors: 0, Skipped: 0, Time elapsed: 0.31 sec - in org.apache.hadoop.hbase.client.TestUpdateConfiguration
Tests run: 8, Failures: 0, Errors: 0, Skipped: 0, Time elapsed: 75.244 sec - in org.apache.hadoop.hbase.client.TestScannersFromClientSide
Running org.apache.hadoop.hbase.client.TestSnapshotFromClientWithRegionReplicas
Running org.apache.hadoop.hbase.client.TestIncrementsFromClientSide
Running org.apache.hadoop.hbase.client.TestSplitOrMergeStatus
Running org.apache.hadoop.hbase.client.TestConnectionImplementation
Tests run: 2, Failures: 0, Errors: 0, Skipped: 0, Time elapsed: 1.625 sec - in org.apache.hadoop.hbase.client.TestConnectionImplementation
Tests run: 6, Failures: 0, Errors: 0, Skipped: 0, Time elapsed: 10.409 sec - in org.apache.hadoop.hbase.client.TestIncrementsFromClientSide
Running org.apache.hadoop.hbase.client.TestMobSnapshotFromClient
Running org.apache.hadoop.hbase.client.TestAdmin1
Running org.apache.hadoop.hbase.client.TestCloneSnapshotFromClientWithRegionReplicas
Tests run: 4, Failures: 0, Errors: 0, Skipped: 0, Time elapsed: 33.48 sec - in org.apache.hadoop.hbase.client.TestSplitOrMergeStatus
Tests run: 9, Failures: 0, Errors: 0, Skipped: 0, Time elapsed: 55.676 sec - in org.apache.hadoop.hbase.client.TestSnapshotFromClientWithRegionReplicas
Running org.apache.hadoop.hbase.client.TestShortCircuitConnection
Tests run: 1, Failures: 0, Errors: 0, Skipped: 0, Time elapsed: 3.747 sec - in org.apache.hadoop.hbase.client.TestShortCircuitConnection
Tests run: 9, Failures: 0, Errors: 0, Skipped: 0, Time elapsed: 72.668 sec - in org.apache.hadoop.hbase.client.TestMobSnapshotFromClient
Running org.apache.hadoop.hbase.client.TestFromClientSide3
Running org.apache.hadoop.hbase.client.TestFastFail
Tests run: 2, Failures: 0, Errors: 0, Skipped: 1, Time elapsed: 4.565 sec - in org.apache.hadoop.hbase.client.TestFastFail
Running org.apache.hadoop.hbase.client.TestReplicasClient
Running org.apache.hadoop.hbase.client.TestSizeFailures
Tests run: 5, Failures: 0, Errors: 0, Skipped: 0, Time elapsed: 134.702 sec - in org.apache.hadoop.hbase.client.TestCloneSnapshotFromClientWithRegionReplicas
Tests run: 9, Failures: 0, Errors: 0, Skipped: 0, Time elapsed: 73.109 sec - in org.apache.hadoop.hbase.client.TestFromClientSide3
Tests run: 26, Failures: 0, Errors: 0, Skipped: 0, Time elapsed: 146.465 sec - in org.apache.hadoop.hbase.client.TestAdmin1
Running org.apache.hadoop.hbase.client.TestAdmin2
Running org.apache.hadoop.hbase.client.TestMobCloneSnapshotFromClient
Running org.apache.hadoop.hbase.client.TestFromClientSideNoCodec
Tests run: 2, Failures: 0, Errors: 0, Skipped: 0, Time elapsed: 51.331 sec - in org.apache.hadoop.hbase.client.TestSizeFailures
Running org.apache.hadoop.hbase.TestStochasticBalancerJmxMetrics
Tests run: 1, Failures: 0, Errors: 0, Skipped: 1, Time elapsed: 0.001 sec - in org.apache.hadoop.hbase.TestStochasticBalancerJmxMetrics
Tests run: 2, Failures: 0, Errors: 0, Skipped: 0, Time elapsed: 4.067 sec - in org.apache.hadoop.hbase.client.TestFromClientSideNoCodec
Running org.apache.hadoop.hbase.namespace.TestNamespaceAuditor
Running org.apache.hadoop.hbase.trace.TestHTraceHooks
Tests run: 1, Failures: 0, Errors: 0, Skipped: 0, Time elapsed: 2.631 sec - in org.apache.hadoop.hbase.trace.TestHTraceHooks
Running org.apache.hadoop.hbase.TestHBaseTestingUtility
Tests run: 13, Failures: 0, Errors: 0, Skipped: 0, Time elapsed: 62.878 sec - in org.apache.hadoop.hbase.TestHBaseTestingUtility
Running org.apache.hadoop.hbase.zookeeper.TestHQuorumPeer
Tests run: 3, Failures: 0, Errors: 0, Skipped: 0, Time elapsed: 0.783 sec - in org.apache.hadoop.hbase.zookeeper.TestHQuorumPeer
Running org.apache.hadoop.hbase.zookeeper.TestRecoverableZooKeeper
Tests run: 1, Failures: 0, Errors: 0, Skipped: 0, Time elapsed: 1.195 sec - in org.apache.hadoop.hbase.zookeeper.TestRecoverableZooKeeper
Tests run: 26, Failures: 0, Errors: 0, Skipped: 0, Time elapsed: 97.355 sec - in org.apache.hadoop.hbase.client.TestAdmin2
Running org.apache.hadoop.hbase.zookeeper.TestZooKeeperNodeTracker
Running org.apache.hadoop.hbase.zookeeper.TestZKMulti
Tests run: 3, Failures: 0, Errors: 0, Skipped: 0, Time elapsed: 0.959 sec - in org.apache.hadoop.hbase.zookeeper.TestZooKeeperNodeTracker
Tests run: 12, Failures: 0, Errors: 0, Skipped: 0, Time elapsed: 1.508 sec - in org.apache.hadoop.hbase.zookeeper.TestZKMulti
Running org.apache.hadoop.hbase.zookeeper.TestZKLeaderManager
Tests run: 1, Failures: 0, Errors: 0, Skipped: 0, Time elapsed: 0.11 sec - in org.apache.hadoop.hbase.zookeeper.TestZKLeaderManager
Running org.apache.hadoop.hbase.zookeeper.lock.TestZKInterProcessReadWriteLock
Running org.apache.hadoop.hbase.zookeeper.TestZooKeeperACL
Tests run: 7, Failures: 0, Errors: 0, Skipped: 0, Time elapsed: 0.374 sec - in org.apache.hadoop.hbase.zookeeper.TestZooKeeperACL
Running org.apache.hadoop.hbase.mapreduce.TestCellCounter
Tests run: 6, Failures: 0, Errors: 0, Skipped: 0, Time elapsed: 24.466 sec - in org.apache.hadoop.hbase.zookeeper.lock.TestZKInterProcessReadWriteLock
Running org.apache.hadoop.hbase.mapreduce.TestImportTSVWithOperationAttributes
Tests run: 12, Failures: 0, Errors: 0, Skipped: 0, Time elapsed: 129.822 sec - in org.apache.hadoop.hbase.namespace.TestNamespaceAuditor
Tests run: 2, Failures: 0, Errors: 0, Skipped: 0, Time elapsed: 23.499 sec - in org.apache.hadoop.hbase.mapreduce.TestImportTSVWithOperationAttributes
Tests run: 8, Failures: 0, Errors: 0, Skipped: 0, Time elapsed: 37.531 sec - in org.apache.hadoop.hbase.mapreduce.TestCellCounter
Running org.apache.hadoop.hbase.mapreduce.TestSecureLoadIncrementalHFilesSplitRecovery
Tests run: 5, Failures: 0, Errors: 0, Skipped: 0, Time elapsed: 169.81 sec - in org.apache.hadoop.hbase.client.TestMobCloneSnapshotFromClient
Running org.apache.hadoop.hbase.mapreduce.TestTableInputFormat
Running org.apache.hadoop.hbase.mapreduce.TestLoadIncrementalHFilesSplitRecovery
Running org.apache.hadoop.hbase.mapreduce.TestHLogRecordReader
Tests run: 2, Failures: 0, Errors: 0, Skipped: 0, Time elapsed: 1.36 sec - in org.apache.hadoop.hbase.mapreduce.TestHLogRecordReader
Running org.apache.hadoop.hbase.mapreduce.TestHRegionPartitioner
Tests run: 8, Failures: 0, Errors: 0, Skipped: 0, Time elapsed: 18.126 sec - in org.apache.hadoop.hbase.mapreduce.TestTableInputFormat
Tests run: 1, Failures: 0, Errors: 0, Skipped: 0, Time elapsed: 4.021 sec - in org.apache.hadoop.hbase.mapreduce.TestHRegionPartitioner
Tests run: 6, Failures: 0, Errors: 0, Skipped: 0, Time elapsed: 35.229 sec - in org.apache.hadoop.hbase.mapreduce.TestSecureLoadIncrementalHFilesSplitRecovery
Running org.apache.hadoop.hbase.mapreduce.TestTableInputFormatScan2
Tests run: 14, Failures: 0, Errors: 0, Skipped: 0, Time elapsed: 262.267 sec - in org.apache.hadoop.hbase.client.TestReplicasClient
Running org.apache.hadoop.hbase.mapreduce.TestTableMapReduce
Running org.apache.hadoop.hbase.mapreduce.TestWALPlayer
Running org.apache.hadoop.hbase.mapreduce.TestImportExport
Tests run: 4, Failures: 0, Errors: 0, Skipped: 0, Time elapsed: 11.992 sec - in org.apache.hadoop.hbase.mapreduce.TestWALPlayer
Tests run: 6, Failures: 0, Errors: 0, Skipped: 0, Time elapsed: 54.655 sec - in org.apache.hadoop.hbase.mapreduce.TestLoadIncrementalHFilesSplitRecovery
Running org.apache.hadoop.hbase.mapreduce.TestRowCounter
Running org.apache.hadoop.hbase.mapreduce.TestImportTSVWithVisibilityLabels
Tests run: 2, Failures: 0, Errors: 0, Skipped: 0, Time elapsed: 34.344 sec - in org.apache.hadoop.hbase.mapreduce.TestTableMapReduce
Tests run: 7, Failures: 0, Errors: 0, Skipped: 0, Time elapsed: 40.839 sec - in org.apache.hadoop.hbase.mapreduce.TestTableInputFormatScan2
Running org.apache.hadoop.hbase.mapreduce.TestHashTable
Running org.apache.hadoop.hbase.mapreduce.TestImportTSVWithTTLs
Tests run: 1, Failures: 0, Errors: 0, Skipped: 0, Time elapsed: 13.158 sec - in org.apache.hadoop.hbase.mapreduce.TestImportTSVWithTTLs
Tests run: 1, Failures: 0, Errors: 0, Skipped: 0, Time elapsed: 14.873 sec - in org.apache.hadoop.hbase.mapreduce.TestHashTable
Running org.apache.hadoop.hbase.mapreduce.TestHFileOutputFormat2
Tests run: 15, Failures: 0, Errors: 0, Skipped: 14, Time elapsed: 2.434 sec - in org.apache.hadoop.hbase.mapreduce.TestHFileOutputFormat2
Running org.apache.hadoop.hbase.mapreduce.TestWALRecordReader
Tests run: 2, Failures: 0, Errors: 0, Skipped: 0, Time elapsed: 1.84 sec - in org.apache.hadoop.hbase.mapreduce.TestWALRecordReader
Tests run: 7, Failures: 0, Errors: 0, Skipped: 0, Time elapsed: 43.269 sec - in org.apache.hadoop.hbase.mapreduce.TestRowCounter
Running org.apache.hadoop.hbase.mapreduce.TestMultiTableSnapshotInputFormat
Running org.apache.hadoop.hbase.mapreduce.TestTableInputFormatScan1
Running org.apache.hadoop.hbase.mapreduce.TestMultithreadedTableMapper
Tests run: 12, Failures: 0, Errors: 0, Skipped: 0, Time elapsed: 89.847 sec - in org.apache.hadoop.hbase.mapreduce.TestImportExport
Running org.apache.hadoop.hbase.mapreduce.TestTableSnapshotInputFormat
Tests run: 7, Failures: 0, Errors: 0, Skipped: 0, Time elapsed: 77.417 sec - in org.apache.hadoop.hbase.mapreduce.TestImportTSVWithVisibilityLabels
Running org.apache.hadoop.hbase.mapreduce.TestTimeRangeMapRed
Tests run: 4, Failures: 0, Errors: 0, Skipped: 0, Time elapsed: 42.744 sec - in org.apache.hadoop.hbase.mapreduce.TestMultiTableSnapshotInputFormat
Tests run: 1, Failures: 0, Errors: 0, Skipped: 0, Time elapsed: 12.711 sec - in org.apache.hadoop.hbase.mapreduce.TestTimeRangeMapRed
Tests run: 7, Failures: 0, Errors: 0, Skipped: 0, Time elapsed: 48.923 sec - in org.apache.hadoop.hbase.mapreduce.TestTableInputFormatScan1
Tests run: 1, Failures: 0, Errors: 0, Skipped: 0, Time elapsed: 50.876 sec - in org.apache.hadoop.hbase.mapreduce.TestMultithreadedTableMapper
Running org.apache.hadoop.hbase.mapreduce.TestSyncTable
Running org.apache.hadoop.hbase.mapreduce.TestCopyTable
Running org.apache.hadoop.hbase.TestMetaTableAccessor
Running org.apache.hadoop.hbase.mapreduce.TestMultiTableInputFormat
Tests run: 1, Failures: 0, Errors: 0, Skipped: 0, Time elapsed: 29.017 sec - in org.apache.hadoop.hbase.mapreduce.TestSyncTable
Running org.apache.hadoop.hbase.io.TestFileLink
Tests run: 15, Failures: 0, Errors: 0, Skipped: 0, Time elapsed: 26.17 sec - in org.apache.hadoop.hbase.TestMetaTableAccessor
Running org.apache.hadoop.hbase.io.hfile.TestHFileBlockIndex
Tests run: 10, Failures: 0, Errors: 0, Skipped: 0, Time elapsed: 7.563 sec - in org.apache.hadoop.hbase.io.hfile.TestHFileBlockIndex
Tests run: 5, Failures: 0, Errors: 0, Skipped: 0, Time elapsed: 15.505 sec - in org.apache.hadoop.hbase.io.TestFileLink
Running org.apache.hadoop.hbase.io.hfile.TestSeekBeforeWithInlineBlocks
Tests run: 4, Failures: 0, Errors: 0, Skipped: 0, Time elapsed: 34.161 sec - in org.apache.hadoop.hbase.mapreduce.TestMultiTableInputFormat
Running org.apache.hadoop.hbase.io.hfile.TestScannerSelectionUsingTTL
Running org.apache.hadoop.hbase.io.hfile.TestHFileSeek
Tests run: 1, Failures: 0, Errors: 0, Skipped: 0, Time elapsed: 2.873 sec - in org.apache.hadoop.hbase.io.hfile.TestHFileSeek
Running org.apache.hadoop.hbase.io.hfile.TestHFileBlock
Tests run: 1, Failures: 0, Errors: 0, Skipped: 0, Time elapsed: 13.149 sec - in org.apache.hadoop.hbase.io.hfile.TestSeekBeforeWithInlineBlocks
Tests run: 5, Failures: 0, Errors: 0, Skipped: 0, Time elapsed: 57.684 sec - in org.apache.hadoop.hbase.mapreduce.TestCopyTable
Running org.apache.hadoop.hbase.io.hfile.TestCacheConfig
Tests run: 7, Failures: 0, Errors: 0, Skipped: 0, Time elapsed: 2.422 sec - in org.apache.hadoop.hbase.io.hfile.TestCacheConfig
Running org.apache.hadoop.hbase.io.hfile.TestScannerFromBucketCache
Running org.apache.hadoop.hbase.io.hfile.TestForceCacheImportantBlocks
Tests run: 4, Failures: 0, Errors: 0, Skipped: 0, Time elapsed: 5.319 sec - in org.apache.hadoop.hbase.io.hfile.TestScannerFromBucketCache
Running org.apache.hadoop.hbase.io.hfile.TestCacheOnWrite
Tests run: 8, Failures: 0, Errors: 0, Skipped: 0, Time elapsed: 131.687 sec - in org.apache.hadoop.hbase.mapreduce.TestTableSnapshotInputFormat
Running org.apache.hadoop.hbase.io.encoding.TestLoadAndSwitchEncodeOnDisk
Tests run: 2, Failures: 0, Errors: 0, Skipped: 0, Time elapsed: 28.394 sec - in org.apache.hadoop.hbase.io.hfile.TestForceCacheImportantBlocks
Running org.apache.hadoop.hbase.io.encoding.TestChangingEncoding
Tests run: 6, Failures: 0, Errors: 0, Skipped: 0, Time elapsed: 64.167 sec - in org.apache.hadoop.hbase.io.hfile.TestScannerSelectionUsingTTL
Running org.apache.hadoop.hbase.io.encoding.TestEncodedSeekers
Tests run: 1, Failures: 0, Errors: 0, Skipped: 0, Time elapsed: 32.208 sec - in org.apache.hadoop.hbase.io.encoding.TestLoadAndSwitchEncodeOnDisk
Running org.apache.hadoop.hbase.io.encoding.TestDataBlockEncoders
Tests run: 28, Failures: 0, Errors: 0, Skipped: 0, Time elapsed: 92.631 sec - in org.apache.hadoop.hbase.io.hfile.TestHFileBlock
Running org.apache.hadoop.hbase.io.encoding.TestBufferedDataBlockEncoder
Tests run: 2, Failures: 0, Errors: 0, Skipped: 0, Time elapsed: 13.801 sec - in org.apache.hadoop.hbase.io.encoding.TestBufferedDataBlockEncoder
Running org.apache.hadoop.hbase.io.asyncfs.TestFanOutOneBlockAsyncDFSOutput
Tests run: 56, Failures: 0, Errors: 0, Skipped: 0, Time elapsed: 54.116 sec - in org.apache.hadoop.hbase.io.encoding.TestDataBlockEncoders
Running org.apache.hadoop.hbase.io.asyncfs.TestSaslFanOutOneBlockAsyncDFSOutput
Tests run: 5, Failures: 0, Errors: 0, Skipped: 0, Time elapsed: 31.376 sec - in org.apache.hadoop.hbase.io.asyncfs.TestFanOutOneBlockAsyncDFSOutput
Running org.apache.hadoop.hbase.filter.TestScanRowPrefix
Tests run: 20, Failures: 0, Errors: 0, Skipped: 0, Time elapsed: 103.631 sec - in org.apache.hadoop.hbase.io.encoding.TestEncodedSeekers
Tests run: 1, Failures: 0, Errors: 0, Skipped: 0, Time elapsed: 5.415 sec - in org.apache.hadoop.hbase.filter.TestScanRowPrefix
Tests run: 72, Failures: 0, Errors: 0, Skipped: 0, Time elapsed: 157.686 sec - in org.apache.hadoop.hbase.io.hfile.TestCacheOnWrite
Running org.apache.hadoop.hbase.filter.TestFilterWithScanLimits
Running org.apache.hadoop.hbase.filter.TestFilterWrapper
Running org.apache.hadoop.hbase.filter.TestFuzzyRowFilterEndToEnd
Tests run: 1, Failures: 0, Errors: 0, Skipped: 0, Time elapsed: 4.954 sec - in org.apache.hadoop.hbase.filter.TestFilterWrapper
Running org.apache.hadoop.hbase.filter.TestFilterListOrOperatorWithBlkCnt
Tests run: 1, Failures: 0, Errors: 0, Skipped: 0, Time elapsed: 20.091 sec - in org.apache.hadoop.hbase.filter.TestFilterListOrOperatorWithBlkCnt
Tests run: 36, Failures: 0, Errors: 0, Skipped: 0, Time elapsed: 100.413 sec - in org.apache.hadoop.hbase.io.asyncfs.TestSaslFanOutOneBlockAsyncDFSOutput
Tests run: 1, Failures: 0, Errors: 0, Skipped: 0, Time elapsed: 52.695 sec - in org.apache.hadoop.hbase.filter.TestFilterWithScanLimits
Running org.apache.hadoop.hbase.filter.TestColumnRangeFilter
Running org.apache.hadoop.hbase.filter.TestFuzzyRowAndColumnRangeFilter
Running org.apache.hadoop.hbase.filter.TestMultiRowRangeFilter
Tests run: 1, Failures: 0, Errors: 0, Skipped: 0, Time elapsed: 3.893 sec - in org.apache.hadoop.hbase.filter.TestFuzzyRowAndColumnRangeFilter
Tests run: 1, Failures: 0, Errors: 0, Skipped: 0, Time elapsed: 7.04 sec - in org.apache.hadoop.hbase.filter.TestColumnRangeFilter
Tests run: 20, Failures: 0, Errors: 0, Skipped: 0, Time elapsed: 18.105 sec - in org.apache.hadoop.hbase.filter.TestMultiRowRangeFilter
Tests run: 3, Failures: 0, Errors: 0, Skipped: 0, Time elapsed: 267.554 sec - in org.apache.hadoop.hbase.io.encoding.TestChangingEncoding
Tests run: 4, Failures: 0, Errors: 0, Skipped: 0, Time elapsed: 320.565 sec - in org.apache.hadoop.hbase.filter.TestFuzzyRowFilterEndToEnd

Results :

Tests in error: 
  TestReplicationStateHBaseImpl.clearQueues:308 » Runtime org.apache.hadoop.hbas...

Tests run: 2410, Failures: 0, Errors: 1, Skipped: 41

[INFO] ------------------------------------------------------------------------
[INFO] Reactor Summary:
[INFO] 
[INFO] Apache HBase ...................................... SUCCESS [  3.416 s]
[INFO] Apache HBase - Checkstyle ......................... SUCCESS [  0.932 s]
[INFO] Apache HBase - Resource Bundle .................... SUCCESS [  0.356 s]
[INFO] Apache HBase - Annotations ........................ SUCCESS [  0.267 s]
[INFO] Apache HBase - Protocol ........................... SUCCESS [  3.312 s]
[INFO] Apache HBase - Common ............................. SUCCESS [01:34 min]
[INFO] Apache HBase - Procedure .......................... SUCCESS [01:37 min]
[INFO] Apache HBase - Client ............................. SUCCESS [ 47.923 s]
[INFO] Apache HBase - Hadoop Compatibility ............... SUCCESS [  8.078 s]
[INFO] Apache HBase - Hadoop Two Compatibility ........... SUCCESS [  9.499 s]
[INFO] Apache HBase - Prefix Tree ........................ SUCCESS [ 11.024 s]
[INFO] Apache HBase - Server ............................. FAILURE [  01:28 h]
[INFO] Apache HBase - Testing Util ....................... SKIPPED
[INFO] Apache HBase - Thrift ............................. SKIPPED
[INFO] Apache HBase - RSGroup ............................ SKIPPED
[INFO] Apache HBase - Shell .............................. SKIPPED
[INFO] Apache HBase - Integration Tests .................. SKIPPED
[INFO] Apache HBase - Examples ........................... SKIPPED
[INFO] Apache HBase - Rest ............................... SKIPPED
[INFO] Apache HBase - External Block Cache ............... SKIPPED
[INFO] Apache HBase - Spark .............................. SKIPPED
[INFO] Apache HBase - Assembly ........................... SKIPPED
[INFO] Apache HBase - Shaded ............................. SKIPPED
[INFO] Apache HBase - Shaded - Client .................... SKIPPED
[INFO] Apache HBase - Shaded - Server .................... SKIPPED
[INFO] Apache HBase - Archetypes ......................... SKIPPED
[INFO] Apache HBase - Exemplar for hbase-client archetype  SKIPPED
[INFO] Apache HBase - Exemplar for hbase-shaded-client archetype  SKIPPED
[INFO] Apache HBase - Archetype builder .................. SKIPPED
[INFO] ------------------------------------------------------------------------
[INFO] BUILD FAILURE
[INFO] ------------------------------------------------------------------------
[INFO] Total time: 01:33 h
[INFO] Finished at: 2016-06-12T19:15:08+00:00
[INFO] Final Memory: 69M/627M
[INFO] ------------------------------------------------------------------------
[ERROR] Failed to execute goal org.apache.maven.plugins:maven-surefire-plugin:2.18.1:test
(secondPartTestsExecution) on project hbase-server: There are test failures.
[ERROR] 
[ERROR] Please refer to <https://builds.apache.org/job/HBase-Trunk_matrix/jdk=latest1.7,label=yahoo-not-h2/ws/hbase-server/target/surefire-reports>
for the individual test results.
[ERROR] -> [Help 1]
[ERROR] 
[ERROR] To see the full stack trace of the errors, re-run Maven with the -e switch.
[ERROR] Re-run Maven using the -X switch to enable full debug logging.
[ERROR] 
[ERROR] For more information about the errors and possible solutions, please read the following
articles:
[ERROR] [Help 1] http://cwiki.apache.org/confluence/display/MAVEN/MojoFailureException
[ERROR] 
[ERROR] After correcting the problems, you can resume the build with the command
[ERROR]   mvn <goals> -rf :hbase-server
Build step 'Invoke top-level Maven targets' marked build as failure
Performing Post build task...
Match found for :.* : True
Logical operation result is TRUE
Running script  : # Run zombie detector script
./dev-support/zombie-detector.sh --jenkins ${BUILD_ID}
[yahoo-not-h2] $ /bin/bash -xe /tmp/hudson3675232863792552940.sh
+ ./dev-support/zombie-detector.sh --jenkins 1036
Sun Jun 12 19:15:09 UTC 2016 We're ok: there is no zombie test


    {color:green}+1 zombies{color}. No zombie tests found running at the end of the build.
POST BUILD TASK : SUCCESS
END OF POST BUILD TASK : 0
Archiving artifacts
Recording test results
[FINDBUGS] Skipping publisher since build result is FAILURE
[CHECKSTYLE] Skipping publisher since build result is FAILURE

Mime
View raw message