hbase-builds mailing list archives

Site index · List index
Message view « Date » · « Thread »
Top « Date » · « Thread »
From Apache Jenkins Server <jenk...@builds.apache.org>
Subject Build failed in Jenkins: HBase-1.4 » latest1.8,yahoo-not-h2 #234
Date Tue, 21 Jun 2016 20:21:48 GMT
See <https://builds.apache.org/job/HBase-1.4/jdk=latest1.8,label=yahoo-not-h2/234/changes>

Changes:

[tedyu] HBASE-16051 TestScannerHeartbeatMessages fails on some machines (Phil

------------------------------------------
[...truncated 29133 lines...]
	at org.junit.runner.JUnitCore.run(JUnitCore.java:115)
	at org.apache.maven.surefire.junitcore.JUnitCoreWrapper.createRequestAndRun(JUnitCoreWrapper.java:108)
	at org.apache.maven.surefire.junitcore.JUnitCoreWrapper.executeEager(JUnitCoreWrapper.java:78)
	at org.apache.maven.surefire.junitcore.JUnitCoreWrapper.execute(JUnitCoreWrapper.java:54)
	at org.apache.maven.surefire.junitcore.JUnitCoreProvider.invoke(JUnitCoreProvider.java:156)
	at org.apache.maven.surefire.booter.ForkedBooter.invokeProviderInSameClassLoader(ForkedBooter.java:203)
	at org.apache.maven.surefire.booter.ForkedBooter.runSuitesInProcess(ForkedBooter.java:155)
	at org.apache.maven.surefire.booter.ForkedBooter.main(ForkedBooter.java:103)

Java HotSpot(TM) 64-Bit Server VM warning: ignoring option MaxPermSize=256m; support was removed
in 8.0
Running org.apache.hadoop.hbase.util.TestShowProperties
Tests run: 1, Failures: 0, Errors: 0, Skipped: 0, Time elapsed: 0.167 sec - in org.apache.hadoop.hbase.util.TestShowProperties
Java HotSpot(TM) 64-Bit Server VM warning: ignoring option MaxPermSize=256m; support was removed
in 8.0
Running org.apache.hadoop.hbase.util.TestDynamicClassLoader
Tests run: 3, Failures: 0, Errors: 0, Skipped: 0, Time elapsed: 2.174 sec - in org.apache.hadoop.hbase.util.TestDynamicClassLoader
Java HotSpot(TM) 64-Bit Server VM warning: ignoring option MaxPermSize=256m; support was removed
in 8.0
Running org.apache.hadoop.hbase.util.TestBase64
Tests run: 1, Failures: 0, Errors: 0, Skipped: 0, Time elapsed: 0.227 sec - in org.apache.hadoop.hbase.util.TestBase64
Java HotSpot(TM) 64-Bit Server VM warning: ignoring option MaxPermSize=256m; support was removed
in 8.0
Running org.apache.hadoop.hbase.util.TestCoprocessorClassLoader
Tests run: 3, Failures: 0, Errors: 0, Skipped: 0, Time elapsed: 2.239 sec - in org.apache.hadoop.hbase.util.TestCoprocessorClassLoader
Java HotSpot(TM) 64-Bit Server VM warning: ignoring option MaxPermSize=256m; support was removed
in 8.0
Running org.apache.hadoop.hbase.util.TestByteRangeWithKVSerialization
Tests run: 1, Failures: 0, Errors: 0, Skipped: 0, Time elapsed: 1.435 sec - in org.apache.hadoop.hbase.util.TestByteRangeWithKVSerialization
Java HotSpot(TM) 64-Bit Server VM warning: ignoring option MaxPermSize=256m; support was removed
in 8.0
Running org.apache.hadoop.hbase.util.TestFastLongHistogram
Tests run: 4, Failures: 0, Errors: 0, Skipped: 0, Time elapsed: 0.66 sec - in org.apache.hadoop.hbase.util.TestFastLongHistogram
Java HotSpot(TM) 64-Bit Server VM warning: ignoring option MaxPermSize=256m; support was removed
in 8.0
Running org.apache.hadoop.hbase.util.TestKeyLocker
Tests run: 1, Failures: 0, Errors: 0, Skipped: 0, Time elapsed: 0.46 sec - in org.apache.hadoop.hbase.util.TestKeyLocker
Java HotSpot(TM) 64-Bit Server VM warning: ignoring option MaxPermSize=256m; support was removed
in 8.0
Running org.apache.hadoop.hbase.io.crypto.TestKeyStoreKeyProvider
Tests run: 2, Failures: 0, Errors: 0, Skipped: 0, Time elapsed: 0.23 sec - in org.apache.hadoop.hbase.io.crypto.TestKeyStoreKeyProvider
Java HotSpot(TM) 64-Bit Server VM warning: ignoring option MaxPermSize=256m; support was removed
in 8.0
Running org.apache.hadoop.hbase.io.crypto.TestCipherProvider
Tests run: 2, Failures: 0, Errors: 0, Skipped: 0, Time elapsed: 1.148 sec - in org.apache.hadoop.hbase.io.crypto.TestCipherProvider
Java HotSpot(TM) 64-Bit Server VM warning: ignoring option MaxPermSize=256m; support was removed
in 8.0
Running org.apache.hadoop.hbase.io.crypto.TestKeyProvider
Tests run: 1, Failures: 0, Errors: 0, Skipped: 0, Time elapsed: 0.685 sec - in org.apache.hadoop.hbase.io.crypto.TestKeyProvider
Java HotSpot(TM) 64-Bit Server VM warning: ignoring option MaxPermSize=256m; support was removed
in 8.0
Running org.apache.hadoop.hbase.io.crypto.TestEncryption
Tests run: 4, Failures: 0, Errors: 0, Skipped: 0, Time elapsed: 3.056 sec - in org.apache.hadoop.hbase.io.crypto.TestEncryption
Java HotSpot(TM) 64-Bit Server VM warning: ignoring option MaxPermSize=256m; support was removed
in 8.0
Running org.apache.hadoop.hbase.io.crypto.aes.TestAES
Tests run: 2, Failures: 0, Errors: 0, Skipped: 0, Time elapsed: 1.583 sec - in org.apache.hadoop.hbase.io.crypto.aes.TestAES
Java HotSpot(TM) 64-Bit Server VM warning: ignoring option MaxPermSize=256m; support was removed
in 8.0
Running org.apache.hadoop.hbase.io.util.TestLRUDictionary
Tests run: 5, Failures: 0, Errors: 0, Skipped: 0, Time elapsed: 1.105 sec - in org.apache.hadoop.hbase.io.util.TestLRUDictionary
Java HotSpot(TM) 64-Bit Server VM warning: ignoring option MaxPermSize=256m; support was removed
in 8.0
Running org.apache.hadoop.hbase.io.TestBoundedByteBufferPool
Tests run: 3, Failures: 0, Errors: 1, Skipped: 0, Time elapsed: 0.477 sec <<< FAILURE!
- in org.apache.hadoop.hbase.io.TestBoundedByteBufferPool
testBufferSizeGrowWithMultiThread(org.apache.hadoop.hbase.io.TestBoundedByteBufferPool)  Time
elapsed: 0.1 sec  <<< ERROR!
java.lang.OutOfMemoryError: unable to create new native thread
	at java.lang.Thread.start0(Native Method)
	at java.lang.Thread.start(Thread.java:714)
	at org.apache.hadoop.hbase.io.TestBoundedByteBufferPool.testBufferSizeGrowWithMultiThread(TestBoundedByteBufferPool.java:130)

Tests run: 1, Failures: 0, Errors: 1, Skipped: 0, Time elapsed: 0.557 sec <<< FAILURE!
- in org.apache.hadoop.hbase.io.TestBoundedByteBufferPool
testBufferSizeGrowWithMultiThread(org.apache.hadoop.hbase.io.TestBoundedByteBufferPool)  Time
elapsed: 0.042 sec  <<< ERROR!
java.lang.OutOfMemoryError: unable to create new native thread
	at java.lang.Thread.start0(Native Method)
	at java.lang.Thread.start(Thread.java:714)
	at org.apache.hadoop.hbase.io.TestBoundedByteBufferPool.testBufferSizeGrowWithMultiThread(TestBoundedByteBufferPool.java:130)

Tests run: 1, Failures: 0, Errors: 1, Skipped: 0, Time elapsed: 0.69 sec <<< FAILURE!
- in org.apache.hadoop.hbase.io.TestBoundedByteBufferPool
testBufferSizeGrowWithMultiThread(org.apache.hadoop.hbase.io.TestBoundedByteBufferPool)  Time
elapsed: 0.039 sec  <<< ERROR!
java.lang.OutOfMemoryError: unable to create new native thread
	at java.lang.Thread.start0(Native Method)
	at java.lang.Thread.start(Thread.java:714)
	at org.apache.hadoop.hbase.io.TestBoundedByteBufferPool.testBufferSizeGrowWithMultiThread(TestBoundedByteBufferPool.java:130)

Java HotSpot(TM) 64-Bit Server VM warning: ignoring option MaxPermSize=256m; support was removed
in 8.0
Running org.apache.hadoop.hbase.io.TestTagCompressionContext
Tests run: 2, Failures: 0, Errors: 0, Skipped: 0, Time elapsed: 0.318 sec - in org.apache.hadoop.hbase.io.TestTagCompressionContext
Java HotSpot(TM) 64-Bit Server VM warning: ignoring option MaxPermSize=256m; support was removed
in 8.0
Running org.apache.hadoop.hbase.io.TestByteBufferInputStream
Tests run: 1, Failures: 0, Errors: 0, Skipped: 0, Time elapsed: 0.297 sec - in org.apache.hadoop.hbase.io.TestByteBufferInputStream
Java HotSpot(TM) 64-Bit Server VM warning: ignoring option MaxPermSize=256m; support was removed
in 8.0
Running org.apache.hadoop.hbase.codec.TestCellCodec
Tests run: 3, Failures: 0, Errors: 0, Skipped: 0, Time elapsed: 0.584 sec - in org.apache.hadoop.hbase.codec.TestCellCodec
Java HotSpot(TM) 64-Bit Server VM warning: ignoring option MaxPermSize=256m; support was removed
in 8.0
Running org.apache.hadoop.hbase.codec.TestCellCodecWithTags
Tests run: 1, Failures: 0, Errors: 0, Skipped: 0, Time elapsed: 0.382 sec - in org.apache.hadoop.hbase.codec.TestCellCodecWithTags
Java HotSpot(TM) 64-Bit Server VM warning: ignoring option MaxPermSize=256m; support was removed
in 8.0
Running org.apache.hadoop.hbase.codec.TestKeyValueCodecWithTags
Tests run: 1, Failures: 0, Errors: 0, Skipped: 0, Time elapsed: 0.342 sec - in org.apache.hadoop.hbase.codec.TestKeyValueCodecWithTags
Java HotSpot(TM) 64-Bit Server VM warning: ignoring option MaxPermSize=256m; support was removed
in 8.0
Running org.apache.hadoop.hbase.codec.TestKeyValueCodec
Tests run: 3, Failures: 0, Errors: 0, Skipped: 0, Time elapsed: 0.407 sec - in org.apache.hadoop.hbase.codec.TestKeyValueCodec
Java HotSpot(TM) 64-Bit Server VM warning: ignoring option MaxPermSize=256m; support was removed
in 8.0
Running org.apache.hadoop.hbase.zookeeper.TestZKConfig
Tests run: 4, Failures: 0, Errors: 0, Skipped: 0, Time elapsed: 1.377 sec - in org.apache.hadoop.hbase.zookeeper.TestZKConfig
Java HotSpot(TM) 64-Bit Server VM warning: ignoring option MaxPermSize=256m; support was removed
in 8.0
Running org.apache.hadoop.hbase.TestCompoundConfiguration
Tests run: 6, Failures: 0, Errors: 0, Skipped: 0, Time elapsed: 1.156 sec - in org.apache.hadoop.hbase.TestCompoundConfiguration
Java HotSpot(TM) 64-Bit Server VM warning: ignoring option MaxPermSize=256m; support was removed
in 8.0
Running org.apache.hadoop.hbase.TestHBaseConfiguration
Tests run: 3, Failures: 0, Errors: 0, Skipped: 0, Time elapsed: 0.921 sec - in org.apache.hadoop.hbase.TestHBaseConfiguration
Java HotSpot(TM) 64-Bit Server VM warning: ignoring option MaxPermSize=256m; support was removed
in 8.0
Running org.apache.hadoop.hbase.TestChoreService
Tests run: 17, Failures: 0, Errors: 0, Skipped: 0, Time elapsed: 23.154 sec - in org.apache.hadoop.hbase.TestChoreService

Results :

Tests in error: 
org.apache.hadoop.hbase.io.TestBoundedByteBufferPool.testBufferSizeGrowWithMultiThread(org.apache.hadoop.hbase.io.TestBoundedByteBufferPool)
  Run 1: TestBoundedByteBufferPool.testBufferSizeGrowWithMultiThread:130 » OutOfMemory ...
  Run 2: TestBoundedByteBufferPool.testBufferSizeGrowWithMultiThread:130 » OutOfMemory ...
  Run 3: TestBoundedByteBufferPool.testBufferSizeGrowWithMultiThread:130 » OutOfMemory ...

org.apache.hadoop.hbase.util.TestCounter.testIncrement(org.apache.hadoop.hbase.util.TestCounter)
  Run 1: TestCounter.testIncrement:40->execute:93 » OutOfMemory unable to create new na...
  Run 2: TestCounter.testIncrement:40->execute:93 » OutOfMemory unable to create new na...
  Run 3: TestCounter.testIncrement:40->execute:93 » OutOfMemory unable to create new na...

org.apache.hadoop.hbase.util.TestCounter.testIncrementAndGet(org.apache.hadoop.hbase.util.TestCounter)
  Run 1: TestCounter.testIncrementAndGet:56->execute:93 » OutOfMemory unable to create
...
  Run 2: TestCounter.testIncrementAndGet:56->execute:93 » OutOfMemory unable to create
...
  Run 3: TestCounter.testIncrementAndGet:56->execute:93 » OutOfMemory unable to create
...

org.apache.hadoop.hbase.util.TestWeakObjectPool.testCongestion(org.apache.hadoop.hbase.util.TestWeakObjectPool)
  Run 1: TestWeakObjectPool.testCongestion:122 » OutOfMemory unable to create new nativ...
  Run 2: TestWeakObjectPool.testCongestion:122 » OutOfMemory unable to create new nativ...
  Run 3: TestWeakObjectPool.testCongestion » OutOfMemory unable to create new native th...


Tests run: 240, Failures: 0, Errors: 4, Skipped: 1

[INFO] ------------------------------------------------------------------------
[INFO] Reactor Summary:
[INFO] 
[INFO] Apache HBase ...................................... SUCCESS [59.817s]
[INFO] Apache HBase - Checkstyle ......................... SUCCESS [5.459s]
[INFO] Apache HBase - Resource Bundle .................... SUCCESS [0.419s]
[INFO] Apache HBase - Annotations ........................ SUCCESS [1.969s]
[INFO] Apache HBase - Protocol ........................... SUCCESS [28.697s]
[INFO] Apache HBase - Common ............................. FAILURE [17:57.783s]
[INFO] Apache HBase - Procedure .......................... SKIPPED
[INFO] Apache HBase - Client ............................. SKIPPED
[INFO] Apache HBase - Hadoop Compatibility ............... SKIPPED
[INFO] Apache HBase - Hadoop Two Compatibility ........... SKIPPED
[INFO] Apache HBase - Prefix Tree ........................ SKIPPED
[INFO] Apache HBase - Server ............................. SKIPPED
[INFO] Apache HBase - Testing Util ....................... SKIPPED
[INFO] Apache HBase - Thrift ............................. SKIPPED
[INFO] Apache HBase - Rest ............................... SKIPPED
[INFO] Apache HBase - Shell .............................. SKIPPED
[INFO] Apache HBase - Integration Tests .................. SKIPPED
[INFO] Apache HBase - Examples ........................... SKIPPED
[INFO] Apache HBase - External Block Cache ............... SKIPPED
[INFO] Apache HBase - Assembly ........................... SKIPPED
[INFO] Apache HBase - Shaded ............................. SKIPPED
[INFO] Apache HBase - Shaded - Client .................... SKIPPED
[INFO] Apache HBase - Shaded - Server .................... SKIPPED
[INFO] Apache HBase - Archetypes ......................... SKIPPED
[INFO] Apache HBase - Exemplar for hbase-client archetype  SKIPPED
[INFO] Apache HBase - Exemplar for hbase-shaded-client archetype  SKIPPED
[INFO] Apache HBase - Archetype builder .................. SKIPPED
[INFO] ------------------------------------------------------------------------
[INFO] BUILD FAILURE
[INFO] ------------------------------------------------------------------------
[INFO] Total time: 19:53.675s
[INFO] Finished at: Tue Jun 21 20:21:14 UTC 2016
[INFO] Final Memory: 71M/2032M
[INFO] ------------------------------------------------------------------------
[ERROR] Failed to execute goal org.apache.maven.plugins:maven-surefire-plugin:2.18.1:test
(default-test) on project hbase-common: ExecutionException: org.apache.maven.surefire.booter.SurefireBooterForkException:
Error occurred in starting fork, check output in log -> [Help 1]
[ERROR] 
[ERROR] To see the full stack trace of the errors, re-run Maven with the -e switch.
[ERROR] Re-run Maven using the -X switch to enable full debug logging.
[ERROR] 
[ERROR] For more information about the errors and possible solutions, please read the following
articles:
[ERROR] [Help 1] http://cwiki.apache.org/confluence/display/MAVEN/MojoFailureException
[ERROR] 
[ERROR] After correcting the problems, you can resume the build with the command
[ERROR]   mvn <goals> -rf :hbase-common
Build step 'Invoke top-level Maven targets' marked build as failure
Performing Post build task...
Match found for :.* : True
Logical operation result is TRUE
Running script  : # Post-build task script. TODO: Check this in and have all builds reference
check-in.
pwd && ls
# NOTE!!!! The below code has been copied and pasted from ./dev-tools/run-test.sh
# Do not change here without syncing there and vice-versa.
ZOMBIE_TESTS_COUNT=`jps -v | grep surefirebooter | grep -e '-Dhbase.test' | wc -l`
if [[ $ZOMBIE_TESTS_COUNT != 0 ]] ; then
 echo "Suspicious java process found - waiting 30s to see if there are just slow to stop"
 sleep 30
 ZOMBIE_TESTS_COUNT=`jps -v | grep surefirebooter | grep -e '-Dhbase.test' | wc -l`
 if [[ $ZOMBIE_TESTS_COUNT != 0 ]] ; then
   echo " {color:red}There appear to be $ZOMBIE_TESTS_COUNT zombie tests{color}, they should
have been killed by surefire but survived"
   jps -v | grep surefirebooter | grep -e '-Dhbase.test'
   jps -v | grep surefirebooter | grep -e '-Dhbase.test' | cut -d ' ' -f 1 | xargs -n 1 jstack
   # Exit with error
   exit 1
 else
   echo "We're ok: there is no zombie test, but some tests took some time to stop"
 fi
else
  echo "We're ok: there is no zombie test"
fi
[yahoo-not-h2] $ /bin/bash -xe /tmp/hudson5596312083156325118.sh
+ pwd
<https://builds.apache.org/job/HBase-1.4/jdk=latest1.8,label=yahoo-not-h2/ws/>
+ ls
bin
CHANGES.txt
conf
dev-support
hbase-annotations
hbase-archetypes
hbase-assembly
hbase-checkstyle
hbase-client
hbase-common
hbase-examples
hbase-external-blockcache
hbase-hadoop2-compat
hbase-hadoop-compat
hbase-it
hbase-native-client
hbase-prefix-tree
hbase-procedure
hbase-protocol
hbase-resource-bundle
hbase-rest
hbase-server
hbase-shaded
hbase-shell
hbase-testing-util
hbase-thrift
LICENSE.txt
NOTICE.txt
pom.xml
README.txt
src
target
++ wc -l
++ grep -e -Dhbase.test
++ grep surefirebooter
++ jps -v
+ ZOMBIE_TESTS_COUNT=0
+ [[ 0 != 0 ]]
+ echo 'We'\''re ok: there is no zombie test'
We're ok: there is no zombie test
POST BUILD TASK : SUCCESS
END OF POST BUILD TASK : 0
Archiving artifacts
Compressed 1.32 MB of artifacts by 42.7% relative to #224
Recording test results

Mime
View raw message