hbase-builds mailing list archives

Site index · List index
Message view « Date » · « Thread »
Top « Date » · « Thread »
From Stack <st...@duboce.net>
Subject Re: Build failed in Jenkins: HBase-Trunk_matrix » latest1.8,yahoo-not-h2 #958
Date Sun, 29 May 2016 22:39:58 GMT
I tried these tests locally and they pass. So, must be flakies.
St.Ack


On Sun, May 29, 2016 at 12:27 PM, Apache Jenkins Server <
jenkins@builds.apache.org> wrote:

> See <
> https://builds.apache.org/job/HBase-Trunk_matrix/jdk=latest1.8,label=yahoo-not-h2/958/changes
> >
>
> Changes:
>
> [stack] HBASE-15610 Remove deprecated HConnection for 2.0 thus removing
> all PB
>
> ------------------------------------------
> [...truncated 7426 lines...]
> Java HotSpot(TM) 64-Bit Server VM warning: ignoring option
> MaxPermSize=256m; support was removed in 8.0
> Java HotSpot(TM) 64-Bit Server VM warning: ignoring option
> MaxPermSize=256m; support was removed in 8.0
> Running org.apache.hadoop.hbase.regionserver.wal.TestDurability
> Tests run: 6, Failures: 0, Errors: 0, Skipped: 0, Time elapsed: 3.848 sec
> - in org.apache.hadoop.hbase.regionserver.wal.TestDurability
> Java HotSpot(TM) 64-Bit Server VM warning: ignoring option
> MaxPermSize=256m; support was removed in 8.0
> Java HotSpot(TM) 64-Bit Server VM warning: ignoring option
> MaxPermSize=256m; support was removed in 8.0
> Running org.apache.hadoop.hbase.regionserver.wal.TestLogRollPeriod
> Running org.apache.hadoop.hbase.regionserver.wal.TestAsyncWALReplay
> Tests run: 7, Failures: 0, Errors: 0, Skipped: 0, Time elapsed: 194.498
> sec - in org.apache.hadoop.hbase.regionserver.TestRegionReplicas
> Java HotSpot(TM) 64-Bit Server VM warning: ignoring option
> MaxPermSize=256m; support was removed in 8.0
> Java HotSpot(TM) 64-Bit Server VM warning: ignoring option
> MaxPermSize=256m; support was removed in 8.0
> Java HotSpot(TM) 64-Bit Server VM warning: ignoring option
> MaxPermSize=256m; support was removed in 8.0
> Running org.apache.hadoop.hbase.regionserver.wal.TestSecureAsyncWALReplay
> Tests run: 12, Failures: 0, Errors: 0, Skipped: 0, Time elapsed: 39.756
> sec - in org.apache.hadoop.hbase.regionserver.wal.TestAsyncWALReplay
> Java HotSpot(TM) 64-Bit Server VM warning: ignoring option
> MaxPermSize=256m; support was removed in 8.0
> Tests run: 2, Failures: 0, Errors: 0, Skipped: 0, Time elapsed: 62.344 sec
> - in org.apache.hadoop.hbase.regionserver.wal.TestLogRollPeriod
> Running org.apache.hadoop.hbase.regionserver.wal.TestAsyncLogRollPeriod
> Java HotSpot(TM) 64-Bit Server VM warning: ignoring option
> MaxPermSize=256m; support was removed in 8.0
> Java HotSpot(TM) 64-Bit Server VM warning: ignoring option
> MaxPermSize=256m; support was removed in 8.0
> Running org.apache.hadoop.hbase.regionserver.TestScannerWithBulkload
> Tests run: 12, Failures: 0, Errors: 0, Skipped: 0, Time elapsed: 41.936
> sec - in org.apache.hadoop.hbase.regionserver.wal.TestSecureAsyncWALReplay
> Java HotSpot(TM) 64-Bit Server VM warning: ignoring option
> MaxPermSize=256m; support was removed in 8.0
> Java HotSpot(TM) 64-Bit Server VM warning: ignoring option
> MaxPermSize=256m; support was removed in 8.0
> Tests run: 3, Failures: 0, Errors: 0, Skipped: 0, Time elapsed: 13.42 sec
> - in org.apache.hadoop.hbase.regionserver.TestScannerWithBulkload
> Java HotSpot(TM) 64-Bit Server VM warning: ignoring option
> MaxPermSize=256m; support was removed in 8.0
> Java HotSpot(TM) 64-Bit Server VM warning: ignoring option
> MaxPermSize=256m; support was removed in 8.0
> Java HotSpot(TM) 64-Bit Server VM warning: ignoring option
> MaxPermSize=256m; support was removed in 8.0
> Java HotSpot(TM) 64-Bit Server VM warning: ignoring option
> MaxPermSize=256m; support was removed in 8.0
> Running
> org.apache.hadoop.hbase.regionserver.throttle.TestFlushWithThroughputController
> Running org.apache.hadoop.hbase.regionserver.TestEncryptionRandomKeying
> Tests run: 1, Failures: 0, Errors: 0, Skipped: 0, Time elapsed: 1.263 sec
> - in org.apache.hadoop.hbase.regionserver.TestEncryptionRandomKeying
> Java HotSpot(TM) 64-Bit Server VM warning: ignoring option
> MaxPermSize=256m; support was removed in 8.0
> Running
> org.apache.hadoop.hbase.regionserver.throttle.TestCompactionWithThroughputController
> Tests run: 2, Failures: 0, Errors: 0, Skipped: 0, Time elapsed: 62.011 sec
> - in org.apache.hadoop.hbase.regionserver.wal.TestAsyncLogRollPeriod
> Java HotSpot(TM) 64-Bit Server VM warning: ignoring option
> MaxPermSize=256m; support was removed in 8.0
> Running org.apache.hadoop.hbase.regionserver.TestDefaultMemStore
> Tests run: 23, Failures: 0, Errors: 0, Skipped: 0, Time elapsed: 21.821
> sec - in org.apache.hadoop.hbase.regionserver.TestDefaultMemStore
> Java HotSpot(TM) 64-Bit Server VM warning: ignoring option
> MaxPermSize=256m; support was removed in 8.0
> Running org.apache.hadoop.hbase.regionserver.TestMasterAddressTracker
> Tests run: 5, Failures: 0, Errors: 0, Skipped: 0, Time elapsed: 0.996 sec
> - in org.apache.hadoop.hbase.regionserver.TestMasterAddressTracker
> Java HotSpot(TM) 64-Bit Server VM warning: ignoring option
> MaxPermSize=256m; support was removed in 8.0
> Tests run: 4, Failures: 0, Errors: 0, Skipped: 0, Time elapsed: 181.732
> sec - in org.apache.hadoop.hbase.regionserver.wal.TestAsyncLogRolling
> Java HotSpot(TM) 64-Bit Server VM warning: ignoring option
> MaxPermSize=256m; support was removed in 8.0
> Running org.apache.hadoop.hbase.regionserver.TestParallelPut
> Running org.apache.hadoop.hbase.regionserver.TestSplitTransactionOnCluster
> Tests run: 2, Failures: 0, Errors: 0, Skipped: 0, Time elapsed: 5.221 sec
> - in org.apache.hadoop.hbase.regionserver.TestParallelPut
> Java HotSpot(TM) 64-Bit Server VM warning: ignoring option
> MaxPermSize=256m; support was removed in 8.0
> Running org.apache.hadoop.hbase.regionserver.TestColumnSeeking
> Tests run: 2, Failures: 0, Errors: 0, Skipped: 0, Time elapsed: 8.261 sec
> - in org.apache.hadoop.hbase.regionserver.TestColumnSeeking
> Java HotSpot(TM) 64-Bit Server VM warning: ignoring option
> MaxPermSize=256m; support was removed in 8.0
> Running
> org.apache.hadoop.hbase.regionserver.TestRegionServerOnlineConfigChange
> Tests run: 2, Failures: 0, Errors: 0, Skipped: 0, Time elapsed: 1.23 sec -
> in org.apache.hadoop.hbase.regionserver.TestRegionServerOnlineConfigChange
> Java HotSpot(TM) 64-Bit Server VM warning: ignoring option
> MaxPermSize=256m; support was removed in 8.0
> Java HotSpot(TM) 64-Bit Server VM warning: ignoring option
> MaxPermSize=256m; support was removed in 8.0
> Running org.apache.hadoop.hbase.regionserver.TestCorruptedRegionStoreFile
> Tests run: 3, Failures: 0, Errors: 0, Skipped: 0, Time elapsed: 93.733 sec
> - in
> org.apache.hadoop.hbase.regionserver.throttle.TestCompactionWithThroughputController
> Java HotSpot(TM) 64-Bit Server VM warning: ignoring option
> MaxPermSize=256m; support was removed in 8.0
> Running org.apache.hadoop.hbase.regionserver.TestRegionIncrement
> Tests run: 3, Failures: 0, Errors: 0, Skipped: 0, Time elapsed: 6.052 sec
> - in org.apache.hadoop.hbase.regionserver.TestRegionIncrement
> Java HotSpot(TM) 64-Bit Server VM warning: ignoring option
> MaxPermSize=256m; support was removed in 8.0
> Java HotSpot(TM) 64-Bit Server VM warning: ignoring option
> MaxPermSize=256m; support was removed in 8.0
> Java HotSpot(TM) 64-Bit Server VM warning: ignoring option
> MaxPermSize=256m; support was removed in 8.0
> Running org.apache.hadoop.hbase.regionserver.TestCompaction
> Tests run: 5, Failures: 0, Errors: 0, Skipped: 0, Time elapsed: 263.946
> sec - in org.apache.hadoop.hbase.regionserver.wal.TestLogRolling
> Tests run: 5, Failures: 0, Errors: 0, Skipped: 0, Time elapsed: 10.824 sec
> - in org.apache.hadoop.hbase.regionserver.TestCompaction
> Java HotSpot(TM) 64-Bit Server VM warning: ignoring option
> MaxPermSize=256m; support was removed in 8.0
> Java HotSpot(TM) 64-Bit Server VM warning: ignoring option
> MaxPermSize=256m; support was removed in 8.0
> Java HotSpot(TM) 64-Bit Server VM warning: ignoring option
> MaxPermSize=256m; support was removed in 8.0
> Running org.apache.hadoop.hbase.regionserver.TestRecoveredEdits
> Tests run: 1, Failures: 0, Errors: 0, Skipped: 0, Time elapsed: 9.486 sec
> - in org.apache.hadoop.hbase.regionserver.TestRecoveredEdits
> Java HotSpot(TM) 64-Bit Server VM warning: ignoring option
> MaxPermSize=256m; support was removed in 8.0
> Tests run: 3, Failures: 0, Errors: 0, Skipped: 0, Time elapsed: 139.942
> sec - in
> org.apache.hadoop.hbase.regionserver.throttle.TestFlushWithThroughputController
> Java HotSpot(TM) 64-Bit Server VM warning: ignoring option
> MaxPermSize=256m; support was removed in 8.0
> Running org.apache.hadoop.hbase.regionserver.TestGetClosestAtOrBefore
> Running org.apache.hadoop.hbase.regionserver.TestCompoundBloomFilter
> Tests run: 3, Failures: 0, Errors: 0, Skipped: 0, Time elapsed: 2.554 sec
> - in org.apache.hadoop.hbase.regionserver.TestGetClosestAtOrBefore
> Java HotSpot(TM) 64-Bit Server VM warning: ignoring option
> MaxPermSize=256m; support was removed in 8.0
> Running org.apache.hadoop.hbase.regionserver.TestRegionServerReportForDuty
> Running org.apache.hadoop.hbase.regionserver.TestRemoveRegionMetrics
> Tests run: 1, Failures: 0, Errors: 0, Skipped: 0, Time elapsed: 22.945 sec
> - in org.apache.hadoop.hbase.regionserver.TestRegionServerReportForDuty
> Java HotSpot(TM) 64-Bit Server VM warning: ignoring option
> MaxPermSize=256m; support was removed in 8.0
> Java HotSpot(TM) 64-Bit Server VM warning: ignoring option
> MaxPermSize=256m; support was removed in 8.0
> Java HotSpot(TM) 64-Bit Server VM warning: ignoring option
> MaxPermSize=256m; support was removed in 8.0
> Java HotSpot(TM) 64-Bit Server VM warning: ignoring option
> MaxPermSize=256m; support was removed in 8.0
> Tests run: 15, Failures: 0, Errors: 0, Skipped: 0, Time elapsed: 103.543
> sec - in org.apache.hadoop.hbase.regionserver.TestSplitTransactionOnCluster
> Java HotSpot(TM) 64-Bit Server VM warning: ignoring option
> MaxPermSize=256m; support was removed in 8.0
> Java HotSpot(TM) 64-Bit Server VM warning: ignoring option
> MaxPermSize=256m; support was removed in 8.0
> Running org.apache.hadoop.hbase.regionserver.TestHRegion
> Running org.apache.hadoop.hbase.regionserver.TestMobStoreScanner
> Tests run: 2, Failures: 0, Errors: 0, Skipped: 0, Time elapsed: 115.588
> sec - in org.apache.hadoop.hbase.regionserver.TestCorruptedRegionStoreFile
> Java HotSpot(TM) 64-Bit Server VM warning: ignoring option
> MaxPermSize=256m; support was removed in 8.0
> Java HotSpot(TM) 64-Bit Server VM warning: ignoring option
> MaxPermSize=256m; support was removed in 8.0
> Java HotSpot(TM) 64-Bit Server VM warning: ignoring option
> MaxPermSize=256m; support was removed in 8.0
> Java HotSpot(TM) 64-Bit Server VM warning: ignoring option
> MaxPermSize=256m; support was removed in 8.0
> Java HotSpot(TM) 64-Bit Server VM warning: ignoring option
> MaxPermSize=256m; support was removed in 8.0
> Running
> org.apache.hadoop.hbase.regionserver.compactions.TestCompactedHFilesDischarger
> Tests run: 3, Failures: 0, Errors: 0, Skipped: 0, Time elapsed: 2.807 sec
> - in
> org.apache.hadoop.hbase.regionserver.compactions.TestCompactedHFilesDischarger
> Java HotSpot(TM) 64-Bit Server VM warning: ignoring option
> MaxPermSize=256m; support was removed in 8.0
> Running
> org.apache.hadoop.hbase.regionserver.compactions.TestFIFOCompactionPolicy
> Tests run: 6, Failures: 0, Errors: 0, Skipped: 0, Time elapsed: 47.913 sec
> - in org.apache.hadoop.hbase.regionserver.TestMobStoreScanner
> Java HotSpot(TM) 64-Bit Server VM warning: ignoring option
> MaxPermSize=256m; support was removed in 8.0
> Running org.apache.hadoop.hbase.regionserver.TestAtomicOperation
> Tests run: 103, Failures: 0, Errors: 0, Skipped: 0, Time elapsed: 87.753
> sec - in org.apache.hadoop.hbase.regionserver.TestHRegion
> Java HotSpot(TM) 64-Bit Server VM warning: ignoring option
> MaxPermSize=256m; support was removed in 8.0
> Tests run: 4, Failures: 0, Errors: 0, Skipped: 0, Time elapsed: 49.044 sec
> - in
> org.apache.hadoop.hbase.regionserver.compactions.TestFIFOCompactionPolicy
> Java HotSpot(TM) 64-Bit Server VM warning: ignoring option
> MaxPermSize=256m; support was removed in 8.0
> Running org.apache.hadoop.hbase.regionserver.TestTimestampFilterSeekHint
> Running org.apache.hadoop.hbase.regionserver.TestDeleteMobTable
> Tests run: 8, Failures: 0, Errors: 0, Skipped: 0, Time elapsed: 48.009 sec
> - in org.apache.hadoop.hbase.regionserver.TestAtomicOperation
> Java HotSpot(TM) 64-Bit Server VM warning: ignoring option
> MaxPermSize=256m; support was removed in 8.0
> Running org.apache.hadoop.hbase.regionserver.TestCompactingMemStore
> Tests run: 2, Failures: 0, Errors: 0, Skipped: 0, Time elapsed: 23.746 sec
> - in org.apache.hadoop.hbase.regionserver.TestTimestampFilterSeekHint
> Java HotSpot(TM) 64-Bit Server VM warning: ignoring option
> MaxPermSize=256m; support was removed in 8.0
> Java HotSpot(TM) 64-Bit Server VM warning: ignoring option
> MaxPermSize=256m; support was removed in 8.0
> Tests run: 3, Failures: 0, Errors: 0, Skipped: 0, Time elapsed: 20.768 sec
> - in org.apache.hadoop.hbase.regionserver.TestDeleteMobTable
> Running org.apache.hadoop.hbase.regionserver.TestFSErrorsExposed
> Java HotSpot(TM) 64-Bit Server VM warning: ignoring option
> MaxPermSize=256m; support was removed in 8.0
> Running org.apache.hadoop.hbase.regionserver.TestRSKilledWhenInitializing
> Tests run: 1, Failures: 0, Errors: 0, Skipped: 0, Time elapsed: 159.399
> sec - in org.apache.hadoop.hbase.regionserver.TestRemoveRegionMetrics
> Java HotSpot(TM) 64-Bit Server VM warning: ignoring option
> MaxPermSize=256m; support was removed in 8.0
> Java HotSpot(TM) 64-Bit Server VM warning: ignoring option
> MaxPermSize=256m; support was removed in 8.0
> Running org.apache.hadoop.hbase.regionserver.TestMultiColumnScanner
> Tests run: 3, Failures: 0, Errors: 0, Skipped: 0, Time elapsed: 170.071
> sec - in org.apache.hadoop.hbase.regionserver.TestCompoundBloomFilter
> Java HotSpot(TM) 64-Bit Server VM warning: ignoring option
> MaxPermSize=256m; support was removed in 8.0
> Java HotSpot(TM) 64-Bit Server VM warning: ignoring option
> MaxPermSize=256m; support was removed in 8.0
> Java HotSpot(TM) 64-Bit Server VM warning: ignoring option
> MaxPermSize=256m; support was removed in 8.0
> Running org.apache.hadoop.hbase.regionserver.TestFlushRegionEntry
> Tests run: 29, Failures: 0, Errors: 0, Skipped: 0, Time elapsed: 27.661
> sec - in org.apache.hadoop.hbase.regionserver.TestCompactingMemStore
> Java HotSpot(TM) 64-Bit Server VM warning: ignoring option
> MaxPermSize=256m; support was removed in 8.0
> Tests run: 1, Failures: 0, Errors: 0, Skipped: 0, Time elapsed: 0.54 sec -
> in org.apache.hadoop.hbase.regionserver.TestFlushRegionEntry
> Java HotSpot(TM) 64-Bit Server VM warning: ignoring option
> MaxPermSize=256m; support was removed in 8.0
> Java HotSpot(TM) 64-Bit Server VM warning: ignoring option
> MaxPermSize=256m; support was removed in 8.0
> Running org.apache.hadoop.hbase.regionserver.TestStore
> Java HotSpot(TM) 64-Bit Server VM warning: ignoring option
> MaxPermSize=256m; support was removed in 8.0
> Running org.apache.hadoop.hbase.TestMetaTableLocator
> Tests run: 7, Failures: 0, Errors: 0, Skipped: 0, Time elapsed: 4.677 sec
> - in org.apache.hadoop.hbase.TestMetaTableLocator
> Java HotSpot(TM) 64-Bit Server VM warning: ignoring option
> MaxPermSize=256m; support was removed in 8.0
> Java HotSpot(TM) 64-Bit Server VM warning: ignoring option
> MaxPermSize=256m; support was removed in 8.0
> Java HotSpot(TM) 64-Bit Server VM warning: ignoring option
> MaxPermSize=256m; support was removed in 8.0
> Java HotSpot(TM) 64-Bit Server VM warning: ignoring option
> MaxPermSize=256m; support was removed in 8.0
> Java HotSpot(TM) 64-Bit Server VM warning: ignoring option
> MaxPermSize=256m; support was removed in 8.0
> Tests run: 18, Failures: 0, Errors: 0, Skipped: 0, Time elapsed: 14.287
> sec - in org.apache.hadoop.hbase.regionserver.TestStore
> Java HotSpot(TM) 64-Bit Server VM warning: ignoring option
> MaxPermSize=256m; support was removed in 8.0
> Java HotSpot(TM) 64-Bit Server VM warning: ignoring option
> MaxPermSize=256m; support was removed in 8.0
> Running org.apache.hadoop.hbase.TestStochasticBalancerJmxMetrics
> Tests run: 1, Failures: 0, Errors: 0, Skipped: 1, Time elapsed: 0.001 sec
> - in org.apache.hadoop.hbase.TestStochasticBalancerJmxMetrics
> Java HotSpot(TM) 64-Bit Server VM warning: ignoring option
> MaxPermSize=256m; support was removed in 8.0
> Tests run: 1, Failures: 0, Errors: 0, Skipped: 0, Time elapsed: 30.06 sec
> - in org.apache.hadoop.hbase.regionserver.TestRSKilledWhenInitializing
> Running org.apache.hadoop.hbase.namespace.TestNamespaceAuditor
> Tests run: 3, Failures: 0, Errors: 0, Skipped: 0, Time elapsed: 58.085 sec
> - in org.apache.hadoop.hbase.regionserver.TestFSErrorsExposed
> Tests run: 12, Failures: 0, Errors: 0, Skipped: 0, Time elapsed: 49.868
> sec - in org.apache.hadoop.hbase.regionserver.TestMultiColumnScanner
> Tests run: 12, Failures: 0, Errors: 0, Skipped: 0, Time elapsed: 160.986
> sec - in org.apache.hadoop.hbase.namespace.TestNamespaceAuditor
>
> Results :
>
> Failed tests:
>
> TestStochasticLoadBalancer2.testRegionReplicasOnMidClusterHighReplication:80->BalancerTestBase.testWithCluster:423->BalancerTestBase.testWithCluster:451->BalancerTestBase.assertRegionReplicaPlacement:226
> Two or more region replicas are hosted on the same host after balance
> Tests in error:
>   TestAdmin1.tearDown:108 » RetriesExhausted Failed after attempts=7,
> exceptions...
>
> org.apache.hadoop.hbase.client.TestAdmin1.testGetTableDescriptor(org.apache.hadoop.hbase.client.TestAdmin1)
>   Run 1: TestAdmin1.testGetTableDescriptor:424 » RetriesExhausted Failed
> after attempts...
>   Run 2: TestAdmin1.tearDown:108 » RetriesExhausted Failed after
> attempts=7, exceptions...
>
>
> org.apache.hadoop.hbase.client.TestAdmin1.testHFileReplication(org.apache.hadoop.hbase.client.TestAdmin1)
>   Run 1: TestAdmin1.testHFileReplication:1359 » RetriesExhausted Failed
> after attempts=...
>   Run 2: TestAdmin1.tearDown:108 » RetriesExhausted Failed after
> attempts=7, exceptions...
>
>   TestAdmin1.tearDown:108 » RetriesExhausted Failed after attempts=7,
> exceptions...
>
> org.apache.hadoop.hbase.client.TestAdmin1.testMergeRegions(org.apache.hadoop.hbase.client.TestAdmin1)
>   Run 1: TestAdmin1.testMergeRegions:1433 » RetriesExhausted Failed after
> attempts=7, e...
>   Run 2: TestAdmin1.tearDown:108 » RetriesExhausted Failed after
> attempts=7, exceptions...
>
>
> org.apache.hadoop.hbase.client.TestAdmin1.testTableExist(org.apache.hadoop.hbase.client.TestAdmin1)
>   Run 1: TestAdmin1.testTableExist:934 » RetriesExhausted Failed after
> attempts=7, exce...
>   Run 2: TestAdmin1.tearDown:108 » RetriesExhausted Failed after
> attempts=7, exceptions...
>
>
> Tests run: 2878, Failures: 1, Errors: 6, Skipped: 49
>
> [INFO]
> ------------------------------------------------------------------------
> [INFO] Reactor Summary:
> [INFO]
> [INFO] Apache HBase ...................................... SUCCESS [
> 2.466 s]
> [INFO] Apache HBase - Checkstyle ......................... SUCCESS [
> 0.537 s]
> [INFO] Apache HBase - Resource Bundle .................... SUCCESS [
> 0.127 s]
> [INFO] Apache HBase - Annotations ........................ SUCCESS [
> 0.122 s]
> [INFO] Apache HBase - Protocol ........................... SUCCESS [
> 2.329 s]
> [INFO] Apache HBase - Common ............................. SUCCESS [01:25
> min]
> [INFO] Apache HBase - Procedure .......................... SUCCESS [01:36
> min]
> [INFO] Apache HBase - Client ............................. SUCCESS [
> 34.571 s]
> [INFO] Apache HBase - Hadoop Compatibility ............... SUCCESS [
> 7.456 s]
> [INFO] Apache HBase - Hadoop Two Compatibility ........... SUCCESS [
> 8.881 s]
> [INFO] Apache HBase - Prefix Tree ........................ SUCCESS [
> 7.845 s]
> [INFO] Apache HBase - Server ............................. FAILURE [
> 01:41 h]
> [INFO] Apache HBase - Testing Util ....................... SKIPPED
> [INFO] Apache HBase - Thrift ............................. SKIPPED
> [INFO] Apache HBase - RSGroup ............................ SKIPPED
> [INFO] Apache HBase - Shell .............................. SKIPPED
> [INFO] Apache HBase - Integration Tests .................. SKIPPED
> [INFO] Apache HBase - Examples ........................... SKIPPED
> [INFO] Apache HBase - Rest ............................... SKIPPED
> [INFO] Apache HBase - External Block Cache ............... SKIPPED
> [INFO] Apache HBase - Spark .............................. SKIPPED
> [INFO] Apache HBase - Assembly ........................... SKIPPED
> [INFO] Apache HBase - Shaded ............................. SKIPPED
> [INFO] Apache HBase - Shaded - Client .................... SKIPPED
> [INFO] Apache HBase - Shaded - Server .................... SKIPPED
> [INFO] Apache HBase - Archetypes ......................... SKIPPED
> [INFO] Apache HBase - Exemplar for hbase-client archetype  SKIPPED
> [INFO] Apache HBase - Exemplar for hbase-shaded-client archetype  SKIPPED
> [INFO] Apache HBase - Archetype builder .................. SKIPPED
> [INFO]
> ------------------------------------------------------------------------
> [INFO] BUILD FAILURE
> [INFO]
> ------------------------------------------------------------------------
> [INFO] Total time: 01:45 h
> [INFO] Finished at: 2016-05-29T19:23:57+00:00
> [INFO] Final Memory: 70M/3121M
> [INFO]
> ------------------------------------------------------------------------
> [ERROR] Failed to execute goal
> org.apache.maven.plugins:maven-surefire-plugin:2.18.1:test
> (secondPartTestsExecution) on project hbase-server: There are test failures.
> [ERROR]
> [ERROR] Please refer to <
> https://builds.apache.org/job/HBase-Trunk_matrix/jdk=latest1.8,label=yahoo-not-h2/ws/hbase-server/target/surefire-reports>
> for the individual test results.
> [ERROR] -> [Help 1]
> [ERROR]
> [ERROR] To see the full stack trace of the errors, re-run Maven with the
> -e switch.
> [ERROR] Re-run Maven using the -X switch to enable full debug logging.
> [ERROR]
> [ERROR] For more information about the errors and possible solutions,
> please read the following articles:
> [ERROR] [Help 1]
> http://cwiki.apache.org/confluence/display/MAVEN/MojoFailureException
> [ERROR]
> [ERROR] After correcting the problems, you can resume the build with the
> command
> [ERROR]   mvn <goals> -rf :hbase-server
> Build step 'Invoke top-level Maven targets' marked build as failure
> Performing Post build task...
> Match found for :.* : True
> Logical operation result is TRUE
> Running script  : # Run zombie detector script
> ./dev-support/zombie-detector.sh --jenkins ${BUILD_ID}
> [yahoo-not-h2] $ /bin/bash -xe /tmp/hudson2868282627423708108.sh
> + ./dev-support/zombie-detector.sh --jenkins 958
> Sun May 29 19:23:57 UTC 2016 We're ok: there is no zombie test
>
>
>     {color:green}+1 zombies{color}. No zombie tests found running at the
> end of the build.
> POST BUILD TASK : SUCCESS
> END OF POST BUILD TASK : 0
> Archiving artifacts
> Recording test results
> [FINDBUGS] Skipping publisher since build result is FAILURE
> [CHECKSTYLE] Skipping publisher since build result is FAILURE
>

Mime
  • Unnamed multipart/alternative (inline, None, 0 bytes)
View raw message