hbase-builds mailing list archives

Site index · List index
Message view « Date » · « Thread »
Top « Date » · « Thread »
From Apache Jenkins Server <jenk...@builds.apache.org>
Subject Build failed in Jenkins: HBase-Trunk_matrix » latest1.7,yahoo-not-h2 #914
Date Wed, 11 May 2016 20:12:33 GMT
See <https://builds.apache.org/job/HBase-Trunk_matrix/jdk=latest1.7,label=yahoo-not-h2/914/changes>

Changes:

[tedyu] HBASE-15812 HttpServer fails to come up against hadoop trunk

[tedyu] HBASE-15812 Revert pending investigation on whether metrics dump can be

------------------------------------------
[...truncated 6230 lines...]
Running org.apache.hadoop.hbase.security.access.TestAccessController
Tests run: 26, Failures: 0, Errors: 0, Skipped: 0, Time elapsed: 62.705 sec - in org.apache.hadoop.hbase.security.visibility.TestVisibilityLabelsWithDefaultVisLabelService
Tests run: 21, Failures: 0, Errors: 0, Skipped: 0, Time elapsed: 55.203 sec - in org.apache.hadoop.hbase.security.visibility.TestVisibilityLabelsWithCustomVisLabService
Tests run: 44, Failures: 0, Errors: 0, Skipped: 0, Time elapsed: 175.154 sec - in org.apache.hadoop.hbase.security.visibility.TestVisibilityLabelsWithDeletes
Running org.apache.hadoop.hbase.security.access.TestTablePermissions
Running org.apache.hadoop.hbase.security.access.TestAccessControlFilter
Tests run: 1, Failures: 0, Errors: 0, Skipped: 0, Time elapsed: 4.949 sec - in org.apache.hadoop.hbase.security.access.TestAccessControlFilter
Running org.apache.hadoop.hbase.security.access.TestCellACLs
Tests run: 6, Failures: 0, Errors: 0, Skipped: 0, Time elapsed: 86.023 sec - in org.apache.hadoop.hbase.security.access.TestAccessController2
Tests run: 7, Failures: 0, Errors: 0, Skipped: 0, Time elapsed: 28.82 sec - in org.apache.hadoop.hbase.security.access.TestTablePermissions
Tests run: 2, Failures: 0, Errors: 0, Skipped: 0, Time elapsed: 22.546 sec - in org.apache.hadoop.hbase.security.access.TestCellACLs
Running org.apache.hadoop.hbase.security.access.TestNamespaceCommands
Running org.apache.hadoop.hbase.security.access.TestWithDisabledAuthorization
Running org.apache.hadoop.hbase.security.access.TestZKPermissionsWatcher
Running org.apache.hadoop.hbase.security.access.TestScanEarlyTermination
Tests run: 7, Failures: 0, Errors: 0, Skipped: 0, Time elapsed: 15.411 sec - in org.apache.hadoop.hbase.security.access.TestNamespaceCommands
Tests run: 1, Failures: 0, Errors: 0, Skipped: 0, Time elapsed: 3.952 sec - in org.apache.hadoop.hbase.security.access.TestZKPermissionsWatcher
Tests run: 1, Failures: 0, Errors: 0, Skipped: 0, Time elapsed: 9.14 sec - in org.apache.hadoop.hbase.security.access.TestScanEarlyTermination
Running org.apache.hadoop.hbase.security.token.TestZKSecretWatcher
Running org.apache.hadoop.hbase.security.access.TestCellACLWithMultipleVersions
Running org.apache.hadoop.hbase.security.access.TestAccessController3
Tests run: 1, Failures: 0, Errors: 0, Skipped: 0, Time elapsed: 13.824 sec - in org.apache.hadoop.hbase.security.token.TestZKSecretWatcher
Tests run: 64, Failures: 0, Errors: 0, Skipped: 0, Time elapsed: 125.027 sec - in org.apache.hadoop.hbase.security.access.TestAccessController
Tests run: 1, Failures: 0, Errors: 0, Skipped: 0, Time elapsed: 7.847 sec - in org.apache.hadoop.hbase.security.access.TestAccessController3
Running org.apache.hadoop.hbase.TestMetaTableAccessorNoCluster
Running org.apache.hadoop.hbase.security.token.TestTokenAuthentication
Tests run: 3, Failures: 0, Errors: 0, Skipped: 0, Time elapsed: 0.856 sec - in org.apache.hadoop.hbase.security.token.TestTokenAuthentication
Tests run: 2, Failures: 0, Errors: 0, Skipped: 0, Time elapsed: 4.487 sec - in org.apache.hadoop.hbase.TestMetaTableAccessorNoCluster
Running org.apache.hadoop.hbase.TestMetaTableLocator
Tests run: 7, Failures: 0, Errors: 0, Skipped: 0, Time elapsed: 5.229 sec - in org.apache.hadoop.hbase.TestMetaTableLocator
Running org.apache.hadoop.hbase.TestZooKeeper
Running org.apache.hadoop.hbase.TestHBaseTestingUtility
Tests run: 6, Failures: 0, Errors: 0, Skipped: 0, Time elapsed: 63.793 sec - in org.apache.hadoop.hbase.security.access.TestWithDisabledAuthorization
Running org.apache.hadoop.hbase.snapshot.TestSnapshotDescriptionUtils
Tests run: 2, Failures: 0, Errors: 0, Skipped: 0, Time elapsed: 0.144 sec - in org.apache.hadoop.hbase.snapshot.TestSnapshotDescriptionUtils
Running org.apache.hadoop.hbase.security.token.TestGenerateDelegationToken
Tests run: 1, Failures: 0, Errors: 0, Skipped: 0, Time elapsed: 9.508 sec - in org.apache.hadoop.hbase.security.token.TestGenerateDelegationToken
Running org.apache.hadoop.hbase.snapshot.TestMobSecureExportSnapshot
Tests run: 8, Failures: 0, Errors: 0, Skipped: 0, Time elapsed: 79.502 sec - in org.apache.hadoop.hbase.security.access.TestCellACLWithMultipleVersions
Running org.apache.hadoop.hbase.snapshot.TestSecureExportSnapshot
Running org.apache.hadoop.hbase.snapshot.TestMobExportSnapshot
Tests run: 12, Failures: 0, Errors: 0, Skipped: 0, Time elapsed: 96.903 sec - in org.apache.hadoop.hbase.TestHBaseTestingUtility
Running org.apache.hadoop.hbase.snapshot.TestMobRestoreFlushSnapshotFromClient
Tests run: 10, Failures: 0, Errors: 0, Skipped: 0, Time elapsed: 272.3 sec - in org.apache.hadoop.hbase.TestZooKeeper
Tests run: 5, Failures: 0, Errors: 0, Skipped: 0, Time elapsed: 166.411 sec - in org.apache.hadoop.hbase.snapshot.TestMobRestoreFlushSnapshotFromClient
Running org.apache.hadoop.hbase.snapshot.TestMobFlushSnapshotFromClient
Running org.apache.hadoop.hbase.snapshot.TestFlushSnapshotFromClient
Tests run: 9, Failures: 0, Errors: 0, Skipped: 0, Time elapsed: 160.543 sec - in org.apache.hadoop.hbase.snapshot.TestMobFlushSnapshotFromClient
Tests run: 9, Failures: 0, Errors: 0, Skipped: 0, Time elapsed: 157.766 sec - in org.apache.hadoop.hbase.snapshot.TestFlushSnapshotFromClient
Running org.apache.hadoop.hbase.snapshot.TestSnapshotClientRetries
Running org.apache.hadoop.hbase.snapshot.TestExportSnapshot
Tests run: 9, Failures: 0, Errors: 0, Skipped: 0, Time elapsed: 453.289 sec - in org.apache.hadoop.hbase.snapshot.TestMobSecureExportSnapshot
Tests run: 2, Failures: 0, Errors: 0, Skipped: 0, Time elapsed: 36.792 sec - in org.apache.hadoop.hbase.snapshot.TestSnapshotClientRetries
Tests run: 9, Failures: 0, Errors: 0, Skipped: 0, Time elapsed: 441.216 sec - in org.apache.hadoop.hbase.snapshot.TestSecureExportSnapshot
Running org.apache.hadoop.hbase.snapshot.TestRestoreFlushSnapshotFromClient
Running org.apache.hadoop.hbase.TestInfoServers
Tests run: 3, Failures: 0, Errors: 0, Skipped: 0, Time elapsed: 5.067 sec - in org.apache.hadoop.hbase.TestInfoServers
Running org.apache.hadoop.hbase.quotas.TestQuotaAdmin
Tests run: 9, Failures: 0, Errors: 0, Skipped: 0, Time elapsed: 444.971 sec - in org.apache.hadoop.hbase.snapshot.TestMobExportSnapshot
Tests run: 3, Failures: 0, Errors: 0, Skipped: 0, Time elapsed: 6.38 sec - in org.apache.hadoop.hbase.quotas.TestQuotaAdmin
Running org.apache.hadoop.hbase.procedure.TestZKProcedureControllers
Tests run: 4, Failures: 0, Errors: 0, Skipped: 0, Time elapsed: 7.361 sec - in org.apache.hadoop.hbase.procedure.TestZKProcedureControllers
Running org.apache.hadoop.hbase.io.asyncfs.TestFanOutOneBlockAsyncDFSOutput
Running org.apache.hadoop.hbase.quotas.TestQuotaTableUtil
Tests run: 3, Failures: 0, Errors: 0, Skipped: 0, Time elapsed: 2.943 sec - in org.apache.hadoop.hbase.quotas.TestQuotaTableUtil
Running org.apache.hadoop.hbase.io.hfile.TestScannerFromBucketCache
Running org.apache.hadoop.hbase.io.asyncfs.TestSaslFanOutOneBlockAsyncDFSOutput
Tests run: 4, Failures: 0, Errors: 0, Skipped: 0, Time elapsed: 7.617 sec - in org.apache.hadoop.hbase.io.hfile.TestScannerFromBucketCache
Running org.apache.hadoop.hbase.io.hfile.TestCacheOnWrite
Tests run: 5, Failures: 0, Errors: 0, Skipped: 0, Time elapsed: 38.389 sec - in org.apache.hadoop.hbase.io.asyncfs.TestFanOutOneBlockAsyncDFSOutput
Running org.apache.hadoop.hbase.io.hfile.TestForceCacheImportantBlocks
Tests run: 5, Failures: 0, Errors: 0, Skipped: 0, Time elapsed: 111.569 sec - in org.apache.hadoop.hbase.snapshot.TestRestoreFlushSnapshotFromClient
Running org.apache.hadoop.hbase.io.hfile.TestHFileBlock
Tests run: 2, Failures: 0, Errors: 0, Skipped: 0, Time elapsed: 40.026 sec - in org.apache.hadoop.hbase.io.hfile.TestForceCacheImportantBlocks
Running org.apache.hadoop.hbase.io.hfile.TestHFileBlockIndex
Tests run: 10, Failures: 0, Errors: 0, Skipped: 0, Time elapsed: 11.351 sec - in org.apache.hadoop.hbase.io.hfile.TestHFileBlockIndex
Running org.apache.hadoop.hbase.io.hfile.TestSeekBeforeWithInlineBlocks
Tests run: 1, Failures: 0, Errors: 0, Skipped: 0, Time elapsed: 22.865 sec - in org.apache.hadoop.hbase.io.hfile.TestSeekBeforeWithInlineBlocks
Running org.apache.hadoop.hbase.io.hfile.TestHFileSeek
Tests run: 1, Failures: 0, Errors: 0, Skipped: 0, Time elapsed: 3.853 sec - in org.apache.hadoop.hbase.io.hfile.TestHFileSeek
Running org.apache.hadoop.hbase.io.hfile.TestScannerSelectionUsingTTL
Tests run: 36, Failures: 0, Errors: 0, Skipped: 0, Time elapsed: 167.736 sec - in org.apache.hadoop.hbase.io.asyncfs.TestSaslFanOutOneBlockAsyncDFSOutput
Tests run: 28, Failures: 0, Errors: 0, Skipped: 0, Time elapsed: 105.565 sec - in org.apache.hadoop.hbase.io.hfile.TestHFileBlock
Running org.apache.hadoop.hbase.io.hfile.TestCacheConfig
Tests run: 7, Failures: 0, Errors: 0, Skipped: 0, Time elapsed: 2.746 sec - in org.apache.hadoop.hbase.io.hfile.TestCacheConfig
Running org.apache.hadoop.hbase.io.encoding.TestDataBlockEncoders
Running org.apache.hadoop.hbase.io.encoding.TestEncodedSeekers
Tests run: 6, Failures: 0, Errors: 0, Skipped: 0, Time elapsed: 66.606 sec - in org.apache.hadoop.hbase.io.hfile.TestScannerSelectionUsingTTL
Running org.apache.hadoop.hbase.io.encoding.TestBufferedDataBlockEncoder
Tests run: 2, Failures: 0, Errors: 0, Skipped: 0, Time elapsed: 16.867 sec - in org.apache.hadoop.hbase.io.encoding.TestBufferedDataBlockEncoder
Running org.apache.hadoop.hbase.io.encoding.TestChangingEncoding
Tests run: 56, Failures: 0, Errors: 0, Skipped: 0, Time elapsed: 63.03 sec - in org.apache.hadoop.hbase.io.encoding.TestDataBlockEncoders
Running org.apache.hadoop.hbase.io.encoding.TestLoadAndSwitchEncodeOnDisk
Tests run: 1, Failures: 0, Errors: 0, Skipped: 0, Time elapsed: 45.082 sec - in org.apache.hadoop.hbase.io.encoding.TestLoadAndSwitchEncodeOnDisk
Running org.apache.hadoop.hbase.io.TestFileLink
Tests run: 72, Failures: 0, Errors: 0, Skipped: 0, Time elapsed: 292.638 sec - in org.apache.hadoop.hbase.io.hfile.TestCacheOnWrite
Running org.apache.hadoop.hbase.wal.TestWALFactory
Tests run: 20, Failures: 0, Errors: 0, Skipped: 0, Time elapsed: 138.323 sec - in org.apache.hadoop.hbase.io.encoding.TestEncodedSeekers
Tests run: 5, Failures: 0, Errors: 0, Skipped: 0, Time elapsed: 23.72 sec - in org.apache.hadoop.hbase.io.TestFileLink
Running org.apache.hadoop.hbase.wal.TestWALFiltering
Running org.apache.hadoop.hbase.wal.TestWALReaderOnSecureWAL
Tests run: 2, Failures: 0, Errors: 0, Skipped: 0, Time elapsed: 2.944 sec - in org.apache.hadoop.hbase.wal.TestWALReaderOnSecureWAL
Tests run: 9, Failures: 0, Errors: 0, Skipped: 0, Time elapsed: 15.167 sec - in org.apache.hadoop.hbase.wal.TestWALFactory
Running org.apache.hadoop.hbase.wal.TestDefaultWALProvider
Running org.apache.hadoop.hbase.wal.TestWALSplit
Tests run: 5, Failures: 0, Errors: 0, Skipped: 0, Time elapsed: 11.816 sec - in org.apache.hadoop.hbase.wal.TestDefaultWALProvider
Running org.apache.hadoop.hbase.wal.TestBoundedRegionGroupingStrategy
Tests run: 1, Failures: 0, Errors: 0, Skipped: 0, Time elapsed: 42.75 sec - in org.apache.hadoop.hbase.wal.TestWALFiltering
Running org.apache.hadoop.hbase.wal.TestSecureWAL
Tests run: 2, Failures: 0, Errors: 0, Skipped: 0, Time elapsed: 2.468 sec - in org.apache.hadoop.hbase.wal.TestSecureWAL
Tests run: 9, Failures: 0, Errors: 0, Skipped: 0, Time elapsed: 449.963 sec - in org.apache.hadoop.hbase.snapshot.TestExportSnapshot
Running org.apache.hadoop.hbase.wal.TestDefaultWALProviderWithHLogKey
Running org.apache.hadoop.hbase.wal.TestWALSplitCompressed
Tests run: 5, Failures: 0, Errors: 0, Skipped: 0, Time elapsed: 23.131 sec - in org.apache.hadoop.hbase.wal.TestDefaultWALProviderWithHLogKey
Running org.apache.hadoop.hbase.zookeeper.TestZooKeeperACL
Tests run: 7, Failures: 0, Errors: 0, Skipped: 0, Time elapsed: 0.481 sec - in org.apache.hadoop.hbase.zookeeper.TestZooKeeperACL
Running org.apache.hadoop.hbase.zookeeper.TestZKLeaderManager
Tests run: 1, Failures: 0, Errors: 0, Skipped: 0, Time elapsed: 0.375 sec - in org.apache.hadoop.hbase.zookeeper.TestZKLeaderManager
Tests run: 10, Failures: 0, Errors: 0, Skipped: 0, Time elapsed: 80.714 sec - in org.apache.hadoop.hbase.wal.TestBoundedRegionGroupingStrategy
Running org.apache.hadoop.hbase.zookeeper.TestZooKeeperNodeTracker
Running org.apache.hadoop.hbase.zookeeper.TestRecoverableZooKeeper
Tests run: 3, Failures: 0, Errors: 0, Skipped: 0, Time elapsed: 1.544 sec - in org.apache.hadoop.hbase.zookeeper.TestZooKeeperNodeTracker
Tests run: 1, Failures: 0, Errors: 0, Skipped: 0, Time elapsed: 1.618 sec - in org.apache.hadoop.hbase.zookeeper.TestRecoverableZooKeeper
Running org.apache.hadoop.hbase.zookeeper.TestZKMulti
Running org.apache.hadoop.hbase.zookeeper.lock.TestZKInterProcessReadWriteLock
Tests run: 32, Failures: 0, Errors: 0, Skipped: 0, Time elapsed: 103.968 sec - in org.apache.hadoop.hbase.wal.TestWALSplit
Tests run: 12, Failures: 0, Errors: 0, Skipped: 0, Time elapsed: 3.66 sec - in org.apache.hadoop.hbase.zookeeper.TestZKMulti
Running org.apache.hadoop.hbase.zookeeper.TestHQuorumPeer
Tests run: 3, Failures: 0, Errors: 0, Skipped: 0, Time elapsed: 0.94 sec - in org.apache.hadoop.hbase.zookeeper.TestHQuorumPeer
Running org.apache.hadoop.hbase.TestIOFencing
Tests run: 3, Failures: 0, Errors: 0, Skipped: 0, Time elapsed: 232.881 sec - in org.apache.hadoop.hbase.io.encoding.TestChangingEncoding
Running org.apache.hadoop.hbase.constraint.TestConstraint
Running org.apache.hadoop.hbase.TestMovedRegionsCleaner
Tests run: 6, Failures: 0, Errors: 0, Skipped: 0, Time elapsed: 25.549 sec - in org.apache.hadoop.hbase.zookeeper.lock.TestZKInterProcessReadWriteLock
Tests run: 1, Failures: 0, Errors: 0, Skipped: 0, Time elapsed: 18.626 sec - in org.apache.hadoop.hbase.TestMovedRegionsCleaner
Tests run: 32, Failures: 0, Errors: 0, Skipped: 0, Time elapsed: 98.165 sec - in org.apache.hadoop.hbase.wal.TestWALSplitCompressed
Running org.apache.hadoop.hbase.backup.TestHFileArchiving
Running org.apache.hadoop.hbase.backup.example.TestZooKeeperTableArchiveClient
Tests run: 3, Failures: 0, Errors: 0, Skipped: 0, Time elapsed: 5.683 sec - in org.apache.hadoop.hbase.backup.example.TestZooKeeperTableArchiveClient
Running org.apache.hadoop.hbase.ipc.TestProtoBufRpc
Tests run: 1, Failures: 0, Errors: 0, Skipped: 0, Time elapsed: 3.892 sec - in org.apache.hadoop.hbase.ipc.TestProtoBufRpc
Running org.apache.hadoop.hbase.TestHColumnDescriptorDefaultVersions
Tests run: 5, Failures: 0, Errors: 0, Skipped: 0, Time elapsed: 43.053 sec - in org.apache.hadoop.hbase.constraint.TestConstraint
Running org.apache.hadoop.hbase.ipc.TestHBaseClient
Tests run: 1, Failures: 0, Errors: 0, Skipped: 0, Time elapsed: 0.755 sec - in org.apache.hadoop.hbase.ipc.TestHBaseClient
Running org.apache.hadoop.hbase.ipc.TestRpcClientLeaks
Running org.apache.hadoop.hbase.TestNamespace
Tests run: 1, Failures: 0, Errors: 0, Skipped: 0, Time elapsed: 29.076 sec - in org.apache.hadoop.hbase.ipc.TestRpcClientLeaks
Tests run: 4, Failures: 0, Errors: 0, Skipped: 0, Time elapsed: 44.574 sec - in org.apache.hadoop.hbase.TestHColumnDescriptorDefaultVersions
Tests run: 2, Failures: 0, Errors: 0, Skipped: 0, Time elapsed: 129.741 sec - in org.apache.hadoop.hbase.TestIOFencing
Tests run: 5, Failures: 0, Errors: 0, Skipped: 0, Time elapsed: 92.208 sec - in org.apache.hadoop.hbase.backup.TestHFileArchiving
Tests run: 8, Failures: 0, Errors: 0, Skipped: 0, Time elapsed: 72.51 sec - in org.apache.hadoop.hbase.TestNamespace

Results :

Failed tests: 
  TestReplicaWithCluster.testReplicaAndReplication:267 Waiting timed out after [1,000] msec
Tests in error: 
  TestAdmin1.tearDown:108 » RetriesExhausted Failed after attempts=7, exceptions...
org.apache.hadoop.hbase.client.TestAdmin1.testGetTableDescriptor(org.apache.hadoop.hbase.client.TestAdmin1)
  Run 1: TestAdmin1.testGetTableDescriptor:424 » RetriesExhausted Failed after attempts...
  Run 2: TestAdmin1.tearDown:108 » RetriesExhausted Failed after attempts=7, exceptions...

org.apache.hadoop.hbase.client.TestAdmin1.testHFileReplication(org.apache.hadoop.hbase.client.TestAdmin1)
  Run 1: TestAdmin1.testHFileReplication:1358 » RetriesExhausted Failed after attempts=...
  Run 2: TestAdmin1.tearDown:108 » RetriesExhausted Failed after attempts=7, exceptions...

  TestAdmin1.tearDown:108 » RetriesExhausted Failed after attempts=7, exceptions...
org.apache.hadoop.hbase.client.TestAdmin1.testMergeRegions(org.apache.hadoop.hbase.client.TestAdmin1)
  Run 1: TestAdmin1.testMergeRegions:1432 » RetriesExhausted Failed after attempts=7, e...
  Run 2: TestAdmin1.tearDown:108 » RetriesExhausted Failed after attempts=7, exceptions...

org.apache.hadoop.hbase.client.TestAdmin1.testTableExist(org.apache.hadoop.hbase.client.TestAdmin1)
  Run 1: TestAdmin1.testTableExist:934->Object.wait:-2 » TestTimedOut test timed out af...
  Run 2: TestAdmin1.tearDown:108 » RetriesExhausted Failed after attempts=7, exceptions...


Tests run: 2716, Failures: 1, Errors: 6, Skipped: 63

[INFO] ------------------------------------------------------------------------
[INFO] Reactor Summary:
[INFO] 
[INFO] Apache HBase ...................................... SUCCESS [  3.387 s]
[INFO] Apache HBase - Checkstyle ......................... SUCCESS [  0.818 s]
[INFO] Apache HBase - Resource Bundle .................... SUCCESS [  0.414 s]
[INFO] Apache HBase - Annotations ........................ SUCCESS [  0.244 s]
[INFO] Apache HBase - Protocol ........................... SUCCESS [  3.611 s]
[INFO] Apache HBase - Common ............................. SUCCESS [01:32 min]
[INFO] Apache HBase - Procedure .......................... SUCCESS [02:36 min]
[INFO] Apache HBase - Client ............................. SUCCESS [ 46.831 s]
[INFO] Apache HBase - Hadoop Compatibility ............... SUCCESS [  8.203 s]
[INFO] Apache HBase - Hadoop Two Compatibility ........... SUCCESS [ 11.871 s]
[INFO] Apache HBase - Prefix Tree ........................ SUCCESS [ 12.624 s]
[INFO] Apache HBase - Server ............................. FAILURE [  02:06 h]
[INFO] Apache HBase - Testing Util ....................... SKIPPED
[INFO] Apache HBase - Thrift ............................. SKIPPED
[INFO] Apache HBase - RSGroup ............................ SKIPPED
[INFO] Apache HBase - Shell .............................. SKIPPED
[INFO] Apache HBase - Integration Tests .................. SKIPPED
[INFO] Apache HBase - Examples ........................... SKIPPED
[INFO] Apache HBase - Rest ............................... SKIPPED
[INFO] Apache HBase - External Block Cache ............... SKIPPED
[INFO] Apache HBase - Spark .............................. SKIPPED
[INFO] Apache HBase - Assembly ........................... SKIPPED
[INFO] Apache HBase - Shaded ............................. SKIPPED
[INFO] Apache HBase - Shaded - Client .................... SKIPPED
[INFO] Apache HBase - Shaded - Server .................... SKIPPED
[INFO] Apache HBase - Archetypes ......................... SKIPPED
[INFO] Apache HBase - Exemplar for hbase-client archetype  SKIPPED
[INFO] Apache HBase - Exemplar for hbase-shaded-client archetype  SKIPPED
[INFO] Apache HBase - Archetype builder .................. SKIPPED
[INFO] ------------------------------------------------------------------------
[INFO] BUILD FAILURE
[INFO] ------------------------------------------------------------------------
[INFO] Total time: 02:12 h
[INFO] Finished at: 2016-05-11T20:09:18+00:00
[INFO] Final Memory: 69M/725M
[INFO] ------------------------------------------------------------------------
[ERROR] Failed to execute goal org.apache.maven.plugins:maven-surefire-plugin:2.18.1:test
(secondPartTestsExecution) on project hbase-server: There are test failures.
[ERROR] 
[ERROR] Please refer to <https://builds.apache.org/job/HBase-Trunk_matrix/jdk=latest1.7,label=yahoo-not-h2/ws/hbase-server/target/surefire-reports>
for the individual test results.
[ERROR] -> [Help 1]
[ERROR] 
[ERROR] To see the full stack trace of the errors, re-run Maven with the -e switch.
[ERROR] Re-run Maven using the -X switch to enable full debug logging.
[ERROR] 
[ERROR] For more information about the errors and possible solutions, please read the following
articles:
[ERROR] [Help 1] http://cwiki.apache.org/confluence/display/MAVEN/MojoFailureException
[ERROR] 
[ERROR] After correcting the problems, you can resume the build with the command
[ERROR]   mvn <goals> -rf :hbase-server
Build step 'Invoke top-level Maven targets' marked build as failure
Performing Post build task...
Match found for :.* : True
Logical operation result is TRUE
Running script  : # Run zombie detector script
./dev-support/zombie-detector.sh --jenkins ${BUILD_ID}
[yahoo-not-h2] $ /bin/bash -xe /tmp/hudson2113333205135188404.sh
+ ./dev-support/zombie-detector.sh --jenkins 914
Wed May 11 20:09:19 UTC 2016 We're ok: there is no zombie test


    {color:green}+1 zombies{color}. No zombie tests found running at the end of the build.
POST BUILD TASK : SUCCESS
END OF POST BUILD TASK : 0
Archiving artifacts
Recording test results
[FINDBUGS] Skipping publisher since build result is FAILURE
[CHECKSTYLE] Skipping publisher since build result is FAILURE

Mime
View raw message