hbase-builds mailing list archives

Site index · List index
Message view « Date » · « Thread »
Top « Date » · « Thread »
From Apache Jenkins Server <jenk...@builds.apache.org>
Subject Build failed in Jenkins: HBase-0.98-matrix » latest1.7,yahoo-not-h2 #340
Date Thu, 05 May 2016 13:09:39 GMT
See <https://builds.apache.org/job/HBase-0.98-matrix/jdk=latest1.7,label=yahoo-not-h2/340/changes>

Changes:

[apurtell] Update version to 0.98.20-SNAPSHOT

[apurtell] HBASE-15710 Include issue servers information in

[apurtell] HBASE-15634 TestDateTieredCompactionPolicy#negativeForMajor is flaky

[apurtell] HBASE-15707 ImportTSV bulk output does not support tags with

[apurtell] HBASE-15686 Add override mechanism for the exempt classes when

[apurtell] HBASE-15357 TableInputFormatBase getSplitKey does not handle signed

[apurtell] HBASE-15752 ClassNotFoundException is encountered when custom WAL codec

------------------------------------------
[...truncated 37096 lines...]
Running org.apache.hadoop.hbase.mapreduce.TestSerialization
Tests run: 2, Failures: 0, Errors: 0, Skipped: 0, Time elapsed: 2.54 sec - in org.apache.hadoop.hbase.mapreduce.TestSerialization
Running org.apache.hadoop.hbase.mapreduce.TestSimpleTotalOrderPartitioner
Tests run: 1, Failures: 0, Errors: 0, Skipped: 0, Time elapsed: 0.158 sec - in org.apache.hadoop.hbase.mapreduce.TestSimpleTotalOrderPartitioner
Running org.apache.hadoop.hbase.mapreduce.hadoopbackport.TestJarFinder
Tests run: 4, Failures: 0, Errors: 0, Skipped: 0, Time elapsed: 1.841 sec - in org.apache.hadoop.hbase.mapreduce.hadoopbackport.TestJarFinder
Running org.apache.hadoop.hbase.monitoring.TestMemoryBoundedLogMessageBuffer
Tests run: 2, Failures: 0, Errors: 0, Skipped: 0, Time elapsed: 0.487 sec - in org.apache.hadoop.hbase.monitoring.TestMemoryBoundedLogMessageBuffer
Running org.apache.hadoop.hbase.monitoring.TestTaskMonitor
Tests run: 3, Failures: 0, Errors: 0, Skipped: 0, Time elapsed: 0.903 sec - in org.apache.hadoop.hbase.monitoring.TestTaskMonitor
Running org.apache.hadoop.hbase.snapshot.TestSnapshotManifest
Tests run: 1, Failures: 0, Errors: 0, Skipped: 0, Time elapsed: 9.447 sec - in org.apache.hadoop.hbase.snapshot.TestSnapshotManifest
Running org.apache.hadoop.hbase.snapshot.TestRestoreSnapshotHelper
Tests run: 2, Failures: 0, Errors: 0, Skipped: 0, Time elapsed: 3.022 sec - in org.apache.hadoop.hbase.snapshot.TestRestoreSnapshotHelper
Running org.apache.hadoop.hbase.executor.TestExecutorService
Tests run: 2, Failures: 0, Errors: 0, Skipped: 0, Time elapsed: 2.829 sec - in org.apache.hadoop.hbase.executor.TestExecutorService
Running org.apache.hadoop.hbase.TestHColumnDescriptor
Tests run: 3, Failures: 0, Errors: 0, Skipped: 0, Time elapsed: 1.405 sec - in org.apache.hadoop.hbase.TestHColumnDescriptor
Running org.apache.hadoop.hbase.security.TestUsersOperationsWithSecureHadoop
Tests run: 1, Failures: 0, Errors: 0, Skipped: 1, Time elapsed: 1.071 sec - in org.apache.hadoop.hbase.security.TestUsersOperationsWithSecureHadoop
Running org.apache.hadoop.hbase.security.TestHBaseSaslRpcClient
Tests run: 5, Failures: 0, Errors: 0, Skipped: 0, Time elapsed: 1.029 sec - in org.apache.hadoop.hbase.security.TestHBaseSaslRpcClient
Running org.apache.hadoop.hbase.security.access.TestHbaseObjectWritableFor96Migration
Tests run: 4, Failures: 0, Errors: 0, Skipped: 0, Time elapsed: 1.033 sec - in org.apache.hadoop.hbase.security.access.TestHbaseObjectWritableFor96Migration
Running org.apache.hadoop.hbase.security.token.TestZKSecretWatcherRefreshKeys
Tests run: 1, Failures: 0, Errors: 0, Skipped: 0, Time elapsed: 0.602 sec - in org.apache.hadoop.hbase.security.token.TestZKSecretWatcherRefreshKeys
Running org.apache.hadoop.hbase.security.TestUser
Tests run: 8, Failures: 0, Errors: 0, Skipped: 0, Time elapsed: 1.792 sec - in org.apache.hadoop.hbase.security.TestUser
Running org.apache.hadoop.hbase.security.TestSecureRPC
Tests run: 2, Failures: 0, Errors: 0, Skipped: 2, Time elapsed: 0.44 sec - in org.apache.hadoop.hbase.security.TestSecureRPC
Running org.apache.hadoop.hbase.security.visibility.TestExpressionParser
Tests run: 4, Failures: 0, Errors: 0, Skipped: 0, Time elapsed: 0.541 sec - in org.apache.hadoop.hbase.security.visibility.TestExpressionParser
Running org.apache.hadoop.hbase.security.visibility.TestExpressionExpander
Tests run: 1, Failures: 0, Errors: 0, Skipped: 0, Time elapsed: 0.413 sec - in org.apache.hadoop.hbase.security.visibility.TestExpressionExpander
Running org.apache.hadoop.hbase.TestNodeHealthCheckChore
Tests run: 4, Failures: 0, Errors: 0, Skipped: 0, Time elapsed: 11.152 sec - in org.apache.hadoop.hbase.TestNodeHealthCheckChore
Running org.apache.hadoop.hbase.codec.TestCellMessageCodec
Tests run: 3, Failures: 0, Errors: 0, Skipped: 0, Time elapsed: 0.473 sec - in org.apache.hadoop.hbase.codec.TestCellMessageCodec
Running org.apache.hadoop.hbase.master.TestHMasterCommandLine
Tests run: 1, Failures: 0, Errors: 0, Skipped: 0, Time elapsed: 0.34 sec - in org.apache.hadoop.hbase.master.TestHMasterCommandLine
Running org.apache.hadoop.hbase.master.TestClockSkewDetection
Tests run: 1, Failures: 0, Errors: 0, Skipped: 0, Time elapsed: 0.549 sec - in org.apache.hadoop.hbase.master.TestClockSkewDetection
Running org.apache.hadoop.hbase.master.snapshot.TestSnapshotManager
Tests run: 2, Failures: 0, Errors: 0, Skipped: 0, Time elapsed: 0.548 sec - in org.apache.hadoop.hbase.master.snapshot.TestSnapshotManager
Running org.apache.hadoop.hbase.master.snapshot.TestSnapshotHFileCleaner
Tests run: 3, Failures: 0, Errors: 0, Skipped: 0, Time elapsed: 1.007 sec - in org.apache.hadoop.hbase.master.snapshot.TestSnapshotHFileCleaner
Running org.apache.hadoop.hbase.master.snapshot.TestSnapshotLogCleaner
Tests run: 1, Failures: 0, Errors: 0, Skipped: 0, Time elapsed: 0.841 sec - in org.apache.hadoop.hbase.master.snapshot.TestSnapshotLogCleaner
Running org.apache.hadoop.hbase.master.cleaner.TestHFileLinkCleaner
Tests run: 1, Failures: 0, Errors: 0, Skipped: 0, Time elapsed: 11.106 sec - in org.apache.hadoop.hbase.master.cleaner.TestHFileLinkCleaner
Running org.apache.hadoop.hbase.master.cleaner.TestCleanerChore
Tests run: 6, Failures: 0, Errors: 0, Skipped: 0, Time elapsed: 1.434 sec - in org.apache.hadoop.hbase.master.cleaner.TestCleanerChore
Running org.apache.hadoop.hbase.master.TestRegionState
Tests run: 1, Failures: 0, Errors: 0, Skipped: 0, Time elapsed: 1.259 sec - in org.apache.hadoop.hbase.master.TestRegionState
Running org.apache.hadoop.hbase.master.TestCatalogJanitor
Tests run: 7, Failures: 0, Errors: 0, Skipped: 0, Time elapsed: 12.855 sec - in org.apache.hadoop.hbase.master.TestCatalogJanitor
Running org.apache.hadoop.hbase.master.balancer.TestFavoredNodeAssignmentHelper
Tests run: 8, Failures: 0, Errors: 0, Skipped: 8, Time elapsed: 0.003 sec - in org.apache.hadoop.hbase.master.balancer.TestFavoredNodeAssignmentHelper
Running org.apache.hadoop.hbase.mapred.TestGroupingTableMap
Tests run: 4, Failures: 0, Errors: 0, Skipped: 0, Time elapsed: 1.19 sec - in org.apache.hadoop.hbase.mapred.TestGroupingTableMap
Running org.apache.hadoop.hbase.mapred.TestIdentityTableMap
Tests run: 1, Failures: 0, Errors: 0, Skipped: 0, Time elapsed: 0.754 sec - in org.apache.hadoop.hbase.mapred.TestIdentityTableMap
Running org.apache.hadoop.hbase.mapred.TestRowCounter
Tests run: 4, Failures: 0, Errors: 0, Skipped: 0, Time elapsed: 4.142 sec - in org.apache.hadoop.hbase.mapred.TestRowCounter
Running org.apache.hadoop.hbase.mapred.TestSplitTable
Tests run: 3, Failures: 0, Errors: 0, Skipped: 0, Time elapsed: 0.521 sec - in org.apache.hadoop.hbase.mapred.TestSplitTable
Running org.apache.hadoop.hbase.mapred.TestDriver
Tests run: 1, Failures: 0, Errors: 0, Skipped: 0, Time elapsed: 0.627 sec - in org.apache.hadoop.hbase.mapred.TestDriver
Running org.apache.hadoop.hbase.errorhandling.TestTimeoutExceptionInjector
Tests run: 4, Failures: 0, Errors: 0, Skipped: 0, Time elapsed: 0.698 sec - in org.apache.hadoop.hbase.errorhandling.TestTimeoutExceptionInjector
Running org.apache.hadoop.hbase.errorhandling.TestForeignExceptionDispatcher
Tests run: 3, Failures: 0, Errors: 0, Skipped: 0, Time elapsed: 0.625 sec - in org.apache.hadoop.hbase.errorhandling.TestForeignExceptionDispatcher
Running org.apache.hadoop.hbase.errorhandling.TestForeignExceptionSerialization
Tests run: 2, Failures: 0, Errors: 0, Skipped: 0, Time elapsed: 0.493 sec - in org.apache.hadoop.hbase.errorhandling.TestForeignExceptionSerialization
Running org.apache.hadoop.hbase.TestServerLoad
Tests run: 3, Failures: 0, Errors: 0, Skipped: 0, Time elapsed: 0.557 sec - in org.apache.hadoop.hbase.TestServerLoad
Running org.apache.hadoop.hbase.TestHDFSBlocksDistribution
Tests run: 2, Failures: 0, Errors: 0, Skipped: 0, Time elapsed: 0.457 sec - in org.apache.hadoop.hbase.TestHDFSBlocksDistribution
Running org.apache.hadoop.hbase.TestIPv6NIOServerSocketChannel
Tests run: 2, Failures: 0, Errors: 0, Skipped: 0, Time elapsed: 0.713 sec - in org.apache.hadoop.hbase.TestIPv6NIOServerSocketChannel
Running org.apache.hadoop.hbase.TestCompare
Tests run: 1, Failures: 0, Errors: 0, Skipped: 0, Time elapsed: 0.763 sec - in org.apache.hadoop.hbase.TestCompare
Running org.apache.hadoop.hbase.TestSerialization
Tests run: 9, Failures: 0, Errors: 0, Skipped: 0, Time elapsed: 1.814 sec - in org.apache.hadoop.hbase.TestSerialization
Running org.apache.hadoop.hbase.util.TestHFileArchiveUtil
Tests run: 4, Failures: 0, Errors: 0, Skipped: 0, Time elapsed: 1.314 sec - in org.apache.hadoop.hbase.util.TestHFileArchiveUtil
Running org.apache.hadoop.hbase.util.TestSortedCopyOnWriteSet
Tests run: 2, Failures: 0, Errors: 0, Skipped: 0, Time elapsed: 0.477 sec - in org.apache.hadoop.hbase.util.TestSortedCopyOnWriteSet
Running org.apache.hadoop.hbase.util.TestConfigurationUtil
Tests run: 2, Failures: 0, Errors: 0, Skipped: 0, Time elapsed: 0.586 sec - in org.apache.hadoop.hbase.util.TestConfigurationUtil
Running org.apache.hadoop.hbase.util.TestByteBufferUtils
Tests run: 12, Failures: 0, Errors: 0, Skipped: 0, Time elapsed: 0.973 sec - in org.apache.hadoop.hbase.util.TestByteBufferUtils
Running org.apache.hadoop.hbase.util.TestRootPath
Tests run: 1, Failures: 0, Errors: 0, Skipped: 0, Time elapsed: 0.328 sec - in org.apache.hadoop.hbase.util.TestRootPath
Running org.apache.hadoop.hbase.util.TestPoolMap$TestRoundRobinPoolType
Tests run: 3, Failures: 0, Errors: 0, Skipped: 0, Time elapsed: 0.498 sec - in org.apache.hadoop.hbase.util.TestPoolMap$TestRoundRobinPoolType
Running org.apache.hadoop.hbase.util.TestIncrementingEnvironmentEdge
Tests run: 1, Failures: 0, Errors: 0, Skipped: 0, Time elapsed: 0.397 sec - in org.apache.hadoop.hbase.util.TestIncrementingEnvironmentEdge
Running org.apache.hadoop.hbase.util.TestSortedList
Tests run: 4, Failures: 0, Errors: 0, Skipped: 0, Time elapsed: 0.528 sec - in org.apache.hadoop.hbase.util.TestSortedList
Running org.apache.hadoop.hbase.util.TestBoundedConcurrentLinkedQueue
Tests run: 4, Failures: 0, Errors: 0, Skipped: 0, Time elapsed: 5.554 sec - in org.apache.hadoop.hbase.util.TestBoundedConcurrentLinkedQueue
Running org.apache.hadoop.hbase.util.TestPoolMap$TestRoundRobinPoolType
Tests run: 3, Failures: 0, Errors: 0, Skipped: 0, Time elapsed: 0.498 sec - in org.apache.hadoop.hbase.util.TestPoolMap$TestRoundRobinPoolType
Running org.apache.hadoop.hbase.util.TestPoolMap$TestThreadLocalPoolType
Tests run: 3, Failures: 0, Errors: 0, Skipped: 0, Time elapsed: 0.151 sec - in org.apache.hadoop.hbase.util.TestPoolMap$TestThreadLocalPoolType
Running org.apache.hadoop.hbase.util.TestPoolMap$TestReusablePoolType
Tests run: 3, Failures: 0, Errors: 0, Skipped: 0, Time elapsed: 0.129 sec - in org.apache.hadoop.hbase.util.TestPoolMap$TestReusablePoolType
Running org.apache.hadoop.hbase.util.TestPoolMap$TestReusablePoolType
Tests run: 3, Failures: 0, Errors: 0, Skipped: 0, Time elapsed: 0.516 sec - in org.apache.hadoop.hbase.util.TestPoolMap$TestReusablePoolType
Running org.apache.hadoop.hbase.util.TestRegionSizeCalculator
Tests run: 3, Failures: 0, Errors: 0, Skipped: 0, Time elapsed: 1.062 sec - in org.apache.hadoop.hbase.util.TestRegionSizeCalculator
Running org.apache.hadoop.hbase.util.TestByteBloomFilter
Tests run: 5, Failures: 0, Errors: 0, Skipped: 0, Time elapsed: 1.51 sec - in org.apache.hadoop.hbase.util.TestByteBloomFilter
Running org.apache.hadoop.hbase.util.TestHBaseFsckComparator
Tests run: 6, Failures: 0, Errors: 0, Skipped: 0, Time elapsed: 0.581 sec - in org.apache.hadoop.hbase.util.TestHBaseFsckComparator
Running org.apache.hadoop.hbase.util.TestPoolMap$TestThreadLocalPoolType
Tests run: 3, Failures: 0, Errors: 0, Skipped: 0, Time elapsed: 0.526 sec - in org.apache.hadoop.hbase.util.TestPoolMap$TestThreadLocalPoolType
Running org.apache.hadoop.hbase.util.TestRegionSplitCalculator
Tests run: 15, Failures: 0, Errors: 0, Skipped: 0, Time elapsed: 0.998 sec - in org.apache.hadoop.hbase.util.TestRegionSplitCalculator
Running org.apache.hadoop.hbase.util.TestEncryptionTest
Tests run: 3, Failures: 0, Errors: 0, Skipped: 0, Time elapsed: 1.611 sec - in org.apache.hadoop.hbase.util.TestEncryptionTest
Running org.apache.hadoop.hbase.util.TestCompressionTest
Tests run: 2, Failures: 0, Errors: 0, Skipped: 0, Time elapsed: 0.656 sec - in org.apache.hadoop.hbase.util.TestCompressionTest
Running org.apache.hadoop.hbase.TestServerName
Tests run: 7, Failures: 0, Errors: 0, Skipped: 0, Time elapsed: 0.715 sec - in org.apache.hadoop.hbase.TestServerName

Results :

Tests in error: 
  TestRpcMetrics.testSourceMethods:88 » NullPointer
  TestRpcMetrics.testWrapperSource:66 » NullPointer
  TestMetricsRegion.testRegionWrapperMetrics:38 » NullPointer
  TestMetricsRegionServer.testPauseMonitor:148 » NullPointer
  TestMetricsRegionServer.testSlowCount:127 » NullPointer
  TestMetricsRegionServer.testWrapperSource:58 » NullPointer

Tests run: 872, Failures: 0, Errors: 6, Skipped: 11

[INFO] ------------------------------------------------------------------------
[INFO] Reactor Summary:
[INFO] 
[INFO] Apache HBase ...................................... SUCCESS [1:47.434s]
[INFO] Apache HBase - Checkstyle ......................... SUCCESS [7.783s]
[INFO] Apache HBase - Resource Bundle .................... SUCCESS [0.245s]
[INFO] Apache HBase - Annotations ........................ SUCCESS [1.463s]
[INFO] Apache HBase - Common ............................. SUCCESS [2:44.604s]
[INFO] Apache HBase - Protocol ........................... SUCCESS [11.213s]
[INFO] Apache HBase - Client ............................. SUCCESS [1:14.681s]
[INFO] Apache HBase - Hadoop Compatibility ............... SUCCESS [7.783s]
[INFO] Apache HBase - Hadoop Two Compatibility ........... SUCCESS [16.824s]
[INFO] Apache HBase - Prefix Tree ........................ SUCCESS [11.862s]
[INFO] Apache HBase - Server ............................. FAILURE [13:49.512s]
[INFO] Apache HBase - Testing Util ....................... SKIPPED
[INFO] Apache HBase - Thrift ............................. SKIPPED
[INFO] Apache HBase - Rest ............................... SKIPPED
[INFO] Apache HBase - Shell .............................. SKIPPED
[INFO] Apache HBase - Integration Tests .................. SKIPPED
[INFO] Apache HBase - Examples ........................... SKIPPED
[INFO] Apache HBase - Assembly ........................... SKIPPED
[INFO] ------------------------------------------------------------------------
[INFO] BUILD FAILURE
[INFO] ------------------------------------------------------------------------
[INFO] Total time: 21:11.146s
[INFO] Finished at: Thu May 05 13:09:17 UTC 2016
[INFO] Final Memory: 82M/724M
[INFO] ------------------------------------------------------------------------
[ERROR] Failed to execute goal org.apache.maven.plugins:maven-surefire-plugin:2.18.1:test
(default-test) on project hbase-server: There are test failures.
[ERROR] 
[ERROR] Please refer to <https://builds.apache.org/job/HBase-0.98-matrix/jdk=latest1.7,label=yahoo-not-h2/ws/hbase-server/target/surefire-reports>
for the individual test results.
[ERROR] -> [Help 1]
[ERROR] 
[ERROR] To see the full stack trace of the errors, re-run Maven with the -e switch.
[ERROR] Re-run Maven using the -X switch to enable full debug logging.
[ERROR] 
[ERROR] For more information about the errors and possible solutions, please read the following
articles:
[ERROR] [Help 1] http://cwiki.apache.org/confluence/display/MAVEN/MojoFailureException
[ERROR] 
[ERROR] After correcting the problems, you can resume the build with the command
[ERROR]   mvn <goals> -rf :hbase-server
Build step 'Invoke top-level Maven targets' marked build as failure
Performing Post build task...
Match found for :.* : True
Logical operation result is TRUE
Running script  : # Post-build task script. TODO: Check this in and have all builds reference
check-in.
pwd && ls
# NOTE!!!! The below code has been copied and pasted from ./dev-tools/run-test.sh
# Do not change here without syncing there and vice-versa.
ZOMBIE_TESTS_COUNT=`jps -v | grep surefirebooter | grep -e '-Dhbase.test' | wc -l`
if [[ $ZOMBIE_TESTS_COUNT != 0 ]] ; then
 echo "Suspicious java process found - waiting 30s to see if there are just slow to stop"
 sleep 30
 ZOMBIE_TESTS_COUNT=`jps -v | grep surefirebooter | grep -e '-Dhbase.test' | wc -l`
 if [[ $ZOMBIE_TESTS_COUNT != 0 ]] ; then
   echo " {color:red}There appear to be $ZOMBIE_TESTS_COUNT zombie tests{color}, they should
have been killed by surefire but survived"
   jps -v | grep surefirebooter | grep -e '-Dhbase.test'
   jps -v | grep surefirebooter | grep -e '-Dhbase.test' | cut -d ' ' -f 1 | xargs -n 1 jstack
   # Exit with error
   exit 1
 else
   echo "We're ok: there is no zombie test, but some tests took some time to stop"
 fi
else
  echo "We're ok: there is no zombie test"
fi
[yahoo-not-h2] $ /bin/bash -xe /tmp/hudson7990498704695845132.sh
+ pwd
<https://builds.apache.org/job/HBase-0.98-matrix/jdk=latest1.7,label=yahoo-not-h2/ws/>
+ ls
bin
CHANGES.txt
conf
dev-support
hbase-annotations
hbase-assembly
hbase-checkstyle
hbase-client
hbase-common
hbase-examples
hbase-hadoop1-compat
hbase-hadoop2-compat
hbase-hadoop-compat
hbase-it
hbase-prefix-tree
hbase-protocol
hbase-resource-bundle
hbase-rest
hbase-server
hbase-shell
hbase-testing-util
hbase-thrift
LICENSE.txt
NOTICE.txt
pom.xml
README.txt
src
target
++ jps -v
++ grep -e -Dhbase.test
++ wc -l
++ grep surefirebooter
+ ZOMBIE_TESTS_COUNT=0
+ [[ 0 != 0 ]]
+ echo 'We'\''re ok: there is no zombie test'
We're ok: there is no zombie test
POST BUILD TASK : SUCCESS
END OF POST BUILD TASK : 0
Archiving artifacts
Recording test results

Mime
View raw message