hbase-builds mailing list archives

Site index · List index
Message view « Date » · « Thread »
Top « Date » · « Thread »
From Apache Jenkins Server <jenk...@builds.apache.org>
Subject Build failed in Jenkins: HBase-Trunk_matrix » latest1.7,yahoo-not-h2 #918
Date Sat, 14 May 2016 04:02:45 GMT
See <https://builds.apache.org/job/HBase-Trunk_matrix/jdk=latest1.7,label=yahoo-not-h2/918/changes>

Changes:

[eclark] HBASE-15725 make_patch.sh should add the branch name when -b is passed.

[matteo.bertozzi] HBASE-13532 Make UnknownScannerException less scary by giving more

[stack] HBASE-15811 Batch Get after batch Put does not fetch all Cells We were

------------------------------------------
[...truncated 6431 lines...]
Tests run: 6, Failures: 0, Errors: 0, Skipped: 0, Time elapsed: 53.803 sec - in org.apache.hadoop.hbase.master.procedure.TestTruncateTableProcedure
Running org.apache.hadoop.hbase.master.procedure.TestProcedureAdmin
Tests run: 4, Failures: 0, Errors: 0, Skipped: 0, Time elapsed: 3.326 sec - in org.apache.hadoop.hbase.master.TestMasterStatusServlet
Running org.apache.hadoop.hbase.master.handler.TestEnableTableHandler
Tests run: 1, Failures: 0, Errors: 0, Skipped: 0, Time elapsed: 40.964 sec - in org.apache.hadoop.hbase.master.procedure.TestServerCrashProcedure
Tests run: 5, Failures: 0, Errors: 0, Skipped: 0, Time elapsed: 18.839 sec - in org.apache.hadoop.hbase.master.procedure.TestProcedureAdmin
Running org.apache.hadoop.hbase.master.TestMasterNoCluster
Running org.apache.hadoop.hbase.master.handler.TestTableDescriptorModification
Running org.apache.hadoop.hbase.master.handler.TestTableDeleteFamilyHandler
Tests run: 8, Failures: 0, Errors: 0, Skipped: 0, Time elapsed: 43.458 sec - in org.apache.hadoop.hbase.master.procedure.TestDeleteColumnFamilyProcedure
Tests run: 3, Failures: 0, Errors: 0, Skipped: 0, Time elapsed: 20.112 sec - in org.apache.hadoop.hbase.master.TestMasterNoCluster
Tests run: 2, Failures: 0, Errors: 0, Skipped: 0, Time elapsed: 59.355 sec - in org.apache.hadoop.hbase.master.handler.TestEnableTableHandler
Running org.apache.hadoop.hbase.master.TestGetLastFlushedSequenceId
Running org.apache.hadoop.hbase.master.normalizer.TestSimpleRegionNormalizerOnCluster
Running org.apache.hadoop.hbase.master.TestMaster
Tests run: 2, Failures: 0, Errors: 0, Skipped: 0, Time elapsed: 33.35 sec - in org.apache.hadoop.hbase.master.handler.TestTableDeleteFamilyHandler
Tests run: 7, Failures: 0, Errors: 0, Skipped: 0, Time elapsed: 58.852 sec - in org.apache.hadoop.hbase.master.handler.TestTableDescriptorModification
Running org.apache.hadoop.hbase.master.snapshot.TestSnapshotFileCache
Tests run: 1, Failures: 0, Errors: 0, Skipped: 0, Time elapsed: 29.046 sec - in org.apache.hadoop.hbase.master.TestGetLastFlushedSequenceId
Tests run: 4, Failures: 0, Errors: 0, Skipped: 0, Time elapsed: 26.042 sec - in org.apache.hadoop.hbase.master.TestMaster
Running org.apache.hadoop.hbase.master.TestMasterFailoverBalancerPersistence
Running org.apache.hadoop.hbase.master.TestMetaShutdownHandler
Running org.apache.hadoop.hbase.master.TestMasterMetrics
Tests run: 3, Failures: 0, Errors: 0, Skipped: 0, Time elapsed: 1.66 sec - in org.apache.hadoop.hbase.master.TestMasterMetrics
Running org.apache.hadoop.hbase.master.TestGetInfoPort
Tests run: 1, Failures: 0, Errors: 0, Skipped: 0, Time elapsed: 26.956 sec - in org.apache.hadoop.hbase.master.TestMasterFailoverBalancerPersistence
Tests run: 2, Failures: 0, Errors: 0, Skipped: 0, Time elapsed: 57.25 sec - in org.apache.hadoop.hbase.master.normalizer.TestSimpleRegionNormalizerOnCluster
Running org.apache.hadoop.hbase.master.TestRollingRestart
Running org.apache.hadoop.hbase.master.TestMasterShutdown
Tests run: 1, Failures: 0, Errors: 0, Skipped: 0, Time elapsed: 32.317 sec - in org.apache.hadoop.hbase.master.TestMetaShutdownHandler
Tests run: 4, Failures: 0, Errors: 0, Skipped: 0, Time elapsed: 52.968 sec - in org.apache.hadoop.hbase.master.snapshot.TestSnapshotFileCache
Running org.apache.hadoop.hbase.master.TestRestartCluster
Running org.apache.hadoop.hbase.master.cleaner.TestLogsCleaner
Tests run: 1, Failures: 0, Errors: 0, Skipped: 0, Time elapsed: 20.771 sec - in org.apache.hadoop.hbase.master.TestGetInfoPort
Tests run: 3, Failures: 0, Errors: 0, Skipped: 0, Time elapsed: 14.294 sec - in org.apache.hadoop.hbase.master.cleaner.TestLogsCleaner
Running org.apache.hadoop.hbase.master.cleaner.TestHFileLinkCleaner
Tests run: 2, Failures: 0, Errors: 0, Skipped: 0, Time elapsed: 32.161 sec - in org.apache.hadoop.hbase.master.TestMasterShutdown
Running org.apache.hadoop.hbase.master.cleaner.TestSnapshotFromMaster
Tests run: 1, Failures: 0, Errors: 0, Skipped: 0, Time elapsed: 11.327 sec - in org.apache.hadoop.hbase.master.cleaner.TestHFileLinkCleaner
Running org.apache.hadoop.hbase.master.TestMasterTransitions
Tests run: 3, Failures: 0, Errors: 0, Skipped: 3, Time elapsed: 0.005 sec - in org.apache.hadoop.hbase.master.TestMasterTransitions
Running org.apache.hadoop.hbase.master.cleaner.TestHFileCleaner
Tests run: 3, Failures: 0, Errors: 0, Skipped: 0, Time elapsed: 2.524 sec - in org.apache.hadoop.hbase.master.cleaner.TestHFileCleaner
Running org.apache.hadoop.hbase.master.TestClusterStatusPublisher
Tests run: 3, Failures: 0, Errors: 0, Skipped: 0, Time elapsed: 0.514 sec - in org.apache.hadoop.hbase.master.TestClusterStatusPublisher
Tests run: 1, Failures: 0, Errors: 0, Skipped: 0, Time elapsed: 51.431 sec - in org.apache.hadoop.hbase.master.TestRollingRestart
Running org.apache.hadoop.hbase.master.TestHMasterRPCException
Tests run: 1, Failures: 0, Errors: 0, Skipped: 0, Time elapsed: 6.992 sec - in org.apache.hadoop.hbase.master.TestHMasterRPCException
Running org.apache.hadoop.hbase.master.TestTableLockManager
Running org.apache.hadoop.hbase.master.TestMasterMetricsWrapper
Tests run: 1, Failures: 0, Errors: 0, Skipped: 0, Time elapsed: 3.869 sec - in org.apache.hadoop.hbase.master.TestMasterMetricsWrapper
Running org.apache.hadoop.hbase.master.TestAssignmentListener
Tests run: 2, Failures: 0, Errors: 0, Skipped: 0, Time elapsed: 72.99 sec - in org.apache.hadoop.hbase.master.TestRestartCluster
Running org.apache.hadoop.hbase.master.balancer.TestDefaultLoadBalancer
Tests run: 1, Failures: 0, Errors: 0, Skipped: 0, Time elapsed: 4.677 sec - in org.apache.hadoop.hbase.master.balancer.TestDefaultLoadBalancer
Tests run: 2, Failures: 0, Errors: 0, Skipped: 0, Time elapsed: 16.61 sec - in org.apache.hadoop.hbase.master.TestAssignmentListener
Running org.apache.hadoop.hbase.master.balancer.TestStochasticLoadBalancer
Tests run: 4, Failures: 0, Errors: 0, Skipped: 0, Time elapsed: 59.146 sec - in org.apache.hadoop.hbase.master.cleaner.TestSnapshotFromMaster
Running org.apache.hadoop.hbase.master.balancer.TestBaseLoadBalancer
Running org.apache.hadoop.hbase.master.TestWarmupRegion
Tests run: 6, Failures: 0, Errors: 0, Skipped: 0, Time elapsed: 1.556 sec - in org.apache.hadoop.hbase.master.balancer.TestBaseLoadBalancer
Running org.apache.hadoop.hbase.master.TestMasterRestartAfterDisablingTable
Running org.apache.hadoop.hbase.master.TestTableStateManager
Tests run: 1, Failures: 0, Errors: 0, Skipped: 0, Time elapsed: 31.801 sec - in org.apache.hadoop.hbase.master.TestTableStateManager
Tests run: 1, Failures: 0, Errors: 0, Skipped: 0, Time elapsed: 39.742 sec - in org.apache.hadoop.hbase.master.TestMasterRestartAfterDisablingTable
Tests run: 1, Failures: 0, Errors: 0, Skipped: 0, Time elapsed: 46.472 sec - in org.apache.hadoop.hbase.master.TestWarmupRegion
Running org.apache.hadoop.hbase.master.TestAssignmentManagerOnCluster
Running org.apache.hadoop.hbase.master.TestDistributedLogSplitting
Running org.apache.hadoop.hbase.master.TestMasterWalManager
Tests run: 1, Failures: 0, Errors: 0, Skipped: 0, Time elapsed: 2.313 sec - in org.apache.hadoop.hbase.master.TestMasterWalManager
Running org.apache.hadoop.hbase.TestMetaTableAccessorNoCluster
Tests run: 2, Failures: 0, Errors: 0, Skipped: 0, Time elapsed: 4.924 sec - in org.apache.hadoop.hbase.TestMetaTableAccessorNoCluster
Running org.apache.hadoop.hbase.mapred.TestTableSnapshotInputFormat
Tests run: 4, Failures: 0, Errors: 0, Skipped: 0, Time elapsed: 145.66 sec - in org.apache.hadoop.hbase.master.TestTableLockManager
Tests run: 18, Failures: 0, Errors: 0, Skipped: 15, Time elapsed: 66.864 sec - in org.apache.hadoop.hbase.master.TestDistributedLogSplitting
Running org.apache.hadoop.hbase.mapred.TestTableMapReduceUtil
Running org.apache.hadoop.hbase.mapred.TestMultiTableSnapshotInputFormat
Tests run: 4, Failures: 0, Errors: 0, Skipped: 0, Time elapsed: 23.387 sec - in org.apache.hadoop.hbase.mapred.TestTableMapReduceUtil
Running org.apache.hadoop.hbase.mapred.TestTableInputFormat
Tests run: 4, Failures: 0, Errors: 0, Skipped: 0, Time elapsed: 61.241 sec - in org.apache.hadoop.hbase.mapred.TestMultiTableSnapshotInputFormat
Tests run: 8, Failures: 0, Errors: 0, Skipped: 0, Time elapsed: 30.367 sec - in org.apache.hadoop.hbase.mapred.TestTableInputFormat
Running org.apache.hadoop.hbase.TestIOFencing
Tests run: 22, Failures: 0, Errors: 0, Skipped: 0, Time elapsed: 181.708 sec - in org.apache.hadoop.hbase.master.TestAssignmentManagerOnCluster
Running org.apache.hadoop.hbase.mapred.TestTableMapReduce
Running org.apache.hadoop.hbase.TestMetaTableLocator
Tests run: 7, Failures: 0, Errors: 0, Skipped: 0, Time elapsed: 5.474 sec - in org.apache.hadoop.hbase.TestMetaTableLocator
Running org.apache.hadoop.hbase.util.TestHBaseFsckMOB
Tests run: 2, Failures: 0, Errors: 0, Skipped: 0, Time elapsed: 34.238 sec - in org.apache.hadoop.hbase.mapred.TestTableMapReduce
Tests run: 7, Failures: 0, Errors: 0, Skipped: 0, Time elapsed: 209.147 sec - in org.apache.hadoop.hbase.mapred.TestTableSnapshotInputFormat
Tests run: 1, Failures: 0, Errors: 0, Skipped: 0, Time elapsed: 18.536 sec - in org.apache.hadoop.hbase.util.TestHBaseFsckMOB
Tests run: 20, Failures: 0, Errors: 0, Skipped: 1, Time elapsed: 297.628 sec - in org.apache.hadoop.hbase.master.balancer.TestStochasticLoadBalancer
Running org.apache.hadoop.hbase.util.TestFSHDFSUtils
Running org.apache.hadoop.hbase.util.TestFSVisitor
Tests run: 1, Failures: 0, Errors: 0, Skipped: 0, Time elapsed: 3.309 sec - in org.apache.hadoop.hbase.util.TestFSVisitor
Running org.apache.hadoop.hbase.util.TestRegionSplitter
Tests run: 3, Failures: 0, Errors: 0, Skipped: 0, Time elapsed: 8.8 sec - in org.apache.hadoop.hbase.util.TestFSHDFSUtils
Running org.apache.hadoop.hbase.util.TestMiniClusterLoadParallel
Running org.apache.hadoop.hbase.util.TestRegionMover
Tests run: 6, Failures: 0, Errors: 0, Skipped: 0, Time elapsed: 11.606 sec - in org.apache.hadoop.hbase.util.TestRegionSplitter
Running org.apache.hadoop.hbase.util.TestIdReadWriteLock
Running org.apache.hadoop.hbase.util.TestHBaseFsckTwoRS
Tests run: 1, Failures: 0, Errors: 0, Skipped: 0, Time elapsed: 15.712 sec - in org.apache.hadoop.hbase.util.TestIdReadWriteLock
Running org.apache.hadoop.hbase.util.hbck.TestOfflineMetaRebuildOverlap
Tests run: 5, Failures: 0, Errors: 0, Skipped: 0, Time elapsed: 50.561 sec - in org.apache.hadoop.hbase.util.TestRegionMover
Running org.apache.hadoop.hbase.util.hbck.TestOfflineMetaRebuildHole
Tests run: 1, Failures: 0, Errors: 0, Skipped: 0, Time elapsed: 40.362 sec - in org.apache.hadoop.hbase.util.hbck.TestOfflineMetaRebuildOverlap
Running org.apache.hadoop.hbase.util.hbck.TestOfflineMetaRebuildBase
Tests run: 2, Failures: 0, Errors: 0, Skipped: 0, Time elapsed: 143.273 sec - in org.apache.hadoop.hbase.TestIOFencing
Running org.apache.hadoop.hbase.util.TestConnectionCache
Tests run: 1, Failures: 0, Errors: 0, Skipped: 0, Time elapsed: 39.67 sec - in org.apache.hadoop.hbase.util.hbck.TestOfflineMetaRebuildHole
Tests run: 1, Failures: 0, Errors: 0, Skipped: 0, Time elapsed: 25.861 sec - in org.apache.hadoop.hbase.util.TestConnectionCache
Tests run: 4, Failures: 0, Errors: 0, Skipped: 0, Time elapsed: 97.401 sec - in org.apache.hadoop.hbase.util.TestMiniClusterLoadParallel
Running org.apache.hadoop.hbase.util.TestFSTableDescriptors
Running org.apache.hadoop.hbase.util.TestDefaultEnvironmentEdge
Running org.apache.hadoop.hbase.util.TestMiniClusterLoadEncoded
Tests run: 1, Failures: 0, Errors: 0, Skipped: 0, Time elapsed: 0.372 sec - in org.apache.hadoop.hbase.util.TestDefaultEnvironmentEdge
Tests run: 16, Failures: 0, Errors: 0, Skipped: 0, Time elapsed: 4.879 sec - in org.apache.hadoop.hbase.util.TestFSTableDescriptors
Tests run: 1, Failures: 0, Errors: 0, Skipped: 0, Time elapsed: 41.903 sec - in org.apache.hadoop.hbase.util.hbck.TestOfflineMetaRebuildBase
Running org.apache.hadoop.hbase.util.TestTableName
Tests run: 6, Failures: 0, Errors: 0, Skipped: 0, Time elapsed: 0.643 sec - in org.apache.hadoop.hbase.util.TestTableName
Running org.apache.hadoop.hbase.util.TestMiniClusterLoadSequential
Running org.apache.hadoop.hbase.util.TestHBaseFsckReplicas
Tests run: 9, Failures: 0, Errors: 0, Skipped: 0, Time elapsed: 105.165 sec - in org.apache.hadoop.hbase.util.TestHBaseFsckTwoRS
Running org.apache.hadoop.hbase.util.TestIdLock
Running org.apache.hadoop.hbase.util.TestHBaseFsckOneRS
Tests run: 1, Failures: 0, Errors: 0, Skipped: 0, Time elapsed: 15.33 sec - in org.apache.hadoop.hbase.util.TestIdLock
Running org.apache.hadoop.hbase.util.TestCoprocessorScanPolicy
Tests run: 4, Failures: 0, Errors: 0, Skipped: 0, Time elapsed: 54.202 sec - in org.apache.hadoop.hbase.util.TestHBaseFsckReplicas
Running org.apache.hadoop.hbase.util.TestFSUtils
Tests run: 4, Failures: 0, Errors: 0, Skipped: 0, Time elapsed: 25.793 sec - in org.apache.hadoop.hbase.util.TestCoprocessorScanPolicy
Running org.apache.hadoop.hbase.util.TestMergeTool
Tests run: 5, Failures: 0, Errors: 0, Skipped: 0, Time elapsed: 104.677 sec - in org.apache.hadoop.hbase.util.TestMiniClusterLoadEncoded
Running org.apache.hadoop.hbase.util.TestMergeTable
Tests run: 4, Failures: 0, Errors: 0, Skipped: 0, Time elapsed: 98.456 sec - in org.apache.hadoop.hbase.util.TestMiniClusterLoadSequential
Tests run: 11, Failures: 0, Errors: 0, Skipped: 0, Time elapsed: 36.853 sec - in org.apache.hadoop.hbase.util.TestFSUtils
Running org.apache.hadoop.hbase.util.TestHBaseFsckEncryption
Tests run: 1, Failures: 0, Errors: 0, Skipped: 0, Time elapsed: 31.41 sec - in org.apache.hadoop.hbase.util.TestMergeTool
Running org.apache.hadoop.hbase.TestMetaTableAccessor
Tests run: 1, Failures: 0, Errors: 0, Skipped: 0, Time elapsed: 25.305 sec - in org.apache.hadoop.hbase.util.TestHBaseFsckEncryption
Tests run: 1, Failures: 0, Errors: 0, Skipped: 0, Time elapsed: 32.995 sec - in org.apache.hadoop.hbase.util.TestMergeTable
Tests run: 15, Failures: 0, Errors: 0, Skipped: 0, Time elapsed: 43.514 sec - in org.apache.hadoop.hbase.TestMetaTableAccessor
Tests run: 42, Failures: 0, Errors: 0, Skipped: 1, Time elapsed: 400.796 sec - in org.apache.hadoop.hbase.util.TestHBaseFsckOneRS

Results :

Tests in error: 
  TestSaslFanOutOneBlockAsyncDFSOutput.setUp:239 » Bind Port in use: localhost:4...
  TestSaslFanOutOneBlockAsyncDFSOutput.setUp:239 » Bind Port in use: localhost:4...
  TestSaslFanOutOneBlockAsyncDFSOutput.setUp:239 » Bind Port in use: localhost:4...
  TestSaslFanOutOneBlockAsyncDFSOutput.setUp:239 » Bind Port in use: localhost:4...
  TestSaslFanOutOneBlockAsyncDFSOutput.setUp:239 » Bind Port in use: localhost:4...
  TestSaslFanOutOneBlockAsyncDFSOutput.setUp:239 » Bind Port in use: localhost:4...
  TestSaslFanOutOneBlockAsyncDFSOutput.setUp:239 » Bind Port in use: localhost:4...
  TestSaslFanOutOneBlockAsyncDFSOutput.setUp:239 » Bind Port in use: localhost:4...
  TestSaslFanOutOneBlockAsyncDFSOutput.setUp:239 » Bind Port in use: localhost:4...
  TestSaslFanOutOneBlockAsyncDFSOutput.setUp:239 » Bind Port in use: localhost:4...
  TestSaslFanOutOneBlockAsyncDFSOutput.setUp:239 » Bind Port in use: localhost:4...
  TestSaslFanOutOneBlockAsyncDFSOutput.setUp:239 » Bind Port in use: localhost:4...
  TestSaslFanOutOneBlockAsyncDFSOutput.setUp:239 » Bind Port in use: localhost:4...
  TestSaslFanOutOneBlockAsyncDFSOutput.setUp:239 » Bind Port in use: localhost:4...
  TestSaslFanOutOneBlockAsyncDFSOutput.setUp:239 » Bind Port in use: localhost:4...
  TestSaslFanOutOneBlockAsyncDFSOutput.setUp:239 » Bind Port in use: localhost:4...
  TestSaslFanOutOneBlockAsyncDFSOutput.setUp:239 » Bind Port in use: localhost:4...
  TestSaslFanOutOneBlockAsyncDFSOutput.setUp:239 » Bind Port in use: localhost:4...
  TestSaslFanOutOneBlockAsyncDFSOutput.setUp:239 » Bind Port in use: localhost:4...
  TestSaslFanOutOneBlockAsyncDFSOutput.setUp:239 » Bind Port in use: localhost:4...
  TestSaslFanOutOneBlockAsyncDFSOutput.setUp:239 » Bind Port in use: localhost:4...
  TestSaslFanOutOneBlockAsyncDFSOutput.setUp:239 » Bind Port in use: localhost:4...
  TestSaslFanOutOneBlockAsyncDFSOutput.setUp:239 » Bind Port in use: localhost:4...
  TestSaslFanOutOneBlockAsyncDFSOutput.setUp:239 » Bind Port in use: localhost:4...
  TestSaslFanOutOneBlockAsyncDFSOutput.setUp:239 » Bind Port in use: localhost:4...
  TestSaslFanOutOneBlockAsyncDFSOutput.setUp:239 » Bind Port in use: localhost:4...
  TestSaslFanOutOneBlockAsyncDFSOutput.setUp:239 » Bind Port in use: localhost:4...
  TestSaslFanOutOneBlockAsyncDFSOutput.setUp:239 » Bind Port in use: localhost:4...
  TestSaslFanOutOneBlockAsyncDFSOutput.setUp:239 » Bind Port in use: localhost:4...
  TestSaslFanOutOneBlockAsyncDFSOutput.setUp:239 » Bind Port in use: localhost:4...

Tests run: 2705, Failures: 0, Errors: 30, Skipped: 63

[INFO] ------------------------------------------------------------------------
[INFO] Reactor Summary:
[INFO] 
[INFO] Apache HBase ...................................... SUCCESS [  3.612 s]
[INFO] Apache HBase - Checkstyle ......................... SUCCESS [  1.025 s]
[INFO] Apache HBase - Resource Bundle .................... SUCCESS [  0.375 s]
[INFO] Apache HBase - Annotations ........................ SUCCESS [  0.351 s]
[INFO] Apache HBase - Protocol ........................... SUCCESS [  4.961 s]
[INFO] Apache HBase - Common ............................. SUCCESS [01:13 min]
[INFO] Apache HBase - Procedure .......................... SUCCESS [01:48 min]
[INFO] Apache HBase - Client ............................. SUCCESS [ 50.906 s]
[INFO] Apache HBase - Hadoop Compatibility ............... SUCCESS [  8.729 s]
[INFO] Apache HBase - Hadoop Two Compatibility ........... SUCCESS [ 12.298 s]
[INFO] Apache HBase - Prefix Tree ........................ SUCCESS [ 13.426 s]
[INFO] Apache HBase - Server ............................. FAILURE [  02:07 h]
[INFO] Apache HBase - Testing Util ....................... SKIPPED
[INFO] Apache HBase - Thrift ............................. SKIPPED
[INFO] Apache HBase - RSGroup ............................ SKIPPED
[INFO] Apache HBase - Shell .............................. SKIPPED
[INFO] Apache HBase - Integration Tests .................. SKIPPED
[INFO] Apache HBase - Examples ........................... SKIPPED
[INFO] Apache HBase - Rest ............................... SKIPPED
[INFO] Apache HBase - External Block Cache ............... SKIPPED
[INFO] Apache HBase - Spark .............................. SKIPPED
[INFO] Apache HBase - Assembly ........................... SKIPPED
[INFO] Apache HBase - Shaded ............................. SKIPPED
[INFO] Apache HBase - Shaded - Client .................... SKIPPED
[INFO] Apache HBase - Shaded - Server .................... SKIPPED
[INFO] Apache HBase - Archetypes ......................... SKIPPED
[INFO] Apache HBase - Exemplar for hbase-client archetype  SKIPPED
[INFO] Apache HBase - Exemplar for hbase-shaded-client archetype  SKIPPED
[INFO] Apache HBase - Archetype builder .................. SKIPPED
[INFO] ------------------------------------------------------------------------
[INFO] BUILD FAILURE
[INFO] ------------------------------------------------------------------------
[INFO] Total time: 02:12 h
[INFO] Finished at: 2016-05-14T03:59:17+00:00
[INFO] Final Memory: 69M/739M
[INFO] ------------------------------------------------------------------------
[ERROR] Failed to execute goal org.apache.maven.plugins:maven-surefire-plugin:2.18.1:test
(secondPartTestsExecution) on project hbase-server: There are test failures.
[ERROR] 
[ERROR] Please refer to <https://builds.apache.org/job/HBase-Trunk_matrix/jdk=latest1.7,label=yahoo-not-h2/ws/hbase-server/target/surefire-reports>
for the individual test results.
[ERROR] -> [Help 1]
[ERROR] 
[ERROR] To see the full stack trace of the errors, re-run Maven with the -e switch.
[ERROR] Re-run Maven using the -X switch to enable full debug logging.
[ERROR] 
[ERROR] For more information about the errors and possible solutions, please read the following
articles:
[ERROR] [Help 1] http://cwiki.apache.org/confluence/display/MAVEN/MojoFailureException
[ERROR] 
[ERROR] After correcting the problems, you can resume the build with the command
[ERROR]   mvn <goals> -rf :hbase-server
Build step 'Invoke top-level Maven targets' marked build as failure
Performing Post build task...
Match found for :.* : True
Logical operation result is TRUE
Running script  : # Run zombie detector script
./dev-support/zombie-detector.sh --jenkins ${BUILD_ID}
[yahoo-not-h2] $ /bin/bash -xe /tmp/hudson6486797346179113382.sh
+ ./dev-support/zombie-detector.sh --jenkins 918
Sat May 14 03:59:19 UTC 2016 We're ok: there is no zombie test


    {color:green}+1 zombies{color}. No zombie tests found running at the end of the build.
POST BUILD TASK : SUCCESS
END OF POST BUILD TASK : 0
Archiving artifacts
Recording test results
[FINDBUGS] Skipping publisher since build result is FAILURE
[CHECKSTYLE] Skipping publisher since build result is FAILURE

Mime
View raw message