hbase-builds mailing list archives

Site index · List index
Message view « Date » · « Thread »
Top « Date » · « Thread »
From Apache Jenkins Server <jenk...@builds.apache.org>
Subject Build failed in Jenkins: HBase-1.3 » latest1.7,yahoo-not-h2 #721
Date Tue, 31 May 2016 10:39:04 GMT
See <https://builds.apache.org/job/HBase-1.3/jdk=latest1.7,label=yahoo-not-h2/721/changes>

Changes:

[stack] HBASE-15920 Backport submit-patch.py to branch-1 and earlier branches.

------------------------------------------
[...truncated 51260 lines...]
13324/13509 KB   
13328/13509 KB   
13332/13509 KB   
13333/13509 KB   
13337/13509 KB   
13341/13509 KB   
13345/13509 KB   
13349/13509 KB   
13353/13509 KB   
13357/13509 KB   
13361/13509 KB   
13362/13509 KB   
13366/13509 KB   
13369/13509 KB   
13370/13509 KB   
13374/13509 KB   
13377/13509 KB   
13381/13509 KB   
13383/13509 KB   
13387/13509 KB   
13391/13509 KB   
13395/13509 KB   
13396/13509 KB   
13400/13509 KB   
13404/13509 KB   
13408/13509 KB   
13412/13509 KB   
13416/13509 KB   
13420/13509 KB   
13424/13509 KB   
13425/13509 KB   
13429/13509 KB   
13432/13509 KB   
13436/13509 KB   
13437/13509 KB   
13440/13509 KB   
13444/13509 KB   
13444/13509 KB   
13447/13509 KB   
13451/13509 KB   
13455/13509 KB   
13456/13509 KB   
13460/13509 KB   
13463/13509 KB   
13464/13509 KB   
13467/13509 KB   
13468/13509 KB   
13472/13509 KB   
13475/13509 KB   
13479/13509 KB   
13480/13509 KB   
13484/13509 KB   
13488/13509 KB   
13489/13509 KB   
13493/13509 KB   
13496/13509 KB   
13500/13509 KB   
13504/13509 KB   
13505/13509 KB   
13508/13509 KB   
13509/13509 KB   
                 
Downloaded: http://repository.jboss.org/nexus/content/groups/public-jboss/org/jruby/jruby-complete/1.6.8/jruby-complete-1.6.8.jar
(13509 KB at 1430.2 KB/sec)
[INFO] 
[INFO] --- maven-enforcer-plugin:1.0.1:enforce (enforce) @ hbase-shell ---
[INFO] 
[INFO] --- buildnumber-maven-plugin:1.3:create-timestamp (default) @ hbase-shell ---
[INFO] 
[INFO] --- build-helper-maven-plugin:1.9.1:add-source (jspcSource-packageInfo-source) @ hbase-shell
---
[INFO] Source directory: <https://builds.apache.org/job/HBase-1.3/jdk=latest1.7,label=yahoo-not-h2/ws/hbase-shell/target/generated-jamon>
added.
[INFO] Source directory: <https://builds.apache.org/job/HBase-1.3/jdk=latest1.7,label=yahoo-not-h2/ws/hbase-shell/target/generated-sources/java>
added.
[INFO] 
[INFO] --- maven-remote-resources-plugin:1.5:process (default) @ hbase-shell ---
[INFO] 
[INFO] --- maven-resources-plugin:2.6:resources (default-resources) @ hbase-shell ---
[INFO] Using 'UTF-8' encoding to copy filtered resources.
[INFO] Copying 0 resource
[INFO] Copying 3 resources
[INFO] 
[INFO] --- maven-compiler-plugin:2.5.1:compile (default-compile) @ hbase-shell ---
[INFO] No sources to compile
[INFO] 
[INFO] --- maven-dependency-plugin:2.1:build-classpath (create-mrapp-generated-classpath)
@ hbase-shell ---
[INFO] Wrote classpath file '<https://builds.apache.org/job/HBase-1.3/jdk=latest1.7,label=yahoo-not-h2/ws/hbase-shell/target/test-classes/mrapp-generated-classpath'.>
[INFO] 
[INFO] --- maven-resources-plugin:2.6:testResources (default-testResources) @ hbase-shell
---
[INFO] Using 'UTF-8' encoding to copy filtered resources.
[INFO] Copying 1 resource
[INFO] Copying 3 resources
[INFO] 
[INFO] --- maven-compiler-plugin:2.5.1:testCompile (default-testCompile) @ hbase-shell ---
[INFO] Compiling 2 source files to <https://builds.apache.org/job/HBase-1.3/jdk=latest1.7,label=yahoo-not-h2/ws/hbase-shell/target/test-classes>
[INFO] 
[INFO] --- maven-surefire-plugin:2.18.1:test (default-test) @ hbase-shell ---
[INFO] Surefire report directory: <https://builds.apache.org/job/HBase-1.3/jdk=latest1.7,label=yahoo-not-h2/ws/hbase-shell/target/surefire-reports>
[INFO] Using configured provider org.apache.maven.surefire.junitcore.JUnitCoreProvider
[INFO] parallel='none', perCoreThreadCount=true, threadCount=0, useUnlimitedThreads=false,
threadCountSuites=0, threadCountClasses=0, threadCountMethods=0, parallelOptimized=true

-------------------------------------------------------
 T E S T S
-------------------------------------------------------

Results :

Tests run: 0, Failures: 0, Errors: 0, Skipped: 0

[INFO] 
[INFO] --- maven-surefire-plugin:2.18.1:test (secondPartTestsExecution) @ hbase-shell ---
[INFO] Surefire report directory: <https://builds.apache.org/job/HBase-1.3/jdk=latest1.7,label=yahoo-not-h2/ws/hbase-shell/target/surefire-reports>
[INFO] Using configured provider org.apache.maven.surefire.junitcore.JUnitCoreProvider
[INFO] parallel='none', perCoreThreadCount=true, threadCount=0, useUnlimitedThreads=false,
threadCountSuites=0, threadCountClasses=0, threadCountMethods=0, parallelOptimized=true

-------------------------------------------------------
 T E S T S
-------------------------------------------------------
Running org.apache.hadoop.hbase.client.TestShell
Tests run: 1, Failures: 0, Errors: 1, Skipped: 0, Time elapsed: 444.039 sec <<< FAILURE!
- in org.apache.hadoop.hbase.client.TestShell
testRunShellTests(org.apache.hadoop.hbase.client.TestShell)  Time elapsed: 441.596 sec  <<<
ERROR!
org.jruby.embed.EvalFailedException: (RuntimeError) Shell unit tests failed. Check output
file for details.
	at org.jruby.embed.internal.EmbedEvalUnitImpl.run(EmbedEvalUnitImpl.java:136)
	at org.jruby.embed.ScriptingContainer.runUnit(ScriptingContainer.java:1263)
	at org.jruby.embed.ScriptingContainer.runScriptlet(ScriptingContainer.java:1308)
	at org.apache.hadoop.hbase.client.TestShell.testRunShellTests(TestShell.java:36)
Caused by: org.jruby.exceptions.RaiseException: (RuntimeError) Shell unit tests failed. Check
output file for details.
	at (Anonymous).(root)(src/test/ruby/tests_runner.rb:84)


Results :

Tests in error: 
  TestShell.testRunShellTests:36 » EvalFailed (RuntimeError) Shell unit tests fa...

Tests run: 1, Failures: 0, Errors: 1, Skipped: 0

[INFO] ------------------------------------------------------------------------
[INFO] Reactor Summary:
[INFO] 
[INFO] Apache HBase ...................................... SUCCESS [1:22.774s]
[INFO] Apache HBase - Checkstyle ......................... SUCCESS [6.834s]
[INFO] Apache HBase - Resource Bundle .................... SUCCESS [0.191s]
[INFO] Apache HBase - Annotations ........................ SUCCESS [1.038s]
[INFO] Apache HBase - Protocol ........................... SUCCESS [15.805s]
[INFO] Apache HBase - Common ............................. SUCCESS [2:10.413s]
[INFO] Apache HBase - Procedure .......................... SUCCESS [3:07.719s]
[INFO] Apache HBase - Client ............................. SUCCESS [1:23.393s]
[INFO] Apache HBase - Hadoop Compatibility ............... SUCCESS [8.025s]
[INFO] Apache HBase - Hadoop Two Compatibility ........... SUCCESS [10.698s]
[INFO] Apache HBase - Prefix Tree ........................ SUCCESS [9.845s]
[INFO] Apache HBase - Server ............................. SUCCESS [1:37:15.061s]
[INFO] Apache HBase - Testing Util ....................... SUCCESS [1.847s]
[INFO] Apache HBase - Thrift ............................. SUCCESS [4:46.253s]
[INFO] Apache HBase - Rest ............................... SUCCESS [13:59.722s]
[INFO] Apache HBase - Shell .............................. FAILURE [8:26.787s]
[INFO] Apache HBase - Integration Tests .................. SKIPPED
[INFO] Apache HBase - Examples ........................... SKIPPED
[INFO] Apache HBase - External Block Cache ............... SKIPPED
[INFO] Apache HBase - Assembly ........................... SKIPPED
[INFO] Apache HBase - Shaded ............................. SKIPPED
[INFO] Apache HBase - Shaded - Client .................... SKIPPED
[INFO] Apache HBase - Shaded - Server .................... SKIPPED
[INFO] ------------------------------------------------------------------------
[INFO] BUILD FAILURE
[INFO] ------------------------------------------------------------------------
[INFO] Total time: 2:13:49.841s
[INFO] Finished at: Tue May 31 10:36:06 UTC 2016
[INFO] Final Memory: 117M/643M
[INFO] ------------------------------------------------------------------------
[ERROR] Failed to execute goal org.apache.maven.plugins:maven-surefire-plugin:2.18.1:test
(secondPartTestsExecution) on project hbase-shell: ExecutionException: java.lang.RuntimeException:
java.lang.RuntimeException: org.apache.maven.surefire.report.ReporterException: When writing
xml report stdout/stderr: /tmp/stderr6856724022435527437deferred (No such file or directory)
-> [Help 1]
[ERROR] 
[ERROR] To see the full stack trace of the errors, re-run Maven with the -e switch.
[ERROR] Re-run Maven using the -X switch to enable full debug logging.
[ERROR] 
[ERROR] For more information about the errors and possible solutions, please read the following
articles:
[ERROR] [Help 1] http://cwiki.apache.org/confluence/display/MAVEN/MojoFailureException
[ERROR] 
[ERROR] After correcting the problems, you can resume the build with the command
[ERROR]   mvn <goals> -rf :hbase-shell
Build step 'Invoke top-level Maven targets' marked build as failure
Performing Post build task...
Match found for :.* : True
Logical operation result is TRUE
Running script  : # Post-build task script. TODO: Check this in and have all builds reference
check-in.
pwd && ls
# NOTE!!!! The below code has been copied and pasted from ./dev-tools/run-test.sh
# Do not change here without syncing there and vice-versa.
ZOMBIE_TESTS_COUNT=`jps -v | grep surefirebooter | grep -e '-Dhbase.test' | wc -l`
if [[ $ZOMBIE_TESTS_COUNT != 0 ]] ; then
 echo "Suspicious java process found - waiting 30s to see if there are just slow to stop"
 sleep 30
 ZOMBIE_TESTS_COUNT=`jps -v | grep surefirebooter | grep -e '-Dhbase.test' | wc -l`
 if [[ $ZOMBIE_TESTS_COUNT != 0 ]] ; then
   echo " {color:red}There appear to be $ZOMBIE_TESTS_COUNT zombie tests{color}, they should
have been killed by surefire but survived"
   jps -v | grep surefirebooter | grep -e '-Dhbase.test'
   jps -v | grep surefirebooter | grep -e '-Dhbase.test' | cut -d ' ' -f 1 | xargs -n 1 jstack
   # Exit with error
   exit 1
 else
   echo "We're ok: there is no zombie test, but some tests took some time to stop"
 fi
else
  echo "We're ok: there is no zombie test"
fi
[yahoo-not-h2] $ /bin/bash -xe /tmp/hudson7684099881391239968.sh
+ pwd
<https://builds.apache.org/job/HBase-1.3/jdk=latest1.7,label=yahoo-not-h2/ws/>
+ ls
bin
CHANGES.txt
conf
dev-support
hbase-annotations
hbase-assembly
hbase-checkstyle
hbase-client
hbase-common
hbase-examples
hbase-external-blockcache
hbase-hadoop2-compat
hbase-hadoop-compat
hbase-it
hbase-native-client
hbase-prefix-tree
hbase-procedure
hbase-protocol
hbase-resource-bundle
hbase-rest
hbase-server
hbase-shaded
hbase-shell
hbase-testing-util
hbase-thrift
LICENSE.txt
NOTICE.txt
pom.xml
README.txt
src
target
++ jps -v
++ grep surefirebooter
++ grep -e -Dhbase.test
++ wc -l
+ ZOMBIE_TESTS_COUNT=0
+ [[ 0 != 0 ]]
+ echo 'We'\''re ok: there is no zombie test'
We're ok: there is no zombie test
POST BUILD TASK : SUCCESS
END OF POST BUILD TASK : 0
Archiving artifacts
Recording test results

Mime
View raw message