hbase-builds mailing list archives

Site index · List index
Message view « Date » · « Thread »
Top « Date » · « Thread »
From Apache Jenkins Server <jenk...@builds.apache.org>
Subject Build failed in Jenkins: HBase-0.98-on-Hadoop-1.1 #1219
Date Sat, 21 May 2016 17:20:26 GMT
See <https://builds.apache.org/job/HBase-0.98-on-Hadoop-1.1/1219/changes>

Changes:

[Gary Helmling] HBASE-15856 Don't cache unresolved addresses for connections

------------------------------------------
[...truncated 1676 lines...]
Tests run: 1, Failures: 0, Errors: 0, Skipped: 0, Time elapsed: 0.344 sec - in org.apache.hadoop.hbase.ipc.TestHBaseClient
Running org.apache.hadoop.hbase.ipc.TestProtoBufRpc
Tests run: 1, Failures: 0, Errors: 0, Skipped: 0, Time elapsed: 1.688 sec - in org.apache.hadoop.hbase.ipc.TestProtoBufRpc
Running org.apache.hadoop.hbase.ipc.TestDelayedRpc
Tests run: 4, Failures: 0, Errors: 0, Skipped: 0, Time elapsed: 3.587 sec - in org.apache.hadoop.hbase.ipc.TestDelayedRpc
Running org.apache.hadoop.hbase.trace.TestHTraceHooks
Tests run: 1, Failures: 0, Errors: 0, Skipped: 0, Time elapsed: 5.133 sec - in org.apache.hadoop.hbase.trace.TestHTraceHooks
Running org.apache.hadoop.hbase.TestInfoServers
Tests run: 3, Failures: 0, Errors: 0, Skipped: 0, Time elapsed: 4.777 sec - in org.apache.hadoop.hbase.TestInfoServers
Running org.apache.hadoop.hbase.TestHBaseOnOtherDfsCluster
Tests run: 1, Failures: 0, Errors: 0, Skipped: 0, Time elapsed: 21.606 sec - in org.apache.hadoop.hbase.TestHBaseOnOtherDfsCluster
Running org.apache.hadoop.hbase.client.TestCloneSnapshotFromClient
Tests run: 5, Failures: 0, Errors: 0, Skipped: 0, Time elapsed: 180.249 sec - in org.apache.hadoop.hbase.client.TestCloneSnapshotFromClient
Running org.apache.hadoop.hbase.client.TestSnapshotMetadata
Tests run: 4, Failures: 0, Errors: 0, Skipped: 0, Time elapsed: 46.565 sec - in org.apache.hadoop.hbase.client.TestSnapshotMetadata
Running org.apache.hadoop.hbase.client.TestHTableMultiplexer
Tests run: 1, Failures: 0, Errors: 0, Skipped: 0, Time elapsed: 12.18 sec - in org.apache.hadoop.hbase.client.TestHTableMultiplexer
Running org.apache.hadoop.hbase.client.TestClientOperationInterrupt
Tests run: 1, Failures: 0, Errors: 0, Skipped: 0, Time elapsed: 55.805 sec - in org.apache.hadoop.hbase.client.TestClientOperationInterrupt
Running org.apache.hadoop.hbase.client.TestSizeFailures
Tests run: 2, Failures: 0, Errors: 0, Skipped: 0, Time elapsed: 36.479 sec - in org.apache.hadoop.hbase.client.TestSizeFailures
Running org.apache.hadoop.hbase.client.TestHTablePool$TestHTableReusablePool
Tests run: 9, Failures: 0, Errors: 0, Skipped: 0, Time elapsed: 18.718 sec - in org.apache.hadoop.hbase.client.TestHTablePool$TestHTableReusablePool
Running org.apache.hadoop.hbase.client.TestHTablePool$TestHTableThreadLocalPool
Tests run: 9, Failures: 0, Errors: 0, Skipped: 0, Time elapsed: 7.122 sec - in org.apache.hadoop.hbase.client.TestHTablePool$TestHTableThreadLocalPool
Running org.apache.hadoop.hbase.client.TestMultipleTimestamps
Tests run: 8, Failures: 0, Errors: 0, Skipped: 0, Time elapsed: 27.016 sec - in org.apache.hadoop.hbase.client.TestMultipleTimestamps
Running org.apache.hadoop.hbase.client.TestSnapshotCloneIndependence
Tests run: 8, Failures: 0, Errors: 6, Skipped: 0, Time elapsed: 83.995 sec <<< FAILURE!
- in org.apache.hadoop.hbase.client.TestSnapshotCloneIndependence
testOfflineSnapshotDeleteIndependent(org.apache.hadoop.hbase.client.TestSnapshotCloneIndependence)
 Time elapsed: 10.232 sec  <<< ERROR!
org.apache.hadoop.hbase.snapshot.RestoreSnapshotException: org.apache.hadoop.hbase.snapshot.RestoreSnapshotException:
clone snapshot={ ss=snapshot_test1463850025669 table=test1463850025669 type=DISABLED } failed
because java.util.concurrent.ExecutionException: org.apache.hadoop.ipc.RemoteException: org.apache.hadoop.hdfs.server.namenode.LeaseExpiredException:
No lease on /user/jenkins/hbase/archive/data/default/test1463850025669/bf86be7543223bf6c6bad65cb44f48ad/fam/.links-ecb9166a59634ab891d54044f1b52993/21d352b7375721801e700abddf87a781.test-clone-test1463850025669
File does not exist. Holder DFSClient_NONMAPREDUCE_-1511226420_1 does not have any open files
	at org.apache.hadoop.hbase.ipc.RpcClient.call(RpcClient.java:1491)
	at org.apache.hadoop.hbase.ipc.RpcClient.callBlockingMethod(RpcClient.java:1693)
	at org.apache.hadoop.hbase.ipc.RpcClient$BlockingRpcChannelImplementation.callBlockingMethod(RpcClient.java:1763)
	at org.apache.hadoop.hbase.protobuf.generated.MasterProtos$MasterService$BlockingStub.isRestoreSnapshotDone(MasterProtos.java:46686)
	at org.apache.hadoop.hbase.client.HConnectionManager$HConnectionImplementation$5.isRestoreSnapshotDone(HConnectionManager.java:2168)
	at org.apache.hadoop.hbase.client.HBaseAdmin$30.call(HBaseAdmin.java:3222)
	at org.apache.hadoop.hbase.client.HBaseAdmin$30.call(HBaseAdmin.java:3219)
	at org.apache.hadoop.hbase.client.RpcRetryingCaller.callWithRetries(RpcRetryingCaller.java:115)
	at org.apache.hadoop.hbase.client.RpcRetryingCaller.callWithRetries(RpcRetryingCaller.java:91)
	at org.apache.hadoop.hbase.client.HBaseAdmin.executeCallable(HBaseAdmin.java:3479)
	at org.apache.hadoop.hbase.client.HBaseAdmin.internalRestoreSnapshot(HBaseAdmin.java:3218)
	at org.apache.hadoop.hbase.client.HBaseAdmin.cloneSnapshot(HBaseAdmin.java:3080)
	at org.apache.hadoop.hbase.client.HBaseAdmin.cloneSnapshot(HBaseAdmin.java:3045)
	at org.apache.hadoop.hbase.client.TestSnapshotCloneIndependence.runTestSnapshotDeleteIndependent(TestSnapshotCloneIndependence.java:425)
	at org.apache.hadoop.hbase.client.TestSnapshotCloneIndependence.testOfflineSnapshotDeleteIndependent(TestSnapshotCloneIndependence.java:178)

testOnlineSnapshotRegionOperationsIndependent(org.apache.hadoop.hbase.client.TestSnapshotCloneIndependence)
 Time elapsed: 7.405 sec  <<< ERROR!
org.apache.hadoop.hbase.snapshot.RestoreSnapshotException: org.apache.hadoop.hbase.snapshot.RestoreSnapshotException:
clone snapshot={ ss=snapshot_test1463850036518 table=test1463850036518 type=FLUSH } failed
because java.util.concurrent.ExecutionException: org.apache.hadoop.ipc.RemoteException: org.apache.hadoop.hdfs.server.namenode.LeaseExpiredException:
No lease on /user/jenkins/hbase/archive/data/default/test1463850036518/dc6d38f3caa1fdae4697b670cb618060/fam/.links-888d21d0cd244b3fa023379b6098f6d4/85e23f0babb24c23f95ecdb8fc40833b.test-clone-test1463850036518
File does not exist. Holder DFSClient_NONMAPREDUCE_-1511226420_1 does not have any open files
	at org.apache.hadoop.hbase.ipc.RpcClient.call(RpcClient.java:1491)
	at org.apache.hadoop.hbase.ipc.RpcClient.callBlockingMethod(RpcClient.java:1693)
	at org.apache.hadoop.hbase.ipc.RpcClient$BlockingRpcChannelImplementation.callBlockingMethod(RpcClient.java:1763)
	at org.apache.hadoop.hbase.protobuf.generated.MasterProtos$MasterService$BlockingStub.isRestoreSnapshotDone(MasterProtos.java:46686)
	at org.apache.hadoop.hbase.client.HConnectionManager$HConnectionImplementation$5.isRestoreSnapshotDone(HConnectionManager.java:2168)
	at org.apache.hadoop.hbase.client.HBaseAdmin$30.call(HBaseAdmin.java:3222)
	at org.apache.hadoop.hbase.client.HBaseAdmin$30.call(HBaseAdmin.java:3219)
	at org.apache.hadoop.hbase.client.RpcRetryingCaller.callWithRetries(RpcRetryingCaller.java:115)
	at org.apache.hadoop.hbase.client.RpcRetryingCaller.callWithRetries(RpcRetryingCaller.java:91)
	at org.apache.hadoop.hbase.client.HBaseAdmin.executeCallable(HBaseAdmin.java:3479)
	at org.apache.hadoop.hbase.client.HBaseAdmin.internalRestoreSnapshot(HBaseAdmin.java:3218)
	at org.apache.hadoop.hbase.client.HBaseAdmin.cloneSnapshot(HBaseAdmin.java:3080)
	at org.apache.hadoop.hbase.client.HBaseAdmin.cloneSnapshot(HBaseAdmin.java:3030)
	at org.apache.hadoop.hbase.client.TestSnapshotCloneIndependence.runTestRegionOperationsIndependent(TestSnapshotCloneIndependence.java:311)
	at org.apache.hadoop.hbase.client.TestSnapshotCloneIndependence.testOnlineSnapshotRegionOperationsIndependent(TestSnapshotCloneIndependence.java:173)

testOnlineSnapshotMetadataChangesIndependent(org.apache.hadoop.hbase.client.TestSnapshotCloneIndependence)
 Time elapsed: 6.942 sec  <<< ERROR!
org.apache.hadoop.hbase.snapshot.RestoreSnapshotException: org.apache.hadoop.hbase.snapshot.RestoreSnapshotException:
clone snapshot={ ss=snapshot_test1463850043084 table=test1463850043084 type=FLUSH } failed
because java.util.concurrent.ExecutionException: org.apache.hadoop.ipc.RemoteException: org.apache.hadoop.hdfs.server.namenode.LeaseExpiredException:
No lease on /user/jenkins/hbase/archive/data/default/test1463850043084/eff77b6e09c39042e9550eb1342040f8/fam/.links-5a6e500fcae24e9eac364bc1e5cb46ba/502d2a7da1dbc26e854b1ea1a855c6bb.test-clone-test1463850043084
File does not exist. Holder DFSClient_NONMAPREDUCE_-1511226420_1 does not have any open files
	at org.apache.hadoop.hbase.ipc.RpcClient.call(RpcClient.java:1491)
	at org.apache.hadoop.hbase.ipc.RpcClient.callBlockingMethod(RpcClient.java:1693)
	at org.apache.hadoop.hbase.ipc.RpcClient$BlockingRpcChannelImplementation.callBlockingMethod(RpcClient.java:1763)
	at org.apache.hadoop.hbase.protobuf.generated.MasterProtos$MasterService$BlockingStub.isRestoreSnapshotDone(MasterProtos.java:46686)
	at org.apache.hadoop.hbase.client.HConnectionManager$HConnectionImplementation$5.isRestoreSnapshotDone(HConnectionManager.java:2168)
	at org.apache.hadoop.hbase.client.HBaseAdmin$30.call(HBaseAdmin.java:3222)
	at org.apache.hadoop.hbase.client.HBaseAdmin$30.call(HBaseAdmin.java:3219)
	at org.apache.hadoop.hbase.client.RpcRetryingCaller.callWithRetries(RpcRetryingCaller.java:115)
	at org.apache.hadoop.hbase.client.RpcRetryingCaller.callWithRetries(RpcRetryingCaller.java:91)
	at org.apache.hadoop.hbase.client.HBaseAdmin.executeCallable(HBaseAdmin.java:3479)
	at org.apache.hadoop.hbase.client.HBaseAdmin.internalRestoreSnapshot(HBaseAdmin.java:3218)
	at org.apache.hadoop.hbase.client.HBaseAdmin.cloneSnapshot(HBaseAdmin.java:3080)
	at org.apache.hadoop.hbase.client.HBaseAdmin.cloneSnapshot(HBaseAdmin.java:3030)
	at org.apache.hadoop.hbase.client.TestSnapshotCloneIndependence.runTestSnapshotMetadataChangesIndependent(TestSnapshotCloneIndependence.java:364)
	at org.apache.hadoop.hbase.client.TestSnapshotCloneIndependence.testOnlineSnapshotMetadataChangesIndependent(TestSnapshotCloneIndependence.java:146)

testOnlineSnapshotDeleteIndependent(org.apache.hadoop.hbase.client.TestSnapshotCloneIndependence)
 Time elapsed: 8.887 sec  <<< ERROR!
org.apache.hadoop.hbase.snapshot.RestoreSnapshotException: org.apache.hadoop.hbase.snapshot.RestoreSnapshotException:
clone snapshot={ ss=snapshot_test1463850050877 table=test1463850050877 type=FLUSH } failed
because java.util.concurrent.ExecutionException: org.apache.hadoop.ipc.RemoteException: org.apache.hadoop.hdfs.server.namenode.LeaseExpiredException:
No lease on /user/jenkins/hbase/archive/data/default/test1463850050877/8439619fe7d0bb99ca80dea323f71b8f/fam/.links-8829672e84584ce49395478e7b66c51b/0a9c193ec2f10c196fad0816719b0cfd.test-clone-test1463850050877
File does not exist. Holder DFSClient_NONMAPREDUCE_-1511226420_1 does not have any open files
	at org.apache.hadoop.hbase.ipc.RpcClient.call(RpcClient.java:1491)
	at org.apache.hadoop.hbase.ipc.RpcClient.callBlockingMethod(RpcClient.java:1693)
	at org.apache.hadoop.hbase.ipc.RpcClient$BlockingRpcChannelImplementation.callBlockingMethod(RpcClient.java:1763)
	at org.apache.hadoop.hbase.protobuf.generated.MasterProtos$MasterService$BlockingStub.isRestoreSnapshotDone(MasterProtos.java:46686)
	at org.apache.hadoop.hbase.client.HConnectionManager$HConnectionImplementation$5.isRestoreSnapshotDone(HConnectionManager.java:2168)
	at org.apache.hadoop.hbase.client.HBaseAdmin$30.call(HBaseAdmin.java:3222)
	at org.apache.hadoop.hbase.client.HBaseAdmin$30.call(HBaseAdmin.java:3219)
	at org.apache.hadoop.hbase.client.RpcRetryingCaller.callWithRetries(RpcRetryingCaller.java:115)
	at org.apache.hadoop.hbase.client.RpcRetryingCaller.callWithRetries(RpcRetryingCaller.java:91)
	at org.apache.hadoop.hbase.client.HBaseAdmin.executeCallable(HBaseAdmin.java:3479)
	at org.apache.hadoop.hbase.client.HBaseAdmin.internalRestoreSnapshot(HBaseAdmin.java:3218)
	at org.apache.hadoop.hbase.client.HBaseAdmin.cloneSnapshot(HBaseAdmin.java:3080)
	at org.apache.hadoop.hbase.client.HBaseAdmin.cloneSnapshot(HBaseAdmin.java:3045)
	at org.apache.hadoop.hbase.client.TestSnapshotCloneIndependence.runTestSnapshotDeleteIndependent(TestSnapshotCloneIndependence.java:425)
	at org.apache.hadoop.hbase.client.TestSnapshotCloneIndependence.testOnlineSnapshotDeleteIndependent(TestSnapshotCloneIndependence.java:183)

testOfflineSnapshotAppendIndependent(org.apache.hadoop.hbase.client.TestSnapshotCloneIndependence)
 Time elapsed: 10.145 sec  <<< ERROR!
org.apache.hadoop.hbase.snapshot.RestoreSnapshotException: org.apache.hadoop.hbase.snapshot.RestoreSnapshotException:
clone snapshot={ ss=snapshot_test1463850059868 table=test1463850059868 type=DISABLED } failed
because java.util.concurrent.ExecutionException: org.apache.hadoop.ipc.RemoteException: org.apache.hadoop.hdfs.server.namenode.LeaseExpiredException:
No lease on /user/jenkins/hbase/archive/data/default/test1463850059868/877b6f8214d74dee9c48258f02459d0a/fam/.links-c8b2caf3321846899f2f460b4088d3eb/9eb3dc1afec4972c7df9d6c6eaa8fe31.test-clone-test1463850059868
File does not exist. Holder DFSClient_NONMAPREDUCE_-1511226420_1 does not have any open files
	at org.apache.hadoop.hbase.ipc.RpcClient.call(RpcClient.java:1491)
	at org.apache.hadoop.hbase.ipc.RpcClient.callBlockingMethod(RpcClient.java:1693)
	at org.apache.hadoop.hbase.ipc.RpcClient$BlockingRpcChannelImplementation.callBlockingMethod(RpcClient.java:1763)
	at org.apache.hadoop.hbase.protobuf.generated.MasterProtos$MasterService$BlockingStub.isRestoreSnapshotDone(MasterProtos.java:46686)
	at org.apache.hadoop.hbase.client.HConnectionManager$HConnectionImplementation$5.isRestoreSnapshotDone(HConnectionManager.java:2168)
	at org.apache.hadoop.hbase.client.HBaseAdmin$30.call(HBaseAdmin.java:3222)
	at org.apache.hadoop.hbase.client.HBaseAdmin$30.call(HBaseAdmin.java:3219)
	at org.apache.hadoop.hbase.client.RpcRetryingCaller.callWithRetries(RpcRetryingCaller.java:115)
	at org.apache.hadoop.hbase.client.RpcRetryingCaller.callWithRetries(RpcRetryingCaller.java:91)
	at org.apache.hadoop.hbase.client.HBaseAdmin.executeCallable(HBaseAdmin.java:3479)
	at org.apache.hadoop.hbase.client.HBaseAdmin.internalRestoreSnapshot(HBaseAdmin.java:3218)
	at org.apache.hadoop.hbase.client.HBaseAdmin.cloneSnapshot(HBaseAdmin.java:3080)
	at org.apache.hadoop.hbase.client.HBaseAdmin.cloneSnapshot(HBaseAdmin.java:3030)
	at org.apache.hadoop.hbase.client.TestSnapshotCloneIndependence.runTestSnapshotAppendIndependent(TestSnapshotCloneIndependence.java:232)
	at org.apache.hadoop.hbase.client.TestSnapshotCloneIndependence.testOfflineSnapshotAppendIndependent(TestSnapshotCloneIndependence.java:137)

testOfflineSnapshotRegionOperationsIndependent(org.apache.hadoop.hbase.client.TestSnapshotCloneIndependence)
 Time elapsed: 10.057 sec  <<< ERROR!
org.apache.hadoop.hbase.snapshot.RestoreSnapshotException: org.apache.hadoop.hbase.snapshot.RestoreSnapshotException:
clone snapshot={ ss=snapshot_test1463850070993 table=test1463850070993 type=DISABLED } failed
because java.util.concurrent.ExecutionException: org.apache.hadoop.ipc.RemoteException: org.apache.hadoop.hdfs.server.namenode.LeaseExpiredException:
No lease on /user/jenkins/hbase/archive/data/default/test1463850070993/c21a2e39bf79ab2d5a293c84e972037e/fam/.links-1646afc78d5d49bea3704bb9163d1c30/6b27d3af75f364a0b00e07d58a64c9e6.test-clone-test1463850070993
File does not exist. Holder DFSClient_NONMAPREDUCE_-1511226420_1 does not have any open files
	at org.apache.hadoop.hbase.ipc.RpcClient.call(RpcClient.java:1491)
	at org.apache.hadoop.hbase.ipc.RpcClient.callBlockingMethod(RpcClient.java:1693)
	at org.apache.hadoop.hbase.ipc.RpcClient$BlockingRpcChannelImplementation.callBlockingMethod(RpcClient.java:1763)
	at org.apache.hadoop.hbase.protobuf.generated.MasterProtos$MasterService$BlockingStub.isRestoreSnapshotDone(MasterProtos.java:46686)
	at org.apache.hadoop.hbase.client.HConnectionManager$HConnectionImplementation$5.isRestoreSnapshotDone(HConnectionManager.java:2168)
	at org.apache.hadoop.hbase.client.HBaseAdmin$30.call(HBaseAdmin.java:3222)
	at org.apache.hadoop.hbase.client.HBaseAdmin$30.call(HBaseAdmin.java:3219)
	at org.apache.hadoop.hbase.client.RpcRetryingCaller.callWithRetries(RpcRetryingCaller.java:115)
	at org.apache.hadoop.hbase.client.RpcRetryingCaller.callWithRetries(RpcRetryingCaller.java:91)
	at org.apache.hadoop.hbase.client.HBaseAdmin.executeCallable(HBaseAdmin.java:3479)
	at org.apache.hadoop.hbase.client.HBaseAdmin.internalRestoreSnapshot(HBaseAdmin.java:3218)
	at org.apache.hadoop.hbase.client.HBaseAdmin.cloneSnapshot(HBaseAdmin.java:3080)
	at org.apache.hadoop.hbase.client.HBaseAdmin.cloneSnapshot(HBaseAdmin.java:3030)
	at org.apache.hadoop.hbase.client.TestSnapshotCloneIndependence.runTestRegionOperationsIndependent(TestSnapshotCloneIndependence.java:311)
	at org.apache.hadoop.hbase.client.TestSnapshotCloneIndependence.testOfflineSnapshotRegionOperationsIndependent(TestSnapshotCloneIndependence.java:164)

Running org.apache.hadoop.hbase.client.TestSnapshotFromClient
Tests run: 9, Failures: 0, Errors: 0, Skipped: 0, Time elapsed: 75.525 sec - in org.apache.hadoop.hbase.client.TestSnapshotFromClient
Running org.apache.hadoop.hbase.client.TestHTablePool$TestHTableThreadLocalPool
Tests run: 9, Failures: 0, Errors: 0, Skipped: 0, Time elapsed: 6.477 sec - in org.apache.hadoop.hbase.client.TestHTablePool$TestHTableThreadLocalPool
Running org.apache.hadoop.hbase.client.TestHCM
Tests run: 15, Failures: 0, Errors: 0, Skipped: 3, Time elapsed: 56.837 sec - in org.apache.hadoop.hbase.client.TestHCM
Running org.apache.hadoop.hbase.client.TestAdmin2
Tests run: 24, Failures: 0, Errors: 0, Skipped: 0, Time elapsed: 86.44 sec - in org.apache.hadoop.hbase.client.TestAdmin2
Running org.apache.hadoop.hbase.client.TestClientTimeouts
Tests run: 1, Failures: 0, Errors: 0, Skipped: 0, Time elapsed: 5.103 sec - in org.apache.hadoop.hbase.client.TestClientTimeouts
Running org.apache.hadoop.hbase.client.replication.TestReplicationAdminWithTwoDifferentZKClusters
Tests run: 2, Failures: 0, Errors: 0, Skipped: 0, Time elapsed: 20.279 sec - in org.apache.hadoop.hbase.client.replication.TestReplicationAdminWithTwoDifferentZKClusters
Running org.apache.hadoop.hbase.client.replication.TestReplicationAdmin
Tests run: 4, Failures: 0, Errors: 0, Skipped: 0, Time elapsed: 0.776 sec - in org.apache.hadoop.hbase.client.replication.TestReplicationAdmin
Running org.apache.hadoop.hbase.client.replication.TestReplicationAdminWithClusters
Tests run: 9, Failures: 0, Errors: 0, Skipped: 0, Time elapsed: 34.455 sec - in org.apache.hadoop.hbase.client.replication.TestReplicationAdminWithClusters
Running org.apache.hadoop.hbase.client.TestScannerTimeout
Tests run: 4, Failures: 0, Errors: 0, Skipped: 0, Time elapsed: 46.71 sec - in org.apache.hadoop.hbase.client.TestScannerTimeout
Running org.apache.hadoop.hbase.client.TestFromClientSideNoCodec
Tests run: 2, Failures: 0, Errors: 0, Skipped: 0, Time elapsed: 5.21 sec - in org.apache.hadoop.hbase.client.TestFromClientSideNoCodec
Running org.apache.hadoop.hbase.client.TestLeaseRenewal
Tests run: 1, Failures: 0, Errors: 0, Skipped: 0, Time elapsed: 28.775 sec - in org.apache.hadoop.hbase.client.TestLeaseRenewal
Running org.apache.hadoop.hbase.client.TestScannersFromClientSide
Tests run: 7, Failures: 0, Errors: 0, Skipped: 0, Time elapsed: 15.811 sec - in org.apache.hadoop.hbase.client.TestScannersFromClientSide
Running org.apache.hadoop.hbase.client.TestHTableUtil
Tests run: 2, Failures: 0, Errors: 0, Skipped: 0, Time elapsed: 5.244 sec - in org.apache.hadoop.hbase.client.TestHTableUtil
Running org.apache.hadoop.hbase.client.TestFromClientSide
Tests run: 81, Failures: 0, Errors: 0, Skipped: 4, Time elapsed: 200.821 sec - in org.apache.hadoop.hbase.client.TestFromClientSide
Running org.apache.hadoop.hbase.client.TestCheckAndMutate
Tests run: 1, Failures: 0, Errors: 0, Skipped: 0, Time elapsed: 3.974 sec - in org.apache.hadoop.hbase.client.TestCheckAndMutate
Running org.apache.hadoop.hbase.client.TestHTableMultiplexerFlushCache
Tests run: 1, Failures: 0, Errors: 0, Skipped: 0, Time elapsed: 8.735 sec - in org.apache.hadoop.hbase.client.TestHTableMultiplexerFlushCache
Running org.apache.hadoop.hbase.client.TestTimestampsFilter
Tests run: 3, Failures: 0, Errors: 0, Skipped: 0, Time elapsed: 13.778 sec - in org.apache.hadoop.hbase.client.TestTimestampsFilter
Running org.apache.hadoop.hbase.client.TestResultSizeEstimation
Tests run: 2, Failures: 0, Errors: 0, Skipped: 0, Time elapsed: 6.975 sec - in org.apache.hadoop.hbase.client.TestResultSizeEstimation
Running org.apache.hadoop.hbase.client.TestClientPushback
Tests run: 2, Failures: 0, Errors: 0, Skipped: 0, Time elapsed: 6.086 sec - in org.apache.hadoop.hbase.client.TestClientPushback
Running org.apache.hadoop.hbase.client.TestConnectionImplementation
Tests run: 2, Failures: 0, Errors: 0, Skipped: 0, Time elapsed: 4.028 sec - in org.apache.hadoop.hbase.client.TestConnectionImplementation
Running org.apache.hadoop.hbase.client.TestTableSnapshotScanner
Build timed out (after 300 minutes). Marking the build as failed.
Build was aborted
Performing Post build task...
Match found for :.* : True
Logical operation result is TRUE
Running script  : # Post-build task script. TODO: Check this in and have all builds reference
check-in.
pwd && ls
# NOTE!!!! The below code has been copied and pasted from ./dev-tools/run-test.sh
# Do not change here without syncing there and vice-versa.
ZOMBIE_TESTS_COUNT=`jps -v | grep surefirebooter | grep -e '-Dhbase.test' | wc -l`
if [[ $ZOMBIE_TESTS_COUNT != 0 ]] ; then
 echo "Suspicious java process found - waiting 30s to see if there are just slow to stop"
 sleep 30
 ZOMBIE_TESTS_COUNT=`jps -v | grep surefirebooter | grep -e '-Dhbase.test' | wc -l`
 if [[ $ZOMBIE_TESTS_COUNT != 0 ]] ; then
   echo " {color:red}There appear to be $ZOMBIE_TESTS_COUNT zombie tests{color}, they should
have been killed by surefire but survived"
   jps -v | grep surefirebooter | grep -e '-Dhbase.test'
   jps -v | grep surefirebooter | grep -e '-Dhbase.test' | cut -d ' ' -f 1 | xargs -n 1 jstack
   # Exit with error
   exit 1
 else
   echo "We're ok: there is no zombie test, but some tests took some time to stop"
 fi
else
  echo "We're ok: there is no zombie test"
fi
[HBase-0.98-on-Hadoop-1.1] $ /bin/bash -xe /tmp/hudson2395750709248059894.sh
+ pwd
<https://builds.apache.org/job/HBase-0.98-on-Hadoop-1.1/ws/>
+ ls
bin
CHANGES.txt
conf
dev-support
hbase-annotations
hbase-assembly
hbase-checkstyle
hbase-client
hbase-common
hbase-examples
hbase-hadoop1-compat
hbase-hadoop2-compat
hbase-hadoop-compat
hbase-it
hbase-prefix-tree
hbase-protocol
hbase-resource-bundle
hbase-rest
hbase-server
hbase-shell
hbase-testing-util
hbase-thrift
LICENSE.txt
NOTICE.txt
pom.xml
README.txt
src
target
++ jps -v
++ grep surefirebooter
++ grep -e -Dhbase.test
++ wc -l
+ ZOMBIE_TESTS_COUNT=0
+ [[ 0 != 0 ]]
+ echo 'We'\''re ok: there is no zombie test'
We're ok: there is no zombie test
POST BUILD TASK : SUCCESS
END OF POST BUILD TASK : 0
Archiving artifacts
Recording test results
Updating HBASE-15856

Mime
View raw message