hbase-builds mailing list archives

Site index · List index
Message view « Date » · « Thread »
Top « Date » · « Thread »
From Apache Jenkins Server <jenk...@builds.apache.org>
Subject Build failed in Jenkins: HBase-Trunk_matrix » latest1.7,yahoo-not-h2 #936
Date Fri, 20 May 2016 19:19:00 GMT
See <https://builds.apache.org/job/HBase-Trunk_matrix/jdk=latest1.7,label=yahoo-not-h2/936/changes>

Changes:

[matteo.bertozzi] HBASE-15864 Reuse the testing helper to wait regions in transition

[matteo.bertozzi] HBASE-15865 Move TestTableDeleteFamilyHandler and

[tedyu] HBASE-15529 Override needBalance in StochasticLoadBalancer (Guanghao

[Gary Helmling] HBASE-15856 Don't cache unresolved addresses for connections

------------------------------------------
[...truncated 5588 lines...]
Tests run: 1, Failures: 0, Errors: 0, Skipped: 0, Time elapsed: 2.617 sec - in org.apache.hadoop.hbase.security.visibility.TestVisibilityLabelsWithSLGStack
Tests run: 5, Failures: 0, Errors: 0, Skipped: 0, Time elapsed: 7.881 sec - in org.apache.hadoop.hbase.security.visibility.TestVisibilityLabelsWithACL
Running org.apache.hadoop.hbase.security.visibility.TestVisibilityLablesWithGroups
Running org.apache.hadoop.hbase.security.visibility.TestVisibilityLabelsWithDefaultVisLabelService
Running org.apache.hadoop.hbase.security.visibility.TestVisibilityWithCheckAuths
Tests run: 1, Failures: 0, Errors: 0, Skipped: 0, Time elapsed: 2.715 sec - in org.apache.hadoop.hbase.security.visibility.TestVisibilityLablesWithGroups
Running org.apache.hadoop.hbase.security.visibility.TestWithDisabledAuthorization
Tests run: 2, Failures: 0, Errors: 0, Skipped: 0, Time elapsed: 4.793 sec - in org.apache.hadoop.hbase.security.visibility.TestVisibilityWithCheckAuths
Tests run: 2, Failures: 0, Errors: 0, Skipped: 0, Time elapsed: 3.449 sec - in org.apache.hadoop.hbase.security.visibility.TestWithDisabledAuthorization
Running org.apache.hadoop.hbase.backup.example.TestZooKeeperTableArchiveClient
Running org.apache.hadoop.hbase.security.visibility.TestVisibilityLabelsWithCustomVisLabService
Tests run: 3, Failures: 0, Errors: 0, Skipped: 0, Time elapsed: 7.024 sec - in org.apache.hadoop.hbase.backup.example.TestZooKeeperTableArchiveClient
Running org.apache.hadoop.hbase.TestHColumnDescriptorDefaultVersions
Running org.apache.hadoop.hbase.backup.TestHFileArchiving
Tests run: 26, Failures: 0, Errors: 0, Skipped: 0, Time elapsed: 45.52 sec - in org.apache.hadoop.hbase.security.visibility.TestVisibilityLabelsWithDefaultVisLabelService
Tests run: 21, Failures: 0, Errors: 0, Skipped: 0, Time elapsed: 29.919 sec - in org.apache.hadoop.hbase.security.visibility.TestVisibilityLabelsWithCustomVisLabService
Running org.apache.hadoop.hbase.filter.TestScanRowPrefix
Tests run: 4, Failures: 0, Errors: 0, Skipped: 0, Time elapsed: 26.863 sec - in org.apache.hadoop.hbase.TestHColumnDescriptorDefaultVersions
Tests run: 1, Failures: 0, Errors: 0, Skipped: 0, Time elapsed: 5.572 sec - in org.apache.hadoop.hbase.filter.TestScanRowPrefix
Running org.apache.hadoop.hbase.filter.TestFilterListOrOperatorWithBlkCnt
Running org.apache.hadoop.hbase.filter.TestFuzzyRowAndColumnRangeFilter
Running org.apache.hadoop.hbase.filter.TestFuzzyRowFilterEndToEnd
Tests run: 1, Failures: 0, Errors: 0, Skipped: 0, Time elapsed: 3.114 sec - in org.apache.hadoop.hbase.filter.TestFuzzyRowAndColumnRangeFilter
Tests run: 44, Failures: 0, Errors: 0, Skipped: 0, Time elapsed: 115.425 sec - in org.apache.hadoop.hbase.security.visibility.TestVisibilityLabelsWithDeletes
Tests run: 1, Failures: 0, Errors: 0, Skipped: 0, Time elapsed: 17.271 sec - in org.apache.hadoop.hbase.filter.TestFilterListOrOperatorWithBlkCnt
Running org.apache.hadoop.hbase.filter.TestFilterWrapper
Running org.apache.hadoop.hbase.filter.TestMultiRowRangeFilter
Tests run: 1, Failures: 0, Errors: 0, Skipped: 0, Time elapsed: 3.202 sec - in org.apache.hadoop.hbase.filter.TestFilterWrapper
Running org.apache.hadoop.hbase.filter.TestColumnRangeFilter
Tests run: 1, Failures: 0, Errors: 0, Skipped: 0, Time elapsed: 6.876 sec - in org.apache.hadoop.hbase.filter.TestColumnRangeFilter
Running org.apache.hadoop.hbase.filter.TestFilterWithScanLimits
Tests run: 20, Failures: 0, Errors: 0, Skipped: 0, Time elapsed: 18.511 sec - in org.apache.hadoop.hbase.filter.TestMultiRowRangeFilter
Running org.apache.hadoop.hbase.constraint.TestConstraint
Running org.apache.hadoop.hbase.trace.TestHTraceHooks
Tests run: 1, Failures: 0, Errors: 0, Skipped: 0, Time elapsed: 2.706 sec - in org.apache.hadoop.hbase.trace.TestHTraceHooks
Running org.apache.hadoop.hbase.TestLocalHBaseCluster
Tests run: 5, Failures: 0, Errors: 0, Skipped: 0, Time elapsed: 94.286 sec - in org.apache.hadoop.hbase.backup.TestHFileArchiving
Tests run: 5, Failures: 0, Errors: 0, Skipped: 0, Time elapsed: 21.614 sec - in org.apache.hadoop.hbase.constraint.TestConstraint
Tests run: 1, Failures: 0, Errors: 0, Skipped: 0, Time elapsed: 11.368 sec - in org.apache.hadoop.hbase.TestLocalHBaseCluster
Running org.apache.hadoop.hbase.quotas.TestQuotaThrottle
Running org.apache.hadoop.hbase.quotas.TestQuotaTableUtil
Running org.apache.hadoop.hbase.quotas.TestQuotaAdmin
Tests run: 3, Failures: 0, Errors: 0, Skipped: 0, Time elapsed: 1.973 sec - in org.apache.hadoop.hbase.quotas.TestQuotaTableUtil
Running org.apache.hadoop.hbase.TestHBaseOnOtherDfsCluster
Tests run: 3, Failures: 0, Errors: 0, Skipped: 0, Time elapsed: 3.863 sec - in org.apache.hadoop.hbase.quotas.TestQuotaAdmin
Tests run: 1, Failures: 0, Errors: 0, Skipped: 0, Time elapsed: 52.273 sec - in org.apache.hadoop.hbase.filter.TestFilterWithScanLimits
Running org.apache.hadoop.hbase.wal.TestWALSplitCompressed
Running org.apache.hadoop.hbase.wal.TestWALReaderOnSecureWAL
Tests run: 2, Failures: 0, Errors: 0, Skipped: 0, Time elapsed: 2.008 sec - in org.apache.hadoop.hbase.wal.TestWALReaderOnSecureWAL
Tests run: 1, Failures: 0, Errors: 0, Skipped: 0, Time elapsed: 13.741 sec - in org.apache.hadoop.hbase.TestHBaseOnOtherDfsCluster
Tests run: 12, Failures: 0, Errors: 0, Skipped: 0, Time elapsed: 25.273 sec - in org.apache.hadoop.hbase.quotas.TestQuotaThrottle
Running org.apache.hadoop.hbase.wal.TestWALFactory
Running org.apache.hadoop.hbase.wal.TestWALSplit
Running org.apache.hadoop.hbase.wal.TestBoundedRegionGroupingStrategy
Tests run: 9, Failures: 0, Errors: 0, Skipped: 0, Time elapsed: 12.249 sec - in org.apache.hadoop.hbase.wal.TestWALFactory
Running org.apache.hadoop.hbase.wal.TestDefaultWALProviderWithHLogKey
Tests run: 5, Failures: 0, Errors: 0, Skipped: 0, Time elapsed: 10.795 sec - in org.apache.hadoop.hbase.wal.TestDefaultWALProviderWithHLogKey
Running org.apache.hadoop.hbase.wal.TestSecureWAL
Tests run: 2, Failures: 0, Errors: 0, Skipped: 0, Time elapsed: 2.412 sec - in org.apache.hadoop.hbase.wal.TestSecureWAL
Running org.apache.hadoop.hbase.wal.TestFSHLogProvider
Tests run: 10, Failures: 0, Errors: 0, Skipped: 0, Time elapsed: 43.604 sec - in org.apache.hadoop.hbase.wal.TestBoundedRegionGroupingStrategy
Running org.apache.hadoop.hbase.wal.TestWALFiltering
Tests run: 5, Failures: 0, Errors: 0, Skipped: 0, Time elapsed: 7.295 sec - in org.apache.hadoop.hbase.wal.TestFSHLogProvider
Running org.apache.hadoop.hbase.TestMovedRegionsCleaner
Tests run: 1, Failures: 0, Errors: 0, Skipped: 0, Time elapsed: 10.956 sec - in org.apache.hadoop.hbase.TestMovedRegionsCleaner
Tests run: 32, Failures: 0, Errors: 0, Skipped: 0, Time elapsed: 83.403 sec - in org.apache.hadoop.hbase.wal.TestWALSplitCompressed
Tests run: 1, Failures: 0, Errors: 0, Skipped: 0, Time elapsed: 27.469 sec - in org.apache.hadoop.hbase.wal.TestWALFiltering
Tests run: 32, Failures: 0, Errors: 0, Skipped: 0, Time elapsed: 82.13 sec - in org.apache.hadoop.hbase.wal.TestWALSplit
Running org.apache.hadoop.hbase.replication.TestReplicationSyncUpTool
Running org.apache.hadoop.hbase.replication.multiwal.TestReplicationSyncUpToolWithMultipleWAL
Running org.apache.hadoop.hbase.replication.multiwal.TestReplicationEndpointWithMultipleAsyncWAL
Running org.apache.hadoop.hbase.replication.multiwal.TestReplicationSyncUpToolWithMultipleAsyncWAL
Tests run: 4, Failures: 0, Errors: 0, Skipped: 0, Time elapsed: 10.348 sec - in org.apache.hadoop.hbase.replication.multiwal.TestReplicationEndpointWithMultipleAsyncWAL
Running org.apache.hadoop.hbase.replication.multiwal.TestReplicationKillMasterRSCompressedWithMultipleWAL
Tests run: 1, Failures: 0, Errors: 0, Skipped: 0, Time elapsed: 53.49 sec - in org.apache.hadoop.hbase.replication.TestReplicationSyncUpTool
Tests run: 1, Failures: 0, Errors: 0, Skipped: 0, Time elapsed: 52.319 sec - in org.apache.hadoop.hbase.replication.multiwal.TestReplicationSyncUpToolWithMultipleWAL
Tests run: 1, Failures: 0, Errors: 0, Skipped: 0, Time elapsed: 17.996 sec - in org.apache.hadoop.hbase.replication.multiwal.TestReplicationKillMasterRSCompressedWithMultipleWAL
Running org.apache.hadoop.hbase.replication.regionserver.TestReplicationSink
Running org.apache.hadoop.hbase.replication.multiwal.TestReplicationKillMasterRSCompressedWithMultipleAsyncWAL
Tests run: 1, Failures: 0, Errors: 0, Skipped: 0, Time elapsed: 63.079 sec - in org.apache.hadoop.hbase.replication.multiwal.TestReplicationSyncUpToolWithMultipleAsyncWAL
Running org.apache.hadoop.hbase.replication.TestReplicationKillSlaveRS
Tests run: 6, Failures: 0, Errors: 0, Skipped: 0, Time elapsed: 5.917 sec - in org.apache.hadoop.hbase.replication.regionserver.TestReplicationSink
Running org.apache.hadoop.hbase.replication.regionserver.TestReplicationWALReaderManager
Running org.apache.hadoop.hbase.replication.regionserver.TestRegionReplicaReplicationEndpoint
Tests run: 1, Failures: 0, Errors: 0, Skipped: 0, Time elapsed: 19.28 sec - in org.apache.hadoop.hbase.replication.TestReplicationKillSlaveRS
Tests run: 1, Failures: 0, Errors: 0, Skipped: 0, Time elapsed: 23.339 sec - in org.apache.hadoop.hbase.replication.multiwal.TestReplicationKillMasterRSCompressedWithMultipleAsyncWAL
Running org.apache.hadoop.hbase.replication.regionserver.TestReplicationSourceManager
Tests run: 7, Failures: 0, Errors: 0, Skipped: 0, Time elapsed: 4.118 sec - in org.apache.hadoop.hbase.replication.regionserver.TestReplicationSourceManager
Running org.apache.hadoop.hbase.replication.regionserver.TestRegionReplicaReplicationEndpointNoMaster
Tests run: 4, Failures: 0, Errors: 0, Skipped: 0, Time elapsed: 311.988 sec - in org.apache.hadoop.hbase.filter.TestFuzzyRowFilterEndToEnd
Running org.apache.hadoop.hbase.replication.TestPerTableCFReplication
Running org.apache.hadoop.hbase.replication.TestReplicationChangingPeerRegionservers
Tests run: 1, Failures: 0, Errors: 0, Skipped: 0, Time elapsed: 6.475 sec - in org.apache.hadoop.hbase.replication.TestReplicationChangingPeerRegionservers
Tests run: 4, Failures: 0, Errors: 0, Skipped: 0, Time elapsed: 47.7 sec - in org.apache.hadoop.hbase.replication.regionserver.TestRegionReplicaReplicationEndpointNoMaster
Tests run: 3, Failures: 0, Errors: 0, Skipped: 0, Time elapsed: 35.737 sec - in org.apache.hadoop.hbase.replication.TestPerTableCFReplication
Running org.apache.hadoop.hbase.replication.TestReplicationStateZKImpl
Tests run: 9, Failures: 0, Errors: 0, Skipped: 0, Time elapsed: 1.816 sec - in org.apache.hadoop.hbase.replication.TestReplicationStateZKImpl
Running org.apache.hadoop.hbase.replication.TestMultiSlaveReplication
Running org.apache.hadoop.hbase.replication.TestReplicationKillMasterRS
Running org.apache.hadoop.hbase.replication.TestReplicationKillMasterRSCompressed
Tests run: 9, Failures: 0, Errors: 0, Skipped: 0, Time elapsed: 103.023 sec - in org.apache.hadoop.hbase.replication.regionserver.TestRegionReplicaReplicationEndpoint
Tests run: 1, Failures: 0, Errors: 0, Skipped: 0, Time elapsed: 23.177 sec - in org.apache.hadoop.hbase.replication.TestReplicationKillMasterRS
Tests run: 1, Failures: 0, Errors: 0, Skipped: 0, Time elapsed: 36.961 sec - in org.apache.hadoop.hbase.replication.TestMultiSlaveReplication
Tests run: 1, Failures: 0, Errors: 0, Skipped: 0, Time elapsed: 22.761 sec - in org.apache.hadoop.hbase.replication.TestReplicationKillMasterRSCompressed
Running org.apache.hadoop.hbase.replication.TestReplicationSource
Tests run: 1, Failures: 0, Errors: 0, Skipped: 0, Time elapsed: 0.244 sec - in org.apache.hadoop.hbase.replication.TestReplicationSource
Running org.apache.hadoop.hbase.replication.TestReplicationTrackerZKImpl
Running org.apache.hadoop.hbase.replication.TestReplicationWithTags
Tests run: 5, Failures: 0, Errors: 0, Skipped: 0, Time elapsed: 1.246 sec - in org.apache.hadoop.hbase.replication.TestReplicationTrackerZKImpl
Tests run: 1, Failures: 0, Errors: 0, Skipped: 0, Time elapsed: 2.879 sec - in org.apache.hadoop.hbase.replication.TestReplicationWithTags
Running org.apache.hadoop.hbase.replication.TestReplicationSmallTests
Running org.apache.hadoop.hbase.replication.TestReplicationDisableInactivePeer
Running org.apache.hadoop.hbase.replication.TestReplicationEndpoint
Running org.apache.hadoop.hbase.replication.TestReplicationSyncUpToolWithBulkLoadedData
Tests run: 4, Failures: 0, Errors: 0, Skipped: 0, Time elapsed: 10.322 sec - in org.apache.hadoop.hbase.replication.TestReplicationEndpoint
Tests run: 1, Failures: 0, Errors: 0, Skipped: 0, Time elapsed: 20.76 sec - in org.apache.hadoop.hbase.replication.TestReplicationDisableInactivePeer
Running org.apache.hadoop.hbase.coprocessor.TestMasterCoprocessorExceptionWithRemove
Running org.apache.hadoop.hbase.coprocessor.TestWALObserver
Tests run: 1, Failures: 0, Errors: 0, Skipped: 0, Time elapsed: 5.629 sec - in org.apache.hadoop.hbase.coprocessor.TestMasterCoprocessorExceptionWithRemove
Tests run: 7, Failures: 0, Errors: 0, Skipped: 0, Time elapsed: 8.421 sec - in org.apache.hadoop.hbase.coprocessor.TestWALObserver
Running org.apache.hadoop.hbase.coprocessor.TestRegionObserverInterface
Tests run: 1, Failures: 0, Errors: 0, Skipped: 0, Time elapsed: 37.589 sec - in org.apache.hadoop.hbase.replication.TestReplicationSyncUpToolWithBulkLoadedData
Running org.apache.hadoop.hbase.coprocessor.TestRegionServerObserver
Running org.apache.hadoop.hbase.coprocessor.TestBatchCoprocessorEndpoint
Tests run: 4, Failures: 0, Errors: 0, Skipped: 0, Time elapsed: 1.685 sec - in org.apache.hadoop.hbase.coprocessor.TestBatchCoprocessorEndpoint
Tests run: 1, Failures: 0, Errors: 0, Skipped: 0, Time elapsed: 19.696 sec - in org.apache.hadoop.hbase.coprocessor.TestRegionServerObserver
Running org.apache.hadoop.hbase.coprocessor.TestDoubleColumnInterpreter
Tests run: 14, Failures: 0, Errors: 0, Skipped: 0, Time elapsed: 79.981 sec - in org.apache.hadoop.hbase.replication.TestReplicationSmallTests
Tests run: 38, Failures: 0, Errors: 0, Skipped: 0, Time elapsed: 5.188 sec - in org.apache.hadoop.hbase.coprocessor.TestDoubleColumnInterpreter
Running org.apache.hadoop.hbase.coprocessor.TestRegionObserverScannerOpenHook
Running org.apache.hadoop.hbase.coprocessor.TestHTableWrapper
Tests run: 1, Failures: 0, Errors: 0, Skipped: 0, Time elapsed: 5.884 sec - in org.apache.hadoop.hbase.coprocessor.TestHTableWrapper
Tests run: 8, Failures: 0, Errors: 0, Skipped: 0, Time elapsed: 240.656 sec - in org.apache.hadoop.hbase.replication.regionserver.TestReplicationWALReaderManager
Running org.apache.hadoop.hbase.coprocessor.TestAggregateProtocol
Tests run: 3, Failures: 0, Errors: 0, Skipped: 0, Time elapsed: 14.508 sec - in org.apache.hadoop.hbase.coprocessor.TestRegionObserverScannerOpenHook
Tests run: 44, Failures: 0, Errors: 0, Skipped: 0, Time elapsed: 5.468 sec - in org.apache.hadoop.hbase.coprocessor.TestAggregateProtocol
Running org.apache.hadoop.hbase.coprocessor.TestCoprocessorStop
Running org.apache.hadoop.hbase.coprocessor.TestMasterCoprocessorExceptionWithAbort
Running org.apache.hadoop.hbase.coprocessor.TestMasterObserver
Running org.apache.hadoop.hbase.coprocessor.TestOpenTableInCoprocessor
Tests run: 1, Failures: 0, Errors: 0, Skipped: 0, Time elapsed: 16.647 sec - in org.apache.hadoop.hbase.coprocessor.TestCoprocessorStop
Tests run: 1, Failures: 0, Errors: 0, Skipped: 0, Time elapsed: 17.086 sec - in org.apache.hadoop.hbase.coprocessor.TestMasterCoprocessorExceptionWithAbort
Tests run: 14, Failures: 0, Errors: 0, Skipped: 2, Time elapsed: 72.448 sec - in org.apache.hadoop.hbase.coprocessor.TestRegionObserverInterface
Running org.apache.hadoop.hbase.coprocessor.TestRegionServerCoprocessorExceptionWithAbort
Tests run: 2, Failures: 0, Errors: 0, Skipped: 0, Time elapsed: 16.413 sec - in org.apache.hadoop.hbase.coprocessor.TestOpenTableInCoprocessor
Running org.apache.hadoop.hbase.coprocessor.TestRegionServerCoprocessorEndpoint
Tests run: 2, Failures: 0, Errors: 0, Skipped: 0, Time elapsed: 1.251 sec - in org.apache.hadoop.hbase.coprocessor.TestRegionServerCoprocessorEndpoint
Running org.apache.hadoop.hbase.coprocessor.TestCoprocessorTableEndpoint
Running org.apache.hadoop.hbase.coprocessor.TestCoprocessorEndpoint
Tests run: 2, Failures: 0, Errors: 0, Skipped: 0, Time elapsed: 20.065 sec - in org.apache.hadoop.hbase.coprocessor.TestRegionServerCoprocessorExceptionWithAbort
Tests run: 2, Failures: 0, Errors: 0, Skipped: 0, Time elapsed: 9.62 sec - in org.apache.hadoop.hbase.coprocessor.TestCoprocessorTableEndpoint
Running org.apache.hadoop.hbase.coprocessor.TestBigDecimalColumnInterpreter
Tests run: 6, Failures: 0, Errors: 0, Skipped: 0, Time elapsed: 6.138 sec - in org.apache.hadoop.hbase.coprocessor.TestCoprocessorEndpoint
Tests run: 9, Failures: 0, Errors: 0, Skipped: 0, Time elapsed: 39.274 sec - in org.apache.hadoop.hbase.coprocessor.TestMasterObserver
Running org.apache.hadoop.hbase.TestStochasticBalancerJmxMetrics
Tests run: 1, Failures: 0, Errors: 0, Skipped: 1, Time elapsed: 0.002 sec - in org.apache.hadoop.hbase.TestStochasticBalancerJmxMetrics
Tests run: 38, Failures: 0, Errors: 0, Skipped: 0, Time elapsed: 5.226 sec - in org.apache.hadoop.hbase.coprocessor.TestBigDecimalColumnInterpreter
Running org.apache.hadoop.hbase.TestMetaTableLocator
Running org.apache.hadoop.hbase.coprocessor.TestClassLoading
Tests run: 7, Failures: 0, Errors: 0, Skipped: 0, Time elapsed: 3.574 sec - in org.apache.hadoop.hbase.TestMetaTableLocator
Running org.apache.hadoop.hbase.coprocessor.TestRegionObserverBypass
Running org.apache.hadoop.hbase.TestHBaseTestingUtility
Running org.apache.hadoop.hbase.coprocessor.TestRegionServerCoprocessorExceptionWithRemove
Running org.apache.hadoop.hbase.TestJMXListener
Tests run: 2, Failures: 0, Errors: 0, Skipped: 0, Time elapsed: 8.412 sec - in org.apache.hadoop.hbase.coprocessor.TestRegionObserverBypass
Tests run: 1, Failures: 0, Errors: 0, Skipped: 0, Time elapsed: 15.591 sec - in org.apache.hadoop.hbase.coprocessor.TestRegionServerCoprocessorExceptionWithRemove
Running org.apache.hadoop.hbase.namespace.TestNamespaceAuditor
Tests run: 2, Failures: 0, Errors: 0, Skipped: 0, Time elapsed: 16.333 sec - in org.apache.hadoop.hbase.TestJMXListener
Tests run: 9, Failures: 0, Errors: 0, Skipped: 0, Time elapsed: 29.423 sec - in org.apache.hadoop.hbase.coprocessor.TestClassLoading
Tests run: 12, Failures: 0, Errors: 0, Skipped: 0, Time elapsed: 53.383 sec - in org.apache.hadoop.hbase.TestHBaseTestingUtility
Tests run: 12, Failures: 0, Errors: 0, Skipped: 0, Time elapsed: 123.66 sec - in org.apache.hadoop.hbase.namespace.TestNamespaceAuditor

Results :

Failed tests: 
  TestRegionRebalancing.testRebalanceOnRegionServerNumberChange:120->assertRegionsAreBalanced:229
After 5 attempts, region assignments were not balanced.

Tests run: 2852, Failures: 1, Errors: 0, Skipped: 63

[INFO] ------------------------------------------------------------------------
[INFO] Reactor Summary:
[INFO] 
[INFO] Apache HBase ...................................... SUCCESS [  2.686 s]
[INFO] Apache HBase - Checkstyle ......................... SUCCESS [  0.739 s]
[INFO] Apache HBase - Resource Bundle .................... SUCCESS [  0.253 s]
[INFO] Apache HBase - Annotations ........................ SUCCESS [  0.255 s]
[INFO] Apache HBase - Protocol ........................... SUCCESS [  3.106 s]
[INFO] Apache HBase - Common ............................. SUCCESS [01:07 min]
[INFO] Apache HBase - Procedure .......................... SUCCESS [01:31 min]
[INFO] Apache HBase - Client ............................. SUCCESS [ 40.399 s]
[INFO] Apache HBase - Hadoop Compatibility ............... SUCCESS [  7.471 s]
[INFO] Apache HBase - Hadoop Two Compatibility ........... SUCCESS [  9.375 s]
[INFO] Apache HBase - Prefix Tree ........................ SUCCESS [ 10.464 s]
[INFO] Apache HBase - Server ............................. FAILURE [  01:27 h]
[INFO] Apache HBase - Testing Util ....................... SKIPPED
[INFO] Apache HBase - Thrift ............................. SKIPPED
[INFO] Apache HBase - RSGroup ............................ SKIPPED
[INFO] Apache HBase - Shell .............................. SKIPPED
[INFO] Apache HBase - Integration Tests .................. SKIPPED
[INFO] Apache HBase - Examples ........................... SKIPPED
[INFO] Apache HBase - Rest ............................... SKIPPED
[INFO] Apache HBase - External Block Cache ............... SKIPPED
[INFO] Apache HBase - Spark .............................. SKIPPED
[INFO] Apache HBase - Assembly ........................... SKIPPED
[INFO] Apache HBase - Shaded ............................. SKIPPED
[INFO] Apache HBase - Shaded - Client .................... SKIPPED
[INFO] Apache HBase - Shaded - Server .................... SKIPPED
[INFO] Apache HBase - Archetypes ......................... SKIPPED
[INFO] Apache HBase - Exemplar for hbase-client archetype  SKIPPED
[INFO] Apache HBase - Exemplar for hbase-shaded-client archetype  SKIPPED
[INFO] Apache HBase - Archetype builder .................. SKIPPED
[INFO] ------------------------------------------------------------------------
[INFO] BUILD FAILURE
[INFO] ------------------------------------------------------------------------
[INFO] Total time: 01:31 h
[INFO] Finished at: 2016-05-20T19:14:53+00:00
[INFO] Final Memory: 69M/650M
[INFO] ------------------------------------------------------------------------
[ERROR] Failed to execute goal org.apache.maven.plugins:maven-surefire-plugin:2.18.1:test
(secondPartTestsExecution) on project hbase-server: There are test failures.
[ERROR] 
[ERROR] Please refer to <https://builds.apache.org/job/HBase-Trunk_matrix/jdk=latest1.7,label=yahoo-not-h2/ws/hbase-server/target/surefire-reports>
for the individual test results.
[ERROR] -> [Help 1]
[ERROR] 
[ERROR] To see the full stack trace of the errors, re-run Maven with the -e switch.
[ERROR] Re-run Maven using the -X switch to enable full debug logging.
[ERROR] 
[ERROR] For more information about the errors and possible solutions, please read the following
articles:
[ERROR] [Help 1] http://cwiki.apache.org/confluence/display/MAVEN/MojoFailureException
[ERROR] 
[ERROR] After correcting the problems, you can resume the build with the command
[ERROR]   mvn <goals> -rf :hbase-server
Build step 'Invoke top-level Maven targets' marked build as failure
Performing Post build task...
Match found for :.* : True
Logical operation result is TRUE
Running script  : # Run zombie detector script
./dev-support/zombie-detector.sh --jenkins ${BUILD_ID}
[yahoo-not-h2] $ /bin/bash -xe /tmp/hudson464227041369715316.sh
+ ./dev-support/zombie-detector.sh --jenkins 936
Fri May 20 19:14:55 UTC 2016 We're ok: there is no zombie test


    {color:green}+1 zombies{color}. No zombie tests found running at the end of the build.
POST BUILD TASK : SUCCESS
END OF POST BUILD TASK : 0
Archiving artifacts
Recording test results
[FINDBUGS] Skipping publisher since build result is FAILURE
[CHECKSTYLE] Skipping publisher since build result is FAILURE

Mime
View raw message