hbase-builds mailing list archives

Site index · List index
Message view « Date » · « Thread »
Top « Date » · « Thread »
From Apache Jenkins Server <jenk...@builds.apache.org>
Subject Build failed in Jenkins: HBase-1.4 » latest1.8,yahoo-not-h2 #184
Date Sat, 28 May 2016 13:58:20 GMT
See <https://builds.apache.org/job/HBase-1.4/jdk=latest1.8,label=yahoo-not-h2/184/changes>

Changes:

[stack] HBASE-15890 Allow setting cacheBlocks for TScan

[antonov] HBASE-15908 Checksum verification is broken due to incorrect passing of

------------------------------------------
[...truncated 48104 lines...]
Running org.apache.hadoop.hbase.client.TestTimestampsFilter
Running org.apache.hadoop.hbase.client.TestSplitOrMergeStatus
Tests run: 3, Failures: 0, Errors: 0, Skipped: 0, Time elapsed: 11.682 sec - in org.apache.hadoop.hbase.client.TestTimestampsFilter
Java HotSpot(TM) 64-Bit Server VM warning: ignoring option MaxPermSize=256m; support was removed
in 8.0
Tests run: 8, Failures: 0, Errors: 0, Skipped: 0, Time elapsed: 118.917 sec - in org.apache.hadoop.hbase.client.TestSnapshotCloneIndependence
Java HotSpot(TM) 64-Bit Server VM warning: ignoring option MaxPermSize=256m; support was removed
in 8.0
Tests run: 4, Failures: 0, Errors: 0, Skipped: 0, Time elapsed: 36.264 sec - in org.apache.hadoop.hbase.client.TestSplitOrMergeStatus
Java HotSpot(TM) 64-Bit Server VM warning: ignoring option MaxPermSize=256m; support was removed
in 8.0
Running org.apache.hadoop.hbase.client.TestMetaScanner
Running org.apache.hadoop.hbase.client.TestHTableMultiplexer
Tests run: 1, Failures: 0, Errors: 0, Skipped: 0, Time elapsed: 16.168 sec - in org.apache.hadoop.hbase.client.TestHTableMultiplexer
Java HotSpot(TM) 64-Bit Server VM warning: ignoring option MaxPermSize=256m; support was removed
in 8.0
Tests run: 54, Failures: 0, Errors: 0, Skipped: 1, Time elapsed: 405.749 sec - in org.apache.hadoop.hbase.util.TestHBaseFsck
Java HotSpot(TM) 64-Bit Server VM warning: ignoring option MaxPermSize=256m; support was removed
in 8.0
Running org.apache.hadoop.hbase.client.TestHTablePool$TestHTableReusablePool
Running org.apache.hadoop.hbase.client.TestFastFail
Tests run: 2, Failures: 0, Errors: 0, Skipped: 0, Time elapsed: 68.768 sec - in org.apache.hadoop.hbase.client.TestMetaScanner
Java HotSpot(TM) 64-Bit Server VM warning: ignoring option MaxPermSize=256m; support was removed
in 8.0
Tests run: 2, Failures: 0, Errors: 0, Skipped: 1, Time elapsed: 4.598 sec - in org.apache.hadoop.hbase.client.TestFastFail
Java HotSpot(TM) 64-Bit Server VM warning: ignoring option MaxPermSize=256m; support was removed
in 8.0
Tests run: 9, Failures: 0, Errors: 0, Skipped: 0, Time elapsed: 18.038 sec - in org.apache.hadoop.hbase.client.TestHTablePool$TestHTableReusablePool
Running org.apache.hadoop.hbase.client.TestHTablePool$TestHTableThreadLocalPool
Tests run: 9, Failures: 0, Errors: 0, Skipped: 0, Time elapsed: 8.312 sec - in org.apache.hadoop.hbase.client.TestHTablePool$TestHTableThreadLocalPool
Java HotSpot(TM) 64-Bit Server VM warning: ignoring option MaxPermSize=256m; support was removed
in 8.0
Running org.apache.hadoop.hbase.client.TestMultipleTimestamps
Running org.apache.hadoop.hbase.client.TestCloneSnapshotFromClient
Tests run: 8, Failures: 0, Errors: 0, Skipped: 0, Time elapsed: 21.486 sec - in org.apache.hadoop.hbase.client.TestMultipleTimestamps
Java HotSpot(TM) 64-Bit Server VM warning: ignoring option MaxPermSize=256m; support was removed
in 8.0
Running org.apache.hadoop.hbase.client.TestAdmin1
Running org.apache.hadoop.hbase.client.TestSizeFailures
Tests run: 12, Failures: 0, Errors: 0, Skipped: 0, Time elapsed: 216.827 sec - in org.apache.hadoop.hbase.client.TestMetaWithReplicas
Java HotSpot(TM) 64-Bit Server VM warning: ignoring option MaxPermSize=256m; support was removed
in 8.0
Running org.apache.hadoop.hbase.client.TestHTablePool$TestHTableReusablePool
Tests run: 9, Failures: 0, Errors: 0, Skipped: 0, Time elapsed: 8.257 sec - in org.apache.hadoop.hbase.client.TestHTablePool$TestHTableReusablePool
Java HotSpot(TM) 64-Bit Server VM warning: ignoring option MaxPermSize=256m; support was removed
in 8.0
Running org.apache.hadoop.hbase.client.TestResultSizeEstimation
Tests run: 2, Failures: 0, Errors: 0, Skipped: 0, Time elapsed: 4.876 sec - in org.apache.hadoop.hbase.client.TestResultSizeEstimation
Java HotSpot(TM) 64-Bit Server VM warning: ignoring option MaxPermSize=256m; support was removed
in 8.0
Java HotSpot(TM) 64-Bit Server VM warning: ignoring option MaxPermSize=256m; support was removed
in 8.0
Java HotSpot(TM) 64-Bit Server VM warning: ignoring option MaxPermSize=256m; support was removed
in 8.0
Running org.apache.hadoop.hbase.client.TestTableSnapshotScanner
Running org.apache.hadoop.hbase.client.TestMultiParallel
Tests run: 12, Failures: 0, Errors: 0, Skipped: 1, Time elapsed: 22.469 sec - in org.apache.hadoop.hbase.client.TestMultiParallel
Java HotSpot(TM) 64-Bit Server VM warning: ignoring option MaxPermSize=256m; support was removed
in 8.0
Tests run: 2, Failures: 0, Errors: 0, Skipped: 0, Time elapsed: 92.678 sec - in org.apache.hadoop.hbase.client.TestSizeFailures
Java HotSpot(TM) 64-Bit Server VM warning: ignoring option MaxPermSize=256m; support was removed
in 8.0
Running org.apache.hadoop.hbase.client.TestLeaseRenewal
Running org.apache.hadoop.hbase.client.TestRestoreSnapshotFromClientWithRegionReplicas
Tests run: 1, Failures: 0, Errors: 0, Skipped: 0, Time elapsed: 30.364 sec - in org.apache.hadoop.hbase.client.TestLeaseRenewal
Java HotSpot(TM) 64-Bit Server VM warning: ignoring option MaxPermSize=256m; support was removed
in 8.0
Tests run: 3, Failures: 0, Errors: 0, Skipped: 0, Time elapsed: 95.322 sec - in org.apache.hadoop.hbase.client.TestTableSnapshotScanner
Java HotSpot(TM) 64-Bit Server VM warning: ignoring option MaxPermSize=256m; support was removed
in 8.0
Tests run: 5, Failures: 0, Errors: 0, Skipped: 0, Time elapsed: 176.747 sec - in org.apache.hadoop.hbase.client.TestCloneSnapshotFromClient
Java HotSpot(TM) 64-Bit Server VM warning: ignoring option MaxPermSize=256m; support was removed
in 8.0
Running org.apache.hadoop.hbase.client.TestFromClientSideNoCodec
Tests run: 2, Failures: 0, Errors: 0, Skipped: 0, Time elapsed: 4.663 sec - in org.apache.hadoop.hbase.client.TestFromClientSideNoCodec
Java HotSpot(TM) 64-Bit Server VM warning: ignoring option MaxPermSize=256m; support was removed
in 8.0
Running org.apache.hadoop.hbase.client.TestHTableMultiplexerFlushCache
Running org.apache.hadoop.hbase.client.TestConnectionImplementation
Tests run: 2, Failures: 0, Errors: 0, Skipped: 0, Time elapsed: 2.041 sec - in org.apache.hadoop.hbase.client.TestConnectionImplementation
Java HotSpot(TM) 64-Bit Server VM warning: ignoring option MaxPermSize=256m; support was removed
in 8.0
Tests run: 2, Failures: 0, Errors: 0, Skipped: 0, Time elapsed: 18.029 sec - in org.apache.hadoop.hbase.client.TestHTableMultiplexerFlushCache
Java HotSpot(TM) 64-Bit Server VM warning: ignoring option MaxPermSize=256m; support was removed
in 8.0
Running org.apache.hadoop.hbase.client.TestClientTimeouts
Tests run: 1, Failures: 0, Errors: 0, Skipped: 0, Time elapsed: 4.187 sec - in org.apache.hadoop.hbase.client.TestClientTimeouts
Java HotSpot(TM) 64-Bit Server VM warning: ignoring option MaxPermSize=256m; support was removed
in 8.0
Tests run: 28, Failures: 0, Errors: 0, Skipped: 0, Time elapsed: 207.811 sec - in org.apache.hadoop.hbase.client.TestAdmin1
Java HotSpot(TM) 64-Bit Server VM warning: ignoring option MaxPermSize=256m; support was removed
in 8.0
Running org.apache.hadoop.hbase.client.TestHTableUtil
Tests run: 2, Failures: 0, Errors: 0, Skipped: 0, Time elapsed: 5.111 sec - in org.apache.hadoop.hbase.client.TestHTableUtil
Java HotSpot(TM) 64-Bit Server VM warning: ignoring option MaxPermSize=256m; support was removed
in 8.0
Java HotSpot(TM) 64-Bit Server VM warning: ignoring option MaxPermSize=256m; support was removed
in 8.0
Running org.apache.hadoop.hbase.client.TestReplicasClient
Running org.apache.hadoop.hbase.client.TestSnapshotMetadata
Running org.apache.hadoop.hbase.client.TestIncrementsFromClientSide
Running org.apache.hadoop.hbase.client.TestSnapshotFromClient
Tests run: 4, Failures: 0, Errors: 0, Skipped: 0, Time elapsed: 41.333 sec - in org.apache.hadoop.hbase.client.TestSnapshotMetadata
Java HotSpot(TM) 64-Bit Server VM warning: ignoring option MaxPermSize=256m; support was removed
in 8.0
Tests run: 12, Failures: 0, Errors: 0, Skipped: 0, Time elapsed: 41.934 sec - in org.apache.hadoop.hbase.client.TestIncrementsFromClientSide
Java HotSpot(TM) 64-Bit Server VM warning: ignoring option MaxPermSize=256m; support was removed
in 8.0
Running org.apache.hadoop.hbase.client.TestShortCircuitConnection
Tests run: 1, Failures: 0, Errors: 0, Skipped: 0, Time elapsed: 3.777 sec - in org.apache.hadoop.hbase.client.TestShortCircuitConnection
Java HotSpot(TM) 64-Bit Server VM warning: ignoring option MaxPermSize=256m; support was removed
in 8.0
Running org.apache.hadoop.hbase.client.TestHCM
Tests run: 9, Failures: 0, Errors: 0, Skipped: 0, Time elapsed: 65.262 sec - in org.apache.hadoop.hbase.client.TestSnapshotFromClient
Java HotSpot(TM) 64-Bit Server VM warning: ignoring option MaxPermSize=256m; support was removed
in 8.0
Tests run: 5, Failures: 0, Errors: 0, Skipped: 0, Time elapsed: 180.036 sec - in org.apache.hadoop.hbase.client.TestRestoreSnapshotFromClientWithRegionReplicas
Java HotSpot(TM) 64-Bit Server VM warning: ignoring option MaxPermSize=256m; support was removed
in 8.0
Running org.apache.hadoop.hbase.client.TestReplicaWithCluster
Running org.apache.hadoop.hbase.client.TestMultiRespectsLimits
Running org.apache.hadoop.hbase.client.TestScannersFromClientSide
Tests run: 7, Failures: 0, Errors: 0, Skipped: 0, Time elapsed: 24.739 sec - in org.apache.hadoop.hbase.client.TestScannersFromClientSide
Java HotSpot(TM) 64-Bit Server VM warning: ignoring option MaxPermSize=256m; support was removed
in 8.0
Java HotSpot(TM) 64-Bit Server VM warning: ignoring option MaxPermSize=256m; support was removed
in 8.0
Tests run: 2, Failures: 0, Errors: 0, Skipped: 0, Time elapsed: 45.5 sec - in org.apache.hadoop.hbase.client.TestMultiRespectsLimits
Java HotSpot(TM) 64-Bit Server VM warning: ignoring option MaxPermSize=256m; support was removed
in 8.0
Tests run: 4, Failures: 0, Errors: 0, Skipped: 0, Time elapsed: 62.87 sec - in org.apache.hadoop.hbase.client.TestReplicaWithCluster
Java HotSpot(TM) 64-Bit Server VM warning: ignoring option MaxPermSize=256m; support was removed
in 8.0
Running org.apache.hadoop.hbase.client.TestSnapshotFromClientWithRegionReplicas
Running org.apache.hadoop.hbase.client.TestFromClientSide
Running org.apache.hadoop.hbase.client.TestCloneSnapshotFromClientWithRegionReplicas

Results :

Tests in error: 
org.apache.hadoop.hbase.coprocessor.TestRowProcessorEndpoint.testReadModifyWrite(org.apache.hadoop.hbase.coprocessor.TestRowProcessorEndpoint)
  Run 1: TestRowProcessorEndpoint.testReadModifyWrite:184 expected:<101> but was:<90>
  Run 2: TestRowProcessorEndpoint.testReadModifyWrite:183->incrementCounter:206 » Service

Flaked tests: 
org.apache.hadoop.hbase.coprocessor.TestMasterObserver.testStarted(org.apache.hadoop.hbase.coprocessor.TestMasterObserver)
  Run 1: TestMasterObserver.testStarted:1281 NullPointer
  Run 2: PASS

org.apache.hadoop.hbase.coprocessor.TestMasterObserver.testTableNamesEnumeration(org.apache.hadoop.hbase.coprocessor.TestMasterObserver)
  Run 1: TestMasterObserver.testTableNamesEnumeration:1735 NullPointer
  Run 2: PASS

org.apache.hadoop.hbase.coprocessor.TestMasterObserver.testTableOperations(org.apache.hadoop.hbase.coprocessor.TestMasterObserver)
  Run 1: TestMasterObserver.testTableOperations:1334->Object.wait:-2 » TestTimedOut tes...
  Run 2: PASS


Tests run: 1948, Failures: 0, Errors: 1, Skipped: 24, Flakes: 3

[INFO] ------------------------------------------------------------------------
[INFO] Reactor Summary:
[INFO] 
[INFO] Apache HBase ...................................... SUCCESS [1:40.760s]
[INFO] Apache HBase - Checkstyle ......................... SUCCESS [9.883s]
[INFO] Apache HBase - Resource Bundle .................... SUCCESS [0.290s]
[INFO] Apache HBase - Annotations ........................ SUCCESS [1.796s]
[INFO] Apache HBase - Protocol ........................... SUCCESS [25.225s]
[INFO] Apache HBase - Common ............................. SUCCESS [3:09.914s]
[INFO] Apache HBase - Procedure .......................... SUCCESS [3:52.955s]
[INFO] Apache HBase - Client ............................. SUCCESS [1:40.210s]
[INFO] Apache HBase - Hadoop Compatibility ............... SUCCESS [10.223s]
[INFO] Apache HBase - Hadoop Two Compatibility ........... SUCCESS [15.327s]
[INFO] Apache HBase - Prefix Tree ........................ SUCCESS [13.593s]
[INFO] Apache HBase - Server ............................. FAILURE [1:41:34.515s]
[INFO] Apache HBase - Testing Util ....................... SKIPPED
[INFO] Apache HBase - Thrift ............................. SKIPPED
[INFO] Apache HBase - Rest ............................... SKIPPED
[INFO] Apache HBase - Shell .............................. SKIPPED
[INFO] Apache HBase - Integration Tests .................. SKIPPED
[INFO] Apache HBase - Examples ........................... SKIPPED
[INFO] Apache HBase - External Block Cache ............... SKIPPED
[INFO] Apache HBase - Assembly ........................... SKIPPED
[INFO] Apache HBase - Shaded ............................. SKIPPED
[INFO] Apache HBase - Shaded - Client .................... SKIPPED
[INFO] Apache HBase - Shaded - Server .................... SKIPPED
[INFO] ------------------------------------------------------------------------
[INFO] BUILD FAILURE
[INFO] ------------------------------------------------------------------------
[INFO] Total time: 1:53:47.820s
[INFO] Finished at: Sat May 28 13:54:31 UTC 2016
[INFO] Final Memory: 458M/1668M
[INFO] ------------------------------------------------------------------------
[ERROR] Failed to execute goal org.apache.maven.plugins:maven-surefire-plugin:2.18.1:test
(secondPartTestsExecution) on project hbase-server: ExecutionException: java.lang.RuntimeException:
java.lang.RuntimeException: org.apache.maven.surefire.report.ReporterException: When writing
xml report stdout/stderr: /tmp/stderr7734951957352506314deferred (No such file or directory)
-> [Help 1]
[ERROR] 
[ERROR] To see the full stack trace of the errors, re-run Maven with the -e switch.
[ERROR] Re-run Maven using the -X switch to enable full debug logging.
[ERROR] 
[ERROR] For more information about the errors and possible solutions, please read the following
articles:
[ERROR] [Help 1] http://cwiki.apache.org/confluence/display/MAVEN/MojoFailureException
[ERROR] 
[ERROR] After correcting the problems, you can resume the build with the command
[ERROR]   mvn <goals> -rf :hbase-server
Build step 'Invoke top-level Maven targets' marked build as failure
Performing Post build task...
Match found for :.* : True
Logical operation result is TRUE
Running script  : # Post-build task script. TODO: Check this in and have all builds reference
check-in.
pwd && ls
# NOTE!!!! The below code has been copied and pasted from ./dev-tools/run-test.sh
# Do not change here without syncing there and vice-versa.
ZOMBIE_TESTS_COUNT=`jps -v | grep surefirebooter | grep -e '-Dhbase.test' | wc -l`
if [[ $ZOMBIE_TESTS_COUNT != 0 ]] ; then
 echo "Suspicious java process found - waiting 30s to see if there are just slow to stop"
 sleep 30
 ZOMBIE_TESTS_COUNT=`jps -v | grep surefirebooter | grep -e '-Dhbase.test' | wc -l`
 if [[ $ZOMBIE_TESTS_COUNT != 0 ]] ; then
   echo " {color:red}There appear to be $ZOMBIE_TESTS_COUNT zombie tests{color}, they should
have been killed by surefire but survived"
   jps -v | grep surefirebooter | grep -e '-Dhbase.test'
   jps -v | grep surefirebooter | grep -e '-Dhbase.test' | cut -d ' ' -f 1 | xargs -n 1 jstack
   # Exit with error
   exit 1
 else
   echo "We're ok: there is no zombie test, but some tests took some time to stop"
 fi
else
  echo "We're ok: there is no zombie test"
fi
[yahoo-not-h2] $ /bin/bash -xe /tmp/hudson6874536409145898605.sh
+ pwd
<https://builds.apache.org/job/HBase-1.4/jdk=latest1.8,label=yahoo-not-h2/ws/>
+ ls
bin
CHANGES.txt
conf
dev-support
hbase-annotations
hbase-assembly
hbase-checkstyle
hbase-client
hbase-common
hbase-examples
hbase-external-blockcache
hbase-hadoop2-compat
hbase-hadoop-compat
hbase-it
hbase-native-client
hbase-prefix-tree
hbase-procedure
hbase-protocol
hbase-resource-bundle
hbase-rest
hbase-server
hbase-shaded
hbase-shell
hbase-testing-util
hbase-thrift
LICENSE.txt
NOTICE.txt
pom.xml
README.txt
src
target
++ wc -l
++ grep -e -Dhbase.test
++ grep surefirebooter
++ jps -v
+ ZOMBIE_TESTS_COUNT=4
+ [[ 4 != 0 ]]
+ echo 'Suspicious java process found - waiting 30s to see if there are just slow to stop'
Suspicious java process found - waiting 30s to see if there are just slow to stop
+ sleep 30
++ wc -l
++ grep -e -Dhbase.test
++ grep surefirebooter
++ jps -v
+ ZOMBIE_TESTS_COUNT=0
+ [[ 0 != 0 ]]
+ echo 'We'\''re ok: there is no zombie test, but some tests took some time to stop'
We're ok: there is no zombie test, but some tests took some time to stop
POST BUILD TASK : SUCCESS
END OF POST BUILD TASK : 0
Archiving artifacts
Recording test results

Mime
View raw message