hbase-builds mailing list archives

Site index · List index
Message view « Date » · « Thread »
Top « Date » · « Thread »
From Apache Jenkins Server <jenk...@builds.apache.org>
Subject Build failed in Jenkins: HBase-Trunk_matrix » latest1.7,yahoo-not-h2 #824
Date Mon, 04 Apr 2016 15:52:51 GMT
See <https://builds.apache.org/job/HBase-Trunk_matrix/jdk=latest1.7,label=yahoo-not-h2/824/changes>

Changes:

[ashishsinghi] HBASE-15578 Handle HBASE-15234 for ReplicationHFileCleaner

------------------------------------------
[...truncated 5609 lines...]
Running org.apache.hadoop.hbase.master.TestMasterFailoverBalancerPersistence
Running org.apache.hadoop.hbase.master.TestMetaShutdownHandler
Tests run: 1, Failures: 0, Errors: 0, Skipped: 0, Time elapsed: 17.043 sec - in org.apache.hadoop.hbase.master.TestMasterFailoverBalancerPersistence
Tests run: 2, Failures: 0, Errors: 0, Skipped: 0, Time elapsed: 47.976 sec - in org.apache.hadoop.hbase.master.normalizer.TestSimpleRegionNormalizerOnCluster
Running org.apache.hadoop.hbase.master.TestGetInfoPort
Tests run: 4, Failures: 0, Errors: 0, Skipped: 0, Time elapsed: 43.652 sec - in org.apache.hadoop.hbase.master.snapshot.TestSnapshotFileCache
Running org.apache.hadoop.hbase.master.TestRollingRestart
Running org.apache.hadoop.hbase.master.TestMasterMetrics
Tests run: 3, Failures: 0, Errors: 0, Skipped: 0, Time elapsed: 1.747 sec - in org.apache.hadoop.hbase.master.TestMasterMetrics
Running org.apache.hadoop.hbase.master.TestMasterShutdown
Tests run: 1, Failures: 0, Errors: 0, Skipped: 0, Time elapsed: 31.838 sec - in org.apache.hadoop.hbase.master.TestMetaShutdownHandler
Tests run: 1, Failures: 0, Errors: 0, Skipped: 0, Time elapsed: 13.445 sec - in org.apache.hadoop.hbase.master.TestGetInfoPort
Running org.apache.hadoop.hbase.master.TestRestartCluster
Running org.apache.hadoop.hbase.master.cleaner.TestLogsCleaner
Tests run: 3, Failures: 0, Errors: 0, Skipped: 0, Time elapsed: 12.196 sec - in org.apache.hadoop.hbase.master.cleaner.TestLogsCleaner
Tests run: 2, Failures: 0, Errors: 0, Skipped: 0, Time elapsed: 20.872 sec - in org.apache.hadoop.hbase.master.TestMasterShutdown
Running org.apache.hadoop.hbase.master.cleaner.TestHFileLinkCleaner
Tests run: 1, Failures: 0, Errors: 0, Skipped: 0, Time elapsed: 37.607 sec - in org.apache.hadoop.hbase.master.TestRollingRestart
Tests run: 1, Failures: 0, Errors: 0, Skipped: 0, Time elapsed: 10.913 sec - in org.apache.hadoop.hbase.master.cleaner.TestHFileLinkCleaner
Running org.apache.hadoop.hbase.master.cleaner.TestSnapshotFromMaster
Running org.apache.hadoop.hbase.master.TestMasterTransitions
Tests run: 3, Failures: 0, Errors: 0, Skipped: 3, Time elapsed: 0.002 sec - in org.apache.hadoop.hbase.master.TestMasterTransitions
Running org.apache.hadoop.hbase.master.cleaner.TestHFileCleaner
Tests run: 3, Failures: 0, Errors: 0, Skipped: 0, Time elapsed: 1.423 sec - in org.apache.hadoop.hbase.master.cleaner.TestHFileCleaner
Running org.apache.hadoop.hbase.master.TestClusterStatusPublisher
Tests run: 3, Failures: 0, Errors: 0, Skipped: 0, Time elapsed: 0.265 sec - in org.apache.hadoop.hbase.master.TestClusterStatusPublisher
Running org.apache.hadoop.hbase.master.TestMasterMetricsWrapper
Tests run: 1, Failures: 0, Errors: 0, Skipped: 0, Time elapsed: 2.06 sec - in org.apache.hadoop.hbase.master.TestMasterMetricsWrapper
Running org.apache.hadoop.hbase.master.TestHMasterRPCException
Running org.apache.hadoop.hbase.master.TestAssignmentListener
Tests run: 1, Failures: 0, Errors: 0, Skipped: 0, Time elapsed: 4.171 sec - in org.apache.hadoop.hbase.master.TestHMasterRPCException
Running org.apache.hadoop.hbase.master.TestTableLockManager
Tests run: 2, Failures: 0, Errors: 0, Skipped: 0, Time elapsed: 59.373 sec - in org.apache.hadoop.hbase.master.TestRestartCluster
Tests run: 2, Failures: 0, Errors: 0, Skipped: 0, Time elapsed: 13.662 sec - in org.apache.hadoop.hbase.master.TestAssignmentListener
Running org.apache.hadoop.hbase.master.balancer.TestDefaultLoadBalancer
Tests run: 1, Failures: 0, Errors: 0, Skipped: 0, Time elapsed: 4.049 sec - in org.apache.hadoop.hbase.master.balancer.TestDefaultLoadBalancer
Running org.apache.hadoop.hbase.master.balancer.TestStochasticLoadBalancer
Running org.apache.hadoop.hbase.master.TestWarmupRegion
Tests run: 4, Failures: 0, Errors: 0, Skipped: 0, Time elapsed: 55.306 sec - in org.apache.hadoop.hbase.master.cleaner.TestSnapshotFromMaster
Running org.apache.hadoop.hbase.master.balancer.TestBaseLoadBalancer
Tests run: 6, Failures: 0, Errors: 0, Skipped: 0, Time elapsed: 0.551 sec - in org.apache.hadoop.hbase.master.balancer.TestBaseLoadBalancer
Running org.apache.hadoop.hbase.master.balancer.TestStochasticLoadBalancer2
Tests run: 1, Failures: 0, Errors: 0, Skipped: 0, Time elapsed: 32.84 sec - in org.apache.hadoop.hbase.master.TestWarmupRegion
Running org.apache.hadoop.hbase.master.TestTableStateManager
Tests run: 1, Failures: 0, Errors: 0, Skipped: 0, Time elapsed: 19.551 sec - in org.apache.hadoop.hbase.master.TestTableStateManager
Running org.apache.hadoop.hbase.master.TestMasterRestartAfterDisablingTable
Tests run: 1, Failures: 0, Errors: 0, Skipped: 0, Time elapsed: 23.328 sec - in org.apache.hadoop.hbase.master.TestMasterRestartAfterDisablingTable
Tests run: 4, Failures: 0, Errors: 0, Skipped: 0, Time elapsed: 110.682 sec - in org.apache.hadoop.hbase.master.TestTableLockManager
Running org.apache.hadoop.hbase.master.TestAssignmentManagerOnCluster
Running org.apache.hadoop.hbase.master.TestDistributedLogSplitting
Tests run: 18, Failures: 0, Errors: 0, Skipped: 15, Time elapsed: 48.413 sec - in org.apache.hadoop.hbase.master.TestDistributedLogSplitting
Running org.apache.hadoop.hbase.TestMetaTableAccessorNoCluster
Tests run: 2, Failures: 0, Errors: 0, Skipped: 0, Time elapsed: 3.72 sec - in org.apache.hadoop.hbase.TestMetaTableAccessorNoCluster
Running org.apache.hadoop.hbase.mapred.TestTableSnapshotInputFormat
Tests run: 9, Failures: 0, Errors: 3, Skipped: 0, Time elapsed: 703.686 sec <<< FAILURE!
- in org.apache.hadoop.hbase.master.procedure.TestMasterFailoverWithProcedures
testWALfencingWithWALRolling(org.apache.hadoop.hbase.master.procedure.TestMasterFailoverWithProcedures)
 Time elapsed: 600.041 sec  <<< ERROR!
org.junit.runners.model.TestTimedOutException: test timed out after 10 minutes
	at java.lang.Object.wait(Native Method)
	at java.lang.Thread.join(Thread.java:1289)
	at org.apache.hadoop.hbase.util.Threads.threadDumpingIsAlive(Threads.java:133)
	at org.apache.hadoop.hbase.LocalHBaseCluster.join(LocalHBaseCluster.java:395)
	at org.apache.hadoop.hbase.MiniHBaseCluster.waitUntilShutDown(MiniHBaseCluster.java:757)
	at org.apache.hadoop.hbase.HBaseTestingUtility.shutdownMiniHBaseCluster(HBaseTestingUtility.java:1188)
	at org.apache.hadoop.hbase.HBaseTestingUtility.shutdownMiniCluster(HBaseTestingUtility.java:1147)
	at org.apache.hadoop.hbase.master.procedure.TestMasterFailoverWithProcedures.tearDown(TestMasterFailoverWithProcedures.java:92)

testWALfencingWithWALRolling(org.apache.hadoop.hbase.master.procedure.TestMasterFailoverWithProcedures)
 Time elapsed: 600.041 sec  <<< ERROR!
java.lang.Exception: Appears to be stuck in thread DataXceiver for client DFSClient_NONMAPREDUCE_-1278027000_704
at /127.0.0.1:58255 [Receiving block BP-1066322770-67.195.81.189-1459783623148:blk_1073741839_1017]
	at sun.nio.ch.EPollArrayWrapper.epollWait(Native Method)
	at sun.nio.ch.EPollArrayWrapper.poll(EPollArrayWrapper.java:269)
	at sun.nio.ch.EPollSelectorImpl.doSelect(EPollSelectorImpl.java:79)
	at sun.nio.ch.SelectorImpl.lockAndDoSelect(SelectorImpl.java:87)
	at sun.nio.ch.SelectorImpl.select(SelectorImpl.java:98)
	at org.apache.hadoop.net.SocketIOWithTimeout$SelectorPool.select(SocketIOWithTimeout.java:335)
	at org.apache.hadoop.net.SocketIOWithTimeout.doIO(SocketIOWithTimeout.java:157)
	at org.apache.hadoop.net.SocketInputStream.read(SocketInputStream.java:161)
	at org.apache.hadoop.net.SocketInputStream.read(SocketInputStream.java:131)
	at java.io.BufferedInputStream.fill(BufferedInputStream.java:235)
	at java.io.BufferedInputStream.read1(BufferedInputStream.java:275)
	at java.io.BufferedInputStream.read(BufferedInputStream.java:334)
	at java.io.DataInputStream.read(DataInputStream.java:149)
	at org.apache.hadoop.io.IOUtils.readFully(IOUtils.java:199)
	at org.apache.hadoop.hdfs.protocol.datatransfer.PacketReceiver.doReadFully(PacketReceiver.java:213)
	at org.apache.hadoop.hdfs.protocol.datatransfer.PacketReceiver.doRead(PacketReceiver.java:134)
	at org.apache.hadoop.hdfs.protocol.datatransfer.PacketReceiver.receiveNextPacket(PacketReceiver.java:109)
	at org.apache.hadoop.hdfs.server.datanode.BlockReceiver.receivePacket(BlockReceiver.java:472)
	at org.apache.hadoop.hdfs.server.datanode.BlockReceiver.receiveBlock(BlockReceiver.java:849)
	at org.apache.hadoop.hdfs.server.datanode.DataXceiver.writeBlock(DataXceiver.java:804)
	at org.apache.hadoop.hdfs.protocol.datatransfer.Receiver.opWriteBlock(Receiver.java:137)
	at org.apache.hadoop.hdfs.protocol.datatransfer.Receiver.processOp(Receiver.java:74)
	at org.apache.hadoop.hdfs.server.datanode.DataXceiver.run(DataXceiver.java:251)
	at java.lang.Thread.run(Thread.java:745)

testCreateWithFailover(org.apache.hadoop.hbase.master.procedure.TestMasterFailoverWithProcedures)
 Time elapsed: 0.153 sec  <<< ERROR!
java.lang.IllegalStateException: A mini-cluster is already running
	at org.apache.hadoop.hbase.HBaseTestingUtility.startMiniCluster(HBaseTestingUtility.java:1018)
	at org.apache.hadoop.hbase.HBaseTestingUtility.startMiniCluster(HBaseTestingUtility.java:909)
	at org.apache.hadoop.hbase.HBaseTestingUtility.startMiniCluster(HBaseTestingUtility.java:903)
	at org.apache.hadoop.hbase.master.procedure.TestMasterFailoverWithProcedures.setup(TestMasterFailoverWithProcedures.java:82)

Tests run: 22, Failures: 0, Errors: 0, Skipped: 0, Time elapsed: 146.692 sec - in org.apache.hadoop.hbase.master.TestAssignmentManagerOnCluster
Tests run: 20, Failures: 0, Errors: 0, Skipped: 1, Time elapsed: 254.649 sec - in org.apache.hadoop.hbase.master.balancer.TestStochasticLoadBalancer
Running org.apache.hadoop.hbase.mapred.TestTableMapReduceUtil
Running org.apache.hadoop.hbase.mapred.TestTableInputFormat
Running org.apache.hadoop.hbase.mapred.TestMultiTableSnapshotInputFormat
Tests run: 4, Failures: 0, Errors: 0, Skipped: 0, Time elapsed: 21.018 sec - in org.apache.hadoop.hbase.mapred.TestTableMapReduceUtil
Tests run: 8, Failures: 0, Errors: 0, Skipped: 0, Time elapsed: 27.2 sec - in org.apache.hadoop.hbase.mapred.TestTableInputFormat
Running org.apache.hadoop.hbase.TestIOFencing
Tests run: 7, Failures: 0, Errors: 0, Skipped: 0, Time elapsed: 157.526 sec - in org.apache.hadoop.hbase.mapred.TestTableSnapshotInputFormat
Running org.apache.hadoop.hbase.TestMetaTableLocator
Running org.apache.hadoop.hbase.mapred.TestTableMapReduce
Tests run: 7, Failures: 0, Errors: 0, Skipped: 0, Time elapsed: 5.689 sec - in org.apache.hadoop.hbase.TestMetaTableLocator
Tests run: 4, Failures: 0, Errors: 0, Skipped: 0, Time elapsed: 62.847 sec - in org.apache.hadoop.hbase.mapred.TestMultiTableSnapshotInputFormat
Running org.apache.hadoop.hbase.util.TestHBaseFsckMOB
Tests run: 2, Failures: 0, Errors: 0, Skipped: 0, Time elapsed: 31.48 sec - in org.apache.hadoop.hbase.mapred.TestTableMapReduce
Running org.apache.hadoop.hbase.util.TestRegionSplitter
Tests run: 1, Failures: 0, Errors: 0, Skipped: 0, Time elapsed: 15.222 sec - in org.apache.hadoop.hbase.util.TestHBaseFsckMOB
Running org.apache.hadoop.hbase.util.TestFSHDFSUtils
Running org.apache.hadoop.hbase.util.TestRegionMover
Tests run: 6, Failures: 0, Errors: 0, Skipped: 0, Time elapsed: 11.488 sec - in org.apache.hadoop.hbase.util.TestRegionSplitter
Tests run: 3, Failures: 0, Errors: 0, Skipped: 0, Time elapsed: 8.77 sec - in org.apache.hadoop.hbase.util.TestFSHDFSUtils
Running org.apache.hadoop.hbase.util.TestFSVisitor
Tests run: 1, Failures: 0, Errors: 0, Skipped: 0, Time elapsed: 2.798 sec - in org.apache.hadoop.hbase.util.TestFSVisitor
Running org.apache.hadoop.hbase.util.TestMiniClusterLoadParallel
Running org.apache.hadoop.hbase.util.TestHBaseFsckTwoRS
Tests run: 5, Failures: 0, Errors: 0, Skipped: 0, Time elapsed: 47.391 sec - in org.apache.hadoop.hbase.util.TestRegionMover
Running org.apache.hadoop.hbase.util.TestIdReadWriteLock
Tests run: 1, Failures: 0, Errors: 0, Skipped: 0, Time elapsed: 15.987 sec - in org.apache.hadoop.hbase.util.TestIdReadWriteLock
Running org.apache.hadoop.hbase.util.hbck.TestOfflineMetaRebuildOverlap
Tests run: 2, Failures: 0, Errors: 0, Skipped: 0, Time elapsed: 127.944 sec - in org.apache.hadoop.hbase.TestIOFencing
Running org.apache.hadoop.hbase.util.hbck.TestOfflineMetaRebuildHole
Tests run: 4, Failures: 0, Errors: 0, Skipped: 0, Time elapsed: 82.437 sec - in org.apache.hadoop.hbase.util.TestMiniClusterLoadParallel
Running org.apache.hadoop.hbase.util.hbck.TestOfflineMetaRebuildBase
Tests run: 1, Failures: 0, Errors: 0, Skipped: 0, Time elapsed: 35.795 sec - in org.apache.hadoop.hbase.util.hbck.TestOfflineMetaRebuildOverlap
Running org.apache.hadoop.hbase.util.TestConnectionCache
Tests run: 1, Failures: 0, Errors: 0, Skipped: 0, Time elapsed: 38.119 sec - in org.apache.hadoop.hbase.util.hbck.TestOfflineMetaRebuildHole
Running org.apache.hadoop.hbase.util.TestFSTableDescriptors
Tests run: 16, Failures: 0, Errors: 0, Skipped: 0, Time elapsed: 3.455 sec - in org.apache.hadoop.hbase.util.TestFSTableDescriptors
Running org.apache.hadoop.hbase.util.TestMiniClusterLoadEncoded
Tests run: 9, Failures: 0, Errors: 0, Skipped: 0, Time elapsed: 98.423 sec - in org.apache.hadoop.hbase.util.TestHBaseFsckTwoRS
Tests run: 1, Failures: 0, Errors: 0, Skipped: 0, Time elapsed: 22.84 sec - in org.apache.hadoop.hbase.util.TestConnectionCache
Running org.apache.hadoop.hbase.util.TestDefaultEnvironmentEdge
Tests run: 1, Failures: 0, Errors: 0, Skipped: 0, Time elapsed: 0.303 sec - in org.apache.hadoop.hbase.util.TestDefaultEnvironmentEdge
Tests run: 1, Failures: 0, Errors: 0, Skipped: 0, Time elapsed: 35.015 sec - in org.apache.hadoop.hbase.util.hbck.TestOfflineMetaRebuildBase
Running org.apache.hadoop.hbase.util.TestFanOutOneBlockAsyncDFSOutput
Running org.apache.hadoop.hbase.util.TestHBaseFsckReplicas
Running org.apache.hadoop.hbase.util.TestHBaseFsckOneRS
Tests run: 5, Failures: 0, Errors: 0, Skipped: 0, Time elapsed: 40.387 sec - in org.apache.hadoop.hbase.util.TestFanOutOneBlockAsyncDFSOutput
Running org.apache.hadoop.hbase.util.TestTableName
Tests run: 6, Failures: 0, Errors: 0, Skipped: 0, Time elapsed: 0.415 sec - in org.apache.hadoop.hbase.util.TestTableName
Running org.apache.hadoop.hbase.util.TestMiniClusterLoadSequential
Tests run: 4, Failures: 0, Errors: 0, Skipped: 0, Time elapsed: 543.937 sec - in org.apache.hadoop.hbase.master.balancer.TestStochasticLoadBalancer2
Running org.apache.hadoop.hbase.util.TestIdLock
Tests run: 4, Failures: 0, Errors: 0, Skipped: 0, Time elapsed: 48.153 sec - in org.apache.hadoop.hbase.util.TestHBaseFsckReplicas
Tests run: 1, Failures: 0, Errors: 0, Skipped: 0, Time elapsed: 15.179 sec - in org.apache.hadoop.hbase.util.TestIdLock
Running org.apache.hadoop.hbase.util.TestFSUtils
Tests run: 5, Failures: 0, Errors: 0, Skipped: 0, Time elapsed: 93.791 sec - in org.apache.hadoop.hbase.util.TestMiniClusterLoadEncoded
Running org.apache.hadoop.hbase.util.TestCoprocessorScanPolicy
Running org.apache.hadoop.hbase.util.TestMergeTool
Tests run: 4, Failures: 0, Errors: 0, Skipped: 0, Time elapsed: 21.259 sec - in org.apache.hadoop.hbase.util.TestCoprocessorScanPolicy
Tests run: 11, Failures: 0, Errors: 0, Skipped: 0, Time elapsed: 27.559 sec - in org.apache.hadoop.hbase.util.TestFSUtils
Running org.apache.hadoop.hbase.util.TestMergeTable
Running org.apache.hadoop.hbase.util.TestHBaseFsckEncryption
Tests run: 1, Failures: 0, Errors: 0, Skipped: 0, Time elapsed: 25.344 sec - in org.apache.hadoop.hbase.util.TestMergeTool
Tests run: 4, Failures: 0, Errors: 0, Skipped: 0, Time elapsed: 71.806 sec - in org.apache.hadoop.hbase.util.TestMiniClusterLoadSequential
Running org.apache.hadoop.hbase.TestMetaTableAccessor
Tests run: 1, Failures: 0, Errors: 0, Skipped: 0, Time elapsed: 20.16 sec - in org.apache.hadoop.hbase.util.TestHBaseFsckEncryption
Tests run: 1, Failures: 0, Errors: 0, Skipped: 0, Time elapsed: 26.82 sec - in org.apache.hadoop.hbase.util.TestMergeTable
Tests run: 15, Failures: 0, Errors: 0, Skipped: 0, Time elapsed: 38.872 sec - in org.apache.hadoop.hbase.TestMetaTableAccessor
Tests run: 41, Failures: 0, Errors: 0, Skipped: 1, Time elapsed: 348.178 sec - in org.apache.hadoop.hbase.util.TestHBaseFsckOneRS

Results :

Tests in error: 
  TestMasterFailoverWithProcedures.setup:82 » IllegalState A mini-cluster is alr...
org.apache.hadoop.hbase.master.procedure.TestMasterFailoverWithProcedures.testWALfencingWithWALRolling(org.apache.hadoop.hbase.master.procedure.TestMasterFailoverWithProcedures)
  Run 1: TestMasterFailoverWithProcedures.tearDown:92->Object.wait:-2 » TestTimedOut te...
  Run 2: TestMasterFailoverWithProcedures.testWALfencingWithWALRolling »  Appears to be...


Tests run: 2736, Failures: 0, Errors: 2, Skipped: 65

[INFO] ------------------------------------------------------------------------
[INFO] Reactor Summary:
[INFO] 
[INFO] Apache HBase ...................................... SUCCESS [  3.041 s]
[INFO] Apache HBase - Checkstyle ......................... SUCCESS [  0.779 s]
[INFO] Apache HBase - Resource Bundle .................... SUCCESS [  0.270 s]
[INFO] Apache HBase - Annotations ........................ SUCCESS [  0.232 s]
[INFO] Apache HBase - Protocol ........................... SUCCESS [  3.554 s]
[INFO] Apache HBase - Common ............................. SUCCESS [01:33 min]
[INFO] Apache HBase - Procedure .......................... SUCCESS [02:29 min]
[INFO] Apache HBase - Client ............................. SUCCESS [ 39.659 s]
[INFO] Apache HBase - Hadoop Compatibility ............... SUCCESS [  7.843 s]
[INFO] Apache HBase - Hadoop Two Compatibility ........... SUCCESS [  8.691 s]
[INFO] Apache HBase - Prefix Tree ........................ SUCCESS [ 11.361 s]
[INFO] Apache HBase - Server ............................. FAILURE [  01:53 h]
[INFO] Apache HBase - Testing Util ....................... SKIPPED
[INFO] Apache HBase - Thrift ............................. SKIPPED
[INFO] Apache HBase - RSGroup ............................ SKIPPED
[INFO] Apache HBase - Shell .............................. SKIPPED
[INFO] Apache HBase - Integration Tests .................. SKIPPED
[INFO] Apache HBase - Examples ........................... SKIPPED
[INFO] Apache HBase - Rest ............................... SKIPPED
[INFO] Apache HBase - External Block Cache ............... SKIPPED
[INFO] Apache HBase - Spark .............................. SKIPPED
[INFO] Apache HBase - Assembly ........................... SKIPPED
[INFO] Apache HBase - Shaded ............................. SKIPPED
[INFO] Apache HBase - Shaded - Client .................... SKIPPED
[INFO] Apache HBase - Shaded - Server .................... SKIPPED
[INFO] Apache HBase - Archetypes ......................... SKIPPED
[INFO] Apache HBase - Exemplar for hbase-client archetype  SKIPPED
[INFO] Apache HBase - Exemplar for hbase-shaded-client archetype  SKIPPED
[INFO] Apache HBase - Archetype builder .................. SKIPPED
[INFO] ------------------------------------------------------------------------
[INFO] BUILD FAILURE
[INFO] ------------------------------------------------------------------------
[INFO] Total time: 01:59 h
[INFO] Finished at: 2016-04-04T15:49:15+00:00
[INFO] Final Memory: 69M/726M
[INFO] ------------------------------------------------------------------------
[ERROR] Failed to execute goal org.apache.maven.plugins:maven-surefire-plugin:2.18.1:test
(secondPartTestsExecution) on project hbase-server: There was a timeout or other error in
the fork -> [Help 1]
[ERROR] 
[ERROR] To see the full stack trace of the errors, re-run Maven with the -e switch.
[ERROR] Re-run Maven using the -X switch to enable full debug logging.
[ERROR] 
[ERROR] For more information about the errors and possible solutions, please read the following
articles:
[ERROR] [Help 1] http://cwiki.apache.org/confluence/display/MAVEN/MojoFailureException
[ERROR] 
[ERROR] After correcting the problems, you can resume the build with the command
[ERROR]   mvn <goals> -rf :hbase-server
Build step 'Invoke top-level Maven targets' marked build as failure
Performing Post build task...
Match found for :.* : True
Logical operation result is TRUE
Running script  : # Run zombie detector script
./dev-support/zombie-detector.sh --jenkins ${BUILD_ID}
[yahoo-not-h2] $ /bin/bash -xe /tmp/hudson8280993253596598623.sh
+ ./dev-support/zombie-detector.sh --jenkins 824
Mon Apr  4 15:49:17 UTC 2016 We're ok: there is no zombie test


    {color:green}+1 zombies{color}. No zombie tests found running at the end of the build.
POST BUILD TASK : SUCCESS
END OF POST BUILD TASK : 0
Archiving artifacts
Recording test results
[FINDBUGS] Skipping publisher since build result is FAILURE
[CHECKSTYLE] Skipping publisher since build result is FAILURE

Mime
View raw message