hbase-builds mailing list archives

Site index · List index
Message view « Date » · « Thread »
Top « Date » · « Thread »
From Apache Jenkins Server <jenk...@builds.apache.org>
Subject Build failed in Jenkins: HBase-1.3-IT » IntegrationTestBigLinkedList,latest1.7,yahoo-not-h2 #630
Date Fri, 22 Apr 2016 19:18:59 GMT
See <https://builds.apache.org/job/HBase-1.3-IT/it.test=IntegrationTestBigLinkedList,jdk=latest1.7,label=yahoo-not-h2/630/changes>

Changes:

[stack] HBASE-15392 Single Cell Get reads two HFileBlocks

------------------------------------------
[...truncated 2344 lines...]
     bool UseSuperWord                              = true            {C2 product}       

     bool UseTLAB                                   = true            {pd product}       

     bool UseThreadPriorities                       = true            {pd product}       

     bool UseTransparentHugePages                   = false           {product}          

     bool UseTypeProfile                            = true            {product}          

     bool UseUnalignedLoadStores                    = true            {ARCH product}     

     bool UseVMInterruptibleIO                      = false           {product}          

     bool UseVectoredExceptions                     = false           {pd product}       

     bool UseXMMForArrayCopy                        = true            {product}          

     bool UseXmmI2D                                 = false           {ARCH product}     

     bool UseXmmI2F                                 = false           {ARCH product}     

     bool UseXmmLoadAndClearUpper                   = true            {ARCH product}     

     bool UseXmmRegToRegMoveAll                     = true            {ARCH product}     

     bool VMThreadHintNoPreempt                     = false           {product}          

     intx VMThreadPriority                          = -1              {product}          

     intx VMThreadStackSize                         = 1024            {pd product}       

     intx ValueMapInitialSize                       = 11              {C1 product}       

     intx ValueMapMaxLoopSize                       = 8               {C1 product}       

     intx ValueSearchLimit                          = 1000            {C2 product}       

     bool VerifyMergedCPBytecodes                   = true            {product}          

     intx WorkAroundNPTLTimedWaitHang               = 1               {product}          

    uintx YoungGenerationSizeIncrement              = 20              {product}          

    uintx YoungGenerationSizeSupplement             = 80              {product}          

    uintx YoungGenerationSizeSupplementDecay        = 8               {product}          

    uintx YoungPLABSize                             = 4096            {product}          

     bool ZeroTLAB                                  = false           {product}          

     intx hashCode                                  = 0               {product}          

Running org.apache.hadoop.hbase.test.IntegrationTestBigLinkedList
SUREFIRE-859: [GC 194048K->14004K(740864K), 0.5518640 secs]
SUREFIRE-859: [GC 208052K->69921K(934912K), 0.6907760 secs]
SUREFIRE-859: [GC 458017K->128054K(934912K), 0.7747860 secs]
SUREFIRE-859: [GC 516150K->171298K(1323008K), 0.3772330 secs]
SUREFIRE-859: [GC 946527K->238157K(1323008K), 0.5234270 secs]
SUREFIRE-859: [GC 1013032K->398444K(1664512K), 0.5739610 secs]
SUREFIRE-859: [GC 1416812K->513227K(1723392K), 1.0071950 secs]
SUREFIRE-859: [GC 1531591K->642515K(1446912K), 1.2686530 secs]
SUREFIRE-859: [Full GC 642515K->324789K(1612800K), 3.4152430 secs]
SUREFIRE-859: [GC 1066677K->497085K(1751040K), 0.6231270 secs]
SUREFIRE-859: [GC 1238973K->497193K(1732608K), 0.6401530 secs]
SUREFIRE-859: [GC 1245225K->602222K(1744896K), 1.7092430 secs]
SUREFIRE-859: [GC 1350254K->802967K(1741312K), 1.7904830 secs]
SUREFIRE-859: [Full GC 802967K->538393K(2083840K), 3.6086790 secs]
SUREFIRE-859: [GC 1315562K->693545K(2095616K), 0.4784420 secs]
SUREFIRE-859: [GC 1470753K->673195K(2125312K), 0.4406320 secs]
SUREFIRE-859: [GC 1491875K->702827K(2126848K), 0.4309180 secs]
SUREFIRE-859: [GC 1521515K->767431K(2129920K), 0.9495440 secs]
SUREFIRE-859: [GC 1598919K->829719K(2132992K), 0.4369710 secs]
SUREFIRE-859: [GC 1661207K->979990K(2138112K), 1.1409920 secs]
SUREFIRE-859: [GC 1830934K->1103794K(2136576K), 1.3666830 secs]
SUREFIRE-859: [Full GC 1103794K->328306K(1988608K), 4.5361490 secs]
SUREFIRE-859: [GC 1179250K->481827K(1996800K), 0.4757590 secs]
SUREFIRE-859: [GC 1354787K->511952K(1996288K), 0.4308730 secs]
SUREFIRE-859: [GC 1384912K->542137K(2022400K), 0.2184790 secs]
SUREFIRE-859: [GC 1438649K->638992K(1897984K), 0.4001030 secs]
SUREFIRE-859: [GC 1535504K->588065K(2022912K), 0.2256490 secs]
SUREFIRE-859: [GC 1491233K->646828K(2016768K), 0.1951830 secs]
SUREFIRE-859: [GC 1549996K->709330K(2017792K), 0.3050500 secs]
SUREFIRE-859: [GC 1628878K->795401K(2024960K), 0.3862940 secs]
SUREFIRE-859: [GC 1714953K->758735K(2037760K), 0.4110920 secs]
SUREFIRE-859: [GC 1681871K->841721K(2002432K), 0.5064070 secs]
SUREFIRE-859: [GC 1764857K->865645K(1957888K), 0.8157860 secs]
SUREFIRE-859: [GC 1688429K->952853K(1986048K), 0.4245420 secs]
SUREFIRE-859: [GC 1775637K->1010568K(1830400K), 0.5319880 secs]
SUREFIRE-859: [Full GC 1010568K->549422K(2141184K), 3.4677160 secs]
SUREFIRE-859: [GC 1216558K->572589K(1876992K), 0.1613710 secs]
SUREFIRE-859: [GC 1239725K->633112K(2230784K), 0.2519540 secs]
SUREFIRE-859: [GC 1311000K->789619K(2104832K), 0.7510690 secs]
SUREFIRE-859: [GC 1467507K->835757K(2154496K), 0.6375130 secs]
SUREFIRE-859: [GC 1433261K->656133K(2184192K), 0.1909340 secs]
SUREFIRE-859: [GC 1253637K->699000K(2138624K), 0.4647080 secs]
SUREFIRE-859: [GC 1311352K->721209K(2168832K), 0.4286360 secs]
SUREFIRE-859: [GC 1333561K->720941K(2210304K), 0.2883410 secs]
SUREFIRE-859: [GC 1382957K->787246K(1917952K), 0.3067190 secs]
SUREFIRE-859: [GC 1449261K->823203K(2220544K), 0.2634720 secs]
SUREFIRE-859: [GC 1505699K->864241K(2208256K), 0.3744180 secs]
SUREFIRE-859: [GC 1546381K->889510K(2226688K), 0.2455440 secs]
SUREFIRE-859: [GC 1602214K->919563K(2221056K), 0.2950760 secs]
SUREFIRE-859: [GC 1632267K->982196K(2244096K), 1.1002510 secs]
SUREFIRE-859: [GC 1749172K->983191K(2244096K), 0.1896760 secs]
SUREFIRE-859: [GC 1750167K->1021634K(2271744K), 0.1440360 secs]
SUREFIRE-859: [GC 1848002K->1115900K(2277888K), 0.4897140 secs]
SUREFIRE-859: [GC 1942268K->1129416K(2310656K), 0.5452270 secs]
SUREFIRE-859: [Full GC 1129416K->690020K(2478080K), 3.8909780 secs]
SUREFIRE-859: [GC 1572708K->758735K(2475008K), 0.4495170 secs]
SUREFIRE-859: [GC 1641423K->805564K(2499584K), 0.3298870 secs]
SUREFIRE-859: [GC 1737404K->864270K(2495488K), 0.5091880 secs]
SUREFIRE-859: [GC 1796110K->880535K(2532352K), 0.9667840 secs]
SUREFIRE-859: [GC 1860503K->894375K(2526720K), 0.2795610 secs]
SUREFIRE-859: [GC 1874343K->967474K(2549760K), 0.3950350 secs]
SUREFIRE-859: [GC 1975602K->1032479K(2548224K), 0.3478940 secs]
SUREFIRE-859: [GC 2040607K->1062589K(2557440K), 0.3256390 secs]
SUREFIRE-859: [GC 2094781K->1160005K(2555904K), 0.2755160 secs]
SUREFIRE-859: [GC 2192197K->1175220K(2575872K), 0.3655800 secs]
SUREFIRE-859: [GC 2216088K->1239758K(2451968K), 0.8283240 secs]
SUREFIRE-859: [GC 2280654K->1357784K(2558976K), 0.4724420 secs]
SUREFIRE-859: [Full GC 1357784K->735161K(2683904K), 2.4975810 secs]
SUREFIRE-859: [GC 1772473K->807367K(2687488K), 0.2497330 secs]
SUREFIRE-859: [GC 1844679K->836970K(2699776K), 0.5852370 secs]
SUREFIRE-859: [GC 1901408K->867243K(2699264K), 0.5700770 secs]
SUREFIRE-859: [GC 1931691K->890679K(2718720K), 0.3467560 secs]
SUREFIRE-859: [GC 1978167K->931362K(2628608K), 0.6629190 secs]
SUREFIRE-859: [GC 2018850K->943125K(2722304K), 0.3189760 secs]
SUREFIRE-859: [GC 2043925K->947716K(2715136K), 0.4800870 secs]
SUREFIRE-859: [GC 2048516K->993805K(2733056K), 0.3507690 secs]
SUREFIRE-859: [GC 2116109K->1057736K(2730496K), 0.3890800 secs]
SUREFIRE-859: [GC 2180040K->1123690K(2744832K), 0.3155940 secs]
SUREFIRE-859: [GC 2257770K->1170560K(2742272K), 0.2685160 secs]
SUREFIRE-859: [GC 2304640K->1176347K(2681856K), 1.4053330 secs]
SUREFIRE-859: [GC 2244891K->1196919K(2712064K), 0.4990010 secs]
SUREFIRE-859: [GC 2265463K->1209376K(2701824K), 0.4341200 secs]
SUREFIRE-859: [GC 2283040K->1207964K(2709504K), 0.9126370 secs]
SUREFIRE-859: [GC 2281628K->1210985K(2714624K), 0.3696320 secs]
SUREFIRE-859: [GC 2295913K->1211452K(2717696K), 0.3747280 secs]
SUREFIRE-859: [GC 2296380K->1238936K(2713600K), 0.2577980 secs]
SUREFIRE-859: [GC 2327960K->1255597K(2717696K), 0.3727600 secs]
SUREFIRE-859: [GC 2344591K->1264751K(2715648K), 0.3424710 secs]
SUREFIRE-859: [GC 2371183K->1251917K(2719232K), 0.4342140 secs]
SUREFIRE-859: [GC 2358349K->1265275K(2734080K), 0.9340820 secs]
SUREFIRE-859: [GC 2401403K->1262655K(2737152K), 0.5421590 secs]
SUREFIRE-859: [GC 2398783K->1294812K(2744832K), 0.1560640 secs]
SUREFIRE-859: [GC 2445276K->1353715K(2750976K), 0.2854640 secs]
SUREFIRE-859: [GC 2504179K->1417519K(2634240K), 0.3922230 secs]
SUREFIRE-859: [GC 2447151K->1472569K(2684928K), 0.4148040 secs]
SUREFIRE-859: [GC 2502201K->1526484K(2569216K), 0.4025100 secs]
SUREFIRE-859: [GC 2425044K->1571705K(2600448K), 0.6333770 secs]

Results :

Tests run: 0, Failures: 0, Errors: 0, Skipped: 0

[WARNING] File encoding has not been set, using platform encoding ISO-8859-1, i.e. build is
platform dependent! The file encoding for reports output files should be provided by the POM
property ${project.reporting.outputEncoding}.
[INFO] 
[INFO] --- maven-failsafe-plugin:2.18.1:verify (verify) @ hbase-it ---
[INFO] Failsafe report directory: <https://builds.apache.org/job/HBase-1.3-IT/it.test=IntegrationTestBigLinkedList,jdk=latest1.7,label=yahoo-not-h2/ws/hbase-it/target/failsafe-reports>
[WARNING] File encoding has not been set, using platform encoding ISO-8859-1, i.e. build is
platform dependent! The file encoding for reports output files should be provided by the POM
property ${project.reporting.outputEncoding}.
[INFO] ------------------------------------------------------------------------
[INFO] Reactor Summary:
[INFO] 
[INFO] Apache HBase ...................................... SUCCESS [18.380s]
[INFO] Apache HBase - Checkstyle ......................... SUCCESS [3.765s]
[INFO] Apache HBase - Resource Bundle .................... SUCCESS [2.085s]
[INFO] Apache HBase - Annotations ........................ SUCCESS [5.884s]
[INFO] Apache HBase - Protocol ........................... SUCCESS [58.297s]
[INFO] Apache HBase - Common ............................. SUCCESS [41.154s]
[INFO] Apache HBase - Procedure .......................... SUCCESS [5.949s]
[INFO] Apache HBase - Client ............................. SUCCESS [29.923s]
[INFO] Apache HBase - Hadoop Compatibility ............... SUCCESS [1.486s]
[INFO] Apache HBase - Hadoop Two Compatibility ........... SUCCESS [7.946s]
[INFO] Apache HBase - Prefix Tree ........................ SUCCESS [6.137s]
[INFO] Apache HBase - Server ............................. SUCCESS [2:01.159s]
[INFO] Apache HBase - Testing Util ....................... SUCCESS [6.583s]
[INFO] Apache HBase - Thrift ............................. SUCCESS [19.700s]
[INFO] Apache HBase - Rest ............................... SUCCESS [13.235s]
[INFO] Apache HBase - Shell .............................. SUCCESS [5.671s]
[INFO] Apache HBase - Integration Tests .................. FAILURE [30:13.730s]
[INFO] Apache HBase - Examples ........................... SKIPPED
[INFO] Apache HBase - External Block Cache ............... SKIPPED
[INFO] Apache HBase - Assembly ........................... SKIPPED
[INFO] Apache HBase - Shaded ............................. SKIPPED
[INFO] Apache HBase - Shaded - Client .................... SKIPPED
[INFO] Apache HBase - Shaded - Server .................... SKIPPED
[INFO] ------------------------------------------------------------------------
[INFO] BUILD FAILURE
[INFO] ------------------------------------------------------------------------
[INFO] Total time: 36:10.021s
[INFO] Finished at: Fri Apr 22 19:17:09 UTC 2016
[INFO] Final Memory: 199M/4441M
[INFO] ------------------------------------------------------------------------
[ERROR] Failed to execute goal org.apache.maven.plugins:maven-failsafe-plugin:2.18.1:verify
(verify) on project hbase-it: There was a timeout or other error in the fork -> [Help 1]
[ERROR] 
[ERROR] To see the full stack trace of the errors, re-run Maven with the -e switch.
[ERROR] Re-run Maven using the -X switch to enable full debug logging.
[ERROR] 
[ERROR] For more information about the errors and possible solutions, please read the following
articles:
[ERROR] [Help 1] http://cwiki.apache.org/confluence/display/MAVEN/MojoFailureException
[ERROR] 
[ERROR] After correcting the problems, you can resume the build with the command
[ERROR]   mvn <goals> -rf :hbase-it
Build step 'Invoke top-level Maven targets' marked build as failure
Performing Post build task...
Match found for :.* : True
Logical operation result is TRUE
Running script  : # Post-build task script. TODO: Check this in and have all builds reference
check-in.
pwd && ls
# NOTE!!!! The below code has been copied and pasted from ./dev-tools/run-test.sh
# Do not change here without syncing there and vice-versa.
ZOMBIE_TESTS_COUNT=`jps -v | grep surefirebooter | grep -e '-Dhbase.test' | wc -l`
if [[ $ZOMBIE_TESTS_COUNT != 0 ]] ; then
 echo "Suspicious java process found - waiting 30s to see if there are just slow to stop"
 sleep 30
 ZOMBIE_TESTS_COUNT=`jps -v | grep surefirebooter | grep -e '-Dhbase.test' | wc -l`
 if [[ $ZOMBIE_TESTS_COUNT != 0 ]] ; then
   echo " {color:red}There appear to be $ZOMBIE_TESTS_COUNT zombie tests{color}, they should
have been killed by surefire but survived"
   jps -v | grep surefirebooter | grep -e '-Dhbase.test'
   jps -v | grep surefirebooter | grep -e '-Dhbase.test' | cut -d ' ' -f 1 | xargs -n 1 jstack
   # Exit with error
   exit 1
 else
   echo "We're ok: there is no zombie test, but some tests took some time to stop"
 fi
else
  echo "We're ok: there is no zombie test"
fi
[yahoo-not-h2] $ /bin/bash -xe /tmp/hudson2550596425058358551.sh
+ pwd
<https://builds.apache.org/job/HBase-1.3-IT/it.test=IntegrationTestBigLinkedList,jdk=latest1.7,label=yahoo-not-h2/ws/>
+ ls
bin
CHANGES.txt
conf
dev-support
hbase-annotations
hbase-assembly
hbase-checkstyle
hbase-client
hbase-common
hbase-examples
hbase-external-blockcache
hbase-hadoop2-compat
hbase-hadoop-compat
hbase-it
hbase-native-client
hbase-prefix-tree
hbase-procedure
hbase-protocol
hbase-resource-bundle
hbase-rest
hbase-server
hbase-shaded
hbase-shell
hbase-testing-util
hbase-thrift
LICENSE.txt
NOTICE.txt
pom.xml
README.txt
src
target
++ jps -v
++ grep surefirebooter
++ wc -l
++ grep -e -Dhbase.test
+ ZOMBIE_TESTS_COUNT=0
+ [[ 0 != 0 ]]
+ echo 'We'\''re ok: there is no zombie test'
We're ok: there is no zombie test
POST BUILD TASK : SUCCESS
END OF POST BUILD TASK : 0
Archiving artifacts

Mime
View raw message