hbase-builds mailing list archives

Site index · List index
Message view « Date » · « Thread »
Top « Date » · « Thread »
From Apache Jenkins Server <jenk...@builds.apache.org>
Subject Build failed in Jenkins: HBase-1.2 » latest1.7,yahoo-not-h2 #594
Date Fri, 01 Apr 2016 12:40:27 GMT
See <https://builds.apache.org/job/HBase-1.2/jdk=latest1.7,label=yahoo-not-h2/594/changes>

Changes:

[stack] HBASE-15569 Make Bytes.toStringBinary faster

[Gary Helmling] HBASE-15234 Don't abort ReplicationLogCleaner on ZooKeeper errors

------------------------------------------
[...truncated 46258 lines...]
Running org.apache.hadoop.hbase.fs.TestBlockReorder
Running org.apache.hadoop.hbase.replication.TestPerTableCFReplication
Tests run: 1, Failures: 0, Errors: 0, Skipped: 0, Time elapsed: 98.777 sec - in org.apache.hadoop.hbase.replication.TestReplicationKillMasterRSCompressed
Running org.apache.hadoop.hbase.master.TestOpenedRegionHandler
Tests run: 3, Failures: 0, Errors: 0, Skipped: 0, Time elapsed: 68.729 sec - in org.apache.hadoop.hbase.fs.TestBlockReorder
Tests run: 2, Failures: 0, Errors: 0, Skipped: 0, Time elapsed: 49.316 sec - in org.apache.hadoop.hbase.replication.TestPerTableCFReplication
Running org.apache.hadoop.hbase.master.normalizer.TestSimpleRegionNormalizerOnCluster
Tests run: 2, Failures: 0, Errors: 0, Skipped: 0, Time elapsed: 34.758 sec - in org.apache.hadoop.hbase.master.TestOpenedRegionHandler
Running org.apache.hadoop.hbase.master.cleaner.TestLogsCleaner
Running org.apache.hadoop.hbase.master.TestMetaShutdownHandler
Tests run: 3, Failures: 0, Errors: 0, Skipped: 0, Time elapsed: 16.069 sec - in org.apache.hadoop.hbase.master.cleaner.TestLogsCleaner
Tests run: 2, Failures: 0, Errors: 0, Skipped: 0, Time elapsed: 38.688 sec - in org.apache.hadoop.hbase.master.normalizer.TestSimpleRegionNormalizerOnCluster
Running org.apache.hadoop.hbase.master.cleaner.TestHFileCleaner
Tests run: 3, Failures: 0, Errors: 0, Skipped: 0, Time elapsed: 2.101 sec - in org.apache.hadoop.hbase.master.cleaner.TestHFileCleaner
Tests run: 1, Failures: 0, Errors: 0, Skipped: 0, Time elapsed: 31.938 sec - in org.apache.hadoop.hbase.master.TestMetaShutdownHandler
Running org.apache.hadoop.hbase.master.TestRegionPlacement
Tests run: 2, Failures: 0, Errors: 0, Skipped: 2, Time elapsed: 0.003 sec - in org.apache.hadoop.hbase.master.TestRegionPlacement
Running org.apache.hadoop.hbase.master.TestMasterRestartAfterDisablingTable
Running org.apache.hadoop.hbase.master.TestClusterStatusPublisher
Tests run: 3, Failures: 0, Errors: 0, Skipped: 0, Time elapsed: 1.303 sec - in org.apache.hadoop.hbase.master.TestClusterStatusPublisher
Running org.apache.hadoop.hbase.master.cleaner.TestSnapshotFromMaster
Running org.apache.hadoop.hbase.master.procedure.TestProcedureAdmin
Tests run: 1, Failures: 0, Errors: 0, Skipped: 0, Time elapsed: 39.418 sec - in org.apache.hadoop.hbase.master.TestMasterRestartAfterDisablingTable
Running org.apache.hadoop.hbase.master.procedure.TestServerCrashProcedure
Tests run: 5, Failures: 0, Errors: 0, Skipped: 0, Time elapsed: 17.044 sec - in org.apache.hadoop.hbase.master.procedure.TestProcedureAdmin
Running org.apache.hadoop.hbase.master.procedure.TestWALProcedureStoreOnHDFS
Tests run: 4, Failures: 0, Errors: 0, Skipped: 0, Time elapsed: 74.656 sec - in org.apache.hadoop.hbase.master.cleaner.TestSnapshotFromMaster
Tests run: 1, Failures: 0, Errors: 0, Skipped: 0, Time elapsed: 57.978 sec - in org.apache.hadoop.hbase.master.procedure.TestServerCrashProcedure
Running org.apache.hadoop.hbase.master.procedure.TestCreateTableProcedure2
Tests run: 3, Failures: 0, Errors: 0, Skipped: 0, Time elapsed: 64.609 sec - in org.apache.hadoop.hbase.master.procedure.TestWALProcedureStoreOnHDFS
Tests run: 1, Failures: 0, Errors: 0, Skipped: 0, Time elapsed: 26.717 sec - in org.apache.hadoop.hbase.master.procedure.TestCreateTableProcedure2
Running org.apache.hadoop.hbase.master.procedure.TestAddColumnFamilyProcedure
Running org.apache.hadoop.hbase.master.procedure.TestEnableTableProcedure
Running org.apache.hadoop.hbase.master.procedure.TestModifyTableProcedure
Tests run: 6, Failures: 0, Errors: 0, Skipped: 0, Time elapsed: 40.7 sec - in org.apache.hadoop.hbase.master.procedure.TestAddColumnFamilyProcedure
Tests run: 5, Failures: 0, Errors: 0, Skipped: 0, Time elapsed: 38.414 sec - in org.apache.hadoop.hbase.master.procedure.TestEnableTableProcedure
Running org.apache.hadoop.hbase.master.procedure.TestCreateTableProcedure
Tests run: 8, Failures: 0, Errors: 0, Skipped: 0, Time elapsed: 62.804 sec - in org.apache.hadoop.hbase.master.procedure.TestModifyTableProcedure
Running org.apache.hadoop.hbase.master.procedure.TestTruncateTableProcedure
Tests run: 7, Failures: 0, Errors: 0, Skipped: 0, Time elapsed: 47.208 sec - in org.apache.hadoop.hbase.master.procedure.TestCreateTableProcedure
Running org.apache.hadoop.hbase.master.procedure.TestModifyColumnFamilyProcedure
Tests run: 6, Failures: 0, Errors: 0, Skipped: 0, Time elapsed: 54.312 sec - in org.apache.hadoop.hbase.master.procedure.TestTruncateTableProcedure
Running org.apache.hadoop.hbase.master.procedure.TestDeleteColumnFamilyProcedure
Tests run: 5, Failures: 0, Errors: 0, Skipped: 0, Time elapsed: 35.649 sec - in org.apache.hadoop.hbase.master.procedure.TestModifyColumnFamilyProcedure
Running org.apache.hadoop.hbase.master.procedure.TestDeleteTableProcedure
Running org.apache.hadoop.hbase.master.procedure.TestMasterProcedureEvents
Tests run: 8, Failures: 0, Errors: 0, Skipped: 0, Time elapsed: 48.306 sec - in org.apache.hadoop.hbase.master.procedure.TestDeleteColumnFamilyProcedure
Tests run: 7, Failures: 0, Errors: 0, Skipped: 0, Time elapsed: 28.548 sec - in org.apache.hadoop.hbase.master.procedure.TestDeleteTableProcedure
Tests run: 2, Failures: 0, Errors: 0, Skipped: 0, Time elapsed: 26.859 sec - in org.apache.hadoop.hbase.master.procedure.TestMasterProcedureEvents
Running org.apache.hadoop.hbase.master.procedure.TestDisableTableProcedure
Running org.apache.hadoop.hbase.master.handler.TestTableDeleteFamilyHandler
Tests run: 4, Failures: 0, Errors: 0, Skipped: 0, Time elapsed: 19.602 sec - in org.apache.hadoop.hbase.master.procedure.TestDisableTableProcedure
Running org.apache.hadoop.hbase.master.handler.TestCreateTableHandler
Running org.apache.hadoop.hbase.master.handler.TestTableDescriptorModification
Tests run: 2, Failures: 0, Errors: 0, Skipped: 0, Time elapsed: 41.232 sec - in org.apache.hadoop.hbase.master.handler.TestTableDeleteFamilyHandler
Running org.apache.hadoop.hbase.master.handler.TestEnableTableHandler
Tests run: 3, Failures: 0, Errors: 0, Skipped: 0, Time elapsed: 53.413 sec - in org.apache.hadoop.hbase.master.handler.TestCreateTableHandler
Tests run: 7, Failures: 0, Errors: 0, Skipped: 0, Time elapsed: 63.615 sec - in org.apache.hadoop.hbase.master.handler.TestTableDescriptorModification
Running org.apache.hadoop.hbase.master.TestRestartCluster
Running org.apache.hadoop.hbase.master.TestRegionPlacement2
Tests run: 2, Failures: 0, Errors: 0, Skipped: 0, Time elapsed: 2.959 sec - in org.apache.hadoop.hbase.master.TestRegionPlacement2
Tests run: 3, Failures: 0, Errors: 0, Skipped: 0, Time elapsed: 93.4 sec - in org.apache.hadoop.hbase.master.handler.TestEnableTableHandler
Running org.apache.hadoop.hbase.master.TestAssignmentListener
Running org.apache.hadoop.hbase.master.TestMasterNoCluster
Tests run: 2, Failures: 0, Errors: 0, Skipped: 0, Time elapsed: 15.468 sec - in org.apache.hadoop.hbase.master.TestAssignmentListener
Tests run: 3, Failures: 0, Errors: 0, Skipped: 0, Time elapsed: 21.201 sec - in org.apache.hadoop.hbase.master.TestMasterNoCluster
Tests run: 3, Failures: 0, Errors: 0, Skipped: 0, Time elapsed: 93.676 sec - in org.apache.hadoop.hbase.master.TestRestartCluster
Running org.apache.hadoop.hbase.master.TestZKBasedOpenCloseRegion
Tests run: 3, Failures: 0, Errors: 0, Skipped: 0, Time elapsed: 8.515 sec - in org.apache.hadoop.hbase.master.TestZKBasedOpenCloseRegion
Running org.apache.hadoop.hbase.master.TestWarmupRegion
Running org.apache.hadoop.hbase.master.TestDeadServer
Running org.apache.hadoop.hbase.master.balancer.TestBaseLoadBalancer
Tests run: 4, Failures: 0, Errors: 0, Skipped: 0, Time elapsed: 3.317 sec - in org.apache.hadoop.hbase.master.TestDeadServer
Tests run: 7, Failures: 0, Errors: 0, Skipped: 0, Time elapsed: 2.628 sec - in org.apache.hadoop.hbase.master.balancer.TestBaseLoadBalancer
Running org.apache.hadoop.hbase.master.balancer.TestStochasticLoadBalancer
Running org.apache.hadoop.hbase.master.balancer.TestDefaultLoadBalancer
Tests run: 1, Failures: 0, Errors: 0, Skipped: 0, Time elapsed: 12.579 sec - in org.apache.hadoop.hbase.master.balancer.TestDefaultLoadBalancer
Running org.apache.hadoop.hbase.master.TestGetInfoPort
Tests run: 1, Failures: 0, Errors: 0, Skipped: 0, Time elapsed: 47.416 sec - in org.apache.hadoop.hbase.master.TestWarmupRegion
Running org.apache.hadoop.hbase.master.TestGetLastFlushedSequenceId
Tests run: 1, Failures: 0, Errors: 0, Skipped: 0, Time elapsed: 28.218 sec - in org.apache.hadoop.hbase.master.TestGetInfoPort
Running org.apache.hadoop.hbase.master.TestSplitLogManager
Tests run: 1, Failures: 0, Errors: 0, Skipped: 0, Time elapsed: 35.52 sec - in org.apache.hadoop.hbase.master.TestGetLastFlushedSequenceId
Running org.apache.hadoop.hbase.master.TestRollingRestart
Tests run: 1, Failures: 0, Errors: 0, Skipped: 0, Time elapsed: 63.535 sec - in org.apache.hadoop.hbase.master.TestRollingRestart
Running org.apache.hadoop.hbase.master.TestMasterPriorityRpc
Tests run: 3, Failures: 0, Errors: 0, Skipped: 0, Time elapsed: 7.613 sec - in org.apache.hadoop.hbase.master.TestMasterPriorityRpc
Running org.apache.hadoop.hbase.master.TestMasterFileSystem
Tests run: 2, Failures: 0, Errors: 0, Skipped: 0, Time elapsed: 1.711 sec - in org.apache.hadoop.hbase.master.TestMasterFileSystem
Running org.apache.hadoop.hbase.master.TestMasterTransitions
Tests run: 3, Failures: 0, Errors: 0, Skipped: 3, Time elapsed: 0.003 sec - in org.apache.hadoop.hbase.master.TestMasterTransitions
Running org.apache.hadoop.hbase.master.TestAssignmentManagerOnCluster
Tests run: 15, Failures: 0, Errors: 0, Skipped: 1, Time elapsed: 150.643 sec - in org.apache.hadoop.hbase.master.TestSplitLogManager
Running org.apache.hadoop.hbase.master.TestMasterFailover
Tests run: 19, Failures: 0, Errors: 0, Skipped: 1, Time elapsed: 358.43 sec - in org.apache.hadoop.hbase.master.balancer.TestStochasticLoadBalancer
Tests run: 7, Failures: 0, Errors: 0, Skipped: 0, Time elapsed: 148.067 sec - in org.apache.hadoop.hbase.master.TestMasterFailover
Running org.apache.hadoop.hbase.master.snapshot.TestSnapshotFileCache
Running org.apache.hadoop.hbase.master.TestMasterMetrics
Tests run: 2, Failures: 0, Errors: 0, Skipped: 0, Time elapsed: 1.81 sec - in org.apache.hadoop.hbase.master.TestMasterMetrics
Tests run: 21, Failures: 0, Errors: 0, Skipped: 0, Time elapsed: 203.655 sec - in org.apache.hadoop.hbase.master.TestAssignmentManagerOnCluster
Running org.apache.hadoop.hbase.master.TestMasterFailoverBalancerPersistence
Running org.apache.hadoop.hbase.master.TestMaster
Tests run: 5, Failures: 0, Errors: 0, Skipped: 0, Time elapsed: 67.548 sec - in org.apache.hadoop.hbase.master.snapshot.TestSnapshotFileCache
Running org.apache.hadoop.hbase.master.TestMasterShutdown
Tests run: 1, Failures: 0, Errors: 0, Skipped: 0, Time elapsed: 37.631 sec - in org.apache.hadoop.hbase.master.TestMasterFailoverBalancerPersistence
Running org.apache.hadoop.hbase.master.TestMasterStatusServlet
Tests run: 4, Failures: 0, Errors: 0, Skipped: 0, Time elapsed: 8.502 sec - in org.apache.hadoop.hbase.master.TestMasterStatusServlet
Tests run: 4, Failures: 0, Errors: 0, Skipped: 0, Time elapsed: 35.38 sec - in org.apache.hadoop.hbase.master.TestMaster
Tests run: 2, Failures: 0, Errors: 0, Skipped: 0, Time elapsed: 43.978 sec - in org.apache.hadoop.hbase.master.TestMasterShutdown
Running org.apache.hadoop.hbase.master.TestHMasterRPCException
Running org.apache.hadoop.hbase.master.TestMasterOperationsForRegionReplicas
Running org.apache.hadoop.hbase.master.TestMasterMetricsWrapper
Tests run: 1, Failures: 0, Errors: 0, Skipped: 0, Time elapsed: 2.636 sec - in org.apache.hadoop.hbase.master.TestMasterMetricsWrapper
Tests run: 1, Failures: 0, Errors: 0, Skipped: 0, Time elapsed: 11.309 sec - in org.apache.hadoop.hbase.master.TestHMasterRPCException
Running org.apache.hadoop.hbase.master.TestTableLockManager
Running org.apache.hadoop.hbase.master.TestActiveMasterManager
Tests run: 2, Failures: 0, Errors: 0, Skipped: 0, Time elapsed: 4.95 sec - in org.apache.hadoop.hbase.master.TestActiveMasterManager
Tests run: 2, Failures: 0, Errors: 0, Skipped: 0, Time elapsed: 47.268 sec - in org.apache.hadoop.hbase.master.TestMasterOperationsForRegionReplicas
Tests run: 4, Failures: 0, Errors: 0, Skipped: 0, Time elapsed: 133.922 sec - in org.apache.hadoop.hbase.master.TestTableLockManager

Results :

Flaked tests: 
org.apache.hadoop.hbase.coprocessor.TestRowProcessorEndpoint.testMultipleRows(org.apache.hadoop.hbase.coprocessor.TestRowProcessorEndpoint)
  Run 1: TestRowProcessorEndpoint.testMultipleRows:246 expected:<3> but was:<2>
  Run 2: PASS

org.apache.hadoop.hbase.regionserver.TestAtomicOperation.testMultiRowMutationMultiThreads(org.apache.hadoop.hbase.regionserver.TestAtomicOperation)
  Run 1: TestAtomicOperation.teardown:106 » DroppedSnapshot Failed clearing memory afte...
  Run 2: PASS


Tests run: 2408, Failures: 0, Errors: 0, Skipped: 41, Flakes: 2

[INFO] ------------------------------------------------------------------------
[INFO] Reactor Summary:
[INFO] 
[INFO] Apache HBase ...................................... SUCCESS [1:15.950s]
[INFO] Apache HBase - Checkstyle ......................... SUCCESS [6.957s]
[INFO] Apache HBase - Resource Bundle .................... SUCCESS [0.508s]
[INFO] Apache HBase - Annotations ........................ SUCCESS [2.130s]
[INFO] Apache HBase - Protocol ........................... SUCCESS [42.187s]
[INFO] Apache HBase - Common ............................. SUCCESS [4:43.026s]
[INFO] Apache HBase - Procedure .......................... SUCCESS [5:11.133s]
[INFO] Apache HBase - Client ............................. SUCCESS [2:32.264s]
[INFO] Apache HBase - Hadoop Compatibility ............... SUCCESS [12.913s]
[INFO] Apache HBase - Hadoop Two Compatibility ........... SUCCESS [20.127s]
[INFO] Apache HBase - Prefix Tree ........................ SUCCESS [26.120s]
[INFO] Apache HBase - Server ............................. FAILURE [4:14:38.045s]
[INFO] Apache HBase - Testing Util ....................... SKIPPED
[INFO] Apache HBase - Thrift ............................. SKIPPED
[INFO] Apache HBase - Rest ............................... SKIPPED
[INFO] Apache HBase - Shell .............................. SKIPPED
[INFO] Apache HBase - Integration Tests .................. SKIPPED
[INFO] Apache HBase - Examples ........................... SKIPPED
[INFO] Apache HBase - External Block Cache ............... SKIPPED
[INFO] Apache HBase - Assembly ........................... SKIPPED
[INFO] Apache HBase - Shaded ............................. SKIPPED
[INFO] Apache HBase - Shaded - Client .................... SKIPPED
[INFO] Apache HBase - Shaded - Server .................... SKIPPED
[INFO] ------------------------------------------------------------------------
[INFO] BUILD FAILURE
[INFO] ------------------------------------------------------------------------
[INFO] Total time: 4:30:40.063s
[INFO] Finished at: Fri Apr 01 12:34:44 UTC 2016
[INFO] Final Memory: 59M/637M
[INFO] ------------------------------------------------------------------------
[ERROR] Failed to execute goal org.apache.maven.plugins:maven-surefire-plugin:2.18.1:test
(secondPartTestsExecution) on project hbase-server: There was a timeout or other error in
the fork -> [Help 1]
[ERROR] 
[ERROR] To see the full stack trace of the errors, re-run Maven with the -e switch.
[ERROR] Re-run Maven using the -X switch to enable full debug logging.
[ERROR] 
[ERROR] For more information about the errors and possible solutions, please read the following
articles:
[ERROR] [Help 1] http://cwiki.apache.org/confluence/display/MAVEN/MojoFailureException
[ERROR] 
[ERROR] After correcting the problems, you can resume the build with the command
[ERROR]   mvn <goals> -rf :hbase-server
Build step 'Invoke top-level Maven targets' marked build as failure
Performing Post build task...
Match found for :.* : True
Logical operation result is TRUE
Running script  : # Post-build task script. TODO: Check this in and have all builds reference
check-in.
pwd && ls
# NOTE!!!! The below code has been copied and pasted from ./dev-tools/run-test.sh
# Do not change here without syncing there and vice-versa.
ZOMBIE_TESTS_COUNT=`jps -v | grep surefirebooter | grep -e '-Dhbase.test' | wc -l`
if [[ $ZOMBIE_TESTS_COUNT != 0 ]] ; then
 echo "Suspicious java process found - waiting 30s to see if there are just slow to stop"
 sleep 30
 ZOMBIE_TESTS_COUNT=`jps -v | grep surefirebooter | grep -e '-Dhbase.test' | wc -l`
 if [[ $ZOMBIE_TESTS_COUNT != 0 ]] ; then
   echo " {color:red}There appear to be $ZOMBIE_TESTS_COUNT zombie tests{color}, they should
have been killed by surefire but survived"
   jps -v | grep surefirebooter | grep -e '-Dhbase.test'
   jps -v | grep surefirebooter | grep -e '-Dhbase.test' | cut -d ' ' -f 1 | xargs -n 1 jstack
   # Exit with error
   exit 1
 else
   echo "We're ok: there is no zombie test, but some tests took some time to stop"
 fi
else
  echo "We're ok: there is no zombie test"
fi
[yahoo-not-h2] $ /bin/bash -xe /tmp/hudson3044639431060778205.sh
+ pwd
<https://builds.apache.org/job/HBase-1.2/jdk=latest1.7,label=yahoo-not-h2/ws/>
+ ls
bin
CHANGES.txt
conf
dev-support
hbase-annotations
hbase-assembly
hbase-checkstyle
hbase-client
hbase-common
hbase-examples
hbase-external-blockcache
hbase-hadoop2-compat
hbase-hadoop-compat
hbase-it
hbase-native-client
hbase-prefix-tree
hbase-procedure
hbase-protocol
hbase-resource-bundle
hbase-rest
hbase-server
hbase-shaded
hbase-shell
hbase-testing-util
hbase-thrift
LICENSE.txt
NOTICE.txt
pom.xml
README.txt
src
target
++ jps -v
++ grep surefirebooter
++ grep -e -Dhbase.test
++ wc -l
+ ZOMBIE_TESTS_COUNT=0
+ [[ 0 != 0 ]]
+ echo 'We'\''re ok: there is no zombie test'
We're ok: there is no zombie test
POST BUILD TASK : SUCCESS
END OF POST BUILD TASK : 0
Archiving artifacts
Recording test results

Mime
View raw message