hbase-builds mailing list archives

Site index · List index
Message view « Date » · « Thread »
Top « Date » · « Thread »
From Apache Jenkins Server <jenk...@builds.apache.org>
Subject Build failed in Jenkins: HBase-Trunk_matrix » latest1.7,yahoo-not-h2 #870
Date Mon, 25 Apr 2016 22:27:23 GMT
See <https://builds.apache.org/job/HBase-Trunk_matrix/jdk=latest1.7,label=yahoo-not-h2/870/changes>

Changes:

[tedyu] HBASE-14252 RegionServers fail to start when setting

------------------------------------------
[...truncated 4704 lines...]
Tests run: 9, Failures: 0, Errors: 0, Skipped: 0, Time elapsed: 1.734 sec - in org.apache.hadoop.hbase.TestSerialization
Running org.apache.hadoop.hbase.mob.TestMobFileCache
Tests run: 1, Failures: 0, Errors: 0, Skipped: 0, Time elapsed: 2.395 sec - in org.apache.hadoop.hbase.mob.TestMobFileCache
Running org.apache.hadoop.hbase.mob.TestCachedMobFile
Tests run: 3, Failures: 0, Errors: 0, Skipped: 0, Time elapsed: 1.1 sec - in org.apache.hadoop.hbase.mob.TestCachedMobFile
Running org.apache.hadoop.hbase.mob.mapreduce.TestMobSweepMapper
Tests run: 1, Failures: 0, Errors: 0, Skipped: 0, Time elapsed: 1.54 sec - in org.apache.hadoop.hbase.mob.mapreduce.TestMobSweepMapper
Running org.apache.hadoop.hbase.mob.compactions.TestPartitionedMobCompactionRequest
Tests run: 2, Failures: 0, Errors: 0, Skipped: 0, Time elapsed: 0.187 sec - in org.apache.hadoop.hbase.mob.compactions.TestPartitionedMobCompactionRequest
Running org.apache.hadoop.hbase.mob.TestMobFile
Tests run: 2, Failures: 0, Errors: 0, Skipped: 0, Time elapsed: 1.047 sec - in org.apache.hadoop.hbase.mob.TestMobFile
Running org.apache.hadoop.hbase.mob.TestMobFileLink
Tests run: 1, Failures: 0, Errors: 0, Skipped: 0, Time elapsed: 1.126 sec - in org.apache.hadoop.hbase.mob.TestMobFileLink
Running org.apache.hadoop.hbase.mob.TestMobFileName
Tests run: 4, Failures: 0, Errors: 0, Skipped: 0, Time elapsed: 0.296 sec - in org.apache.hadoop.hbase.mob.TestMobFileName
Running org.apache.hadoop.hbase.io.encoding.TestSeekBeforeWithReverseScan
Tests run: 2, Failures: 0, Errors: 0, Skipped: 0, Time elapsed: 1.812 sec - in org.apache.hadoop.hbase.io.encoding.TestSeekBeforeWithReverseScan
Running org.apache.hadoop.hbase.io.encoding.TestSeekToBlockWithEncoders
Tests run: 18, Failures: 0, Errors: 0, Skipped: 0, Time elapsed: 0.687 sec - in org.apache.hadoop.hbase.io.encoding.TestSeekToBlockWithEncoders
Running org.apache.hadoop.hbase.io.encoding.TestPrefixTreeEncoding
Tests run: 8, Failures: 0, Errors: 0, Skipped: 0, Time elapsed: 1.603 sec - in org.apache.hadoop.hbase.io.encoding.TestPrefixTreeEncoding
Running org.apache.hadoop.hbase.io.encoding.TestPrefixTree
Tests run: 2, Failures: 0, Errors: 0, Skipped: 0, Time elapsed: 1.913 sec - in org.apache.hadoop.hbase.io.encoding.TestPrefixTree
Running org.apache.hadoop.hbase.io.asyncfs.TestLocalAsyncOutput
Tests run: 1, Failures: 0, Errors: 0, Skipped: 0, Time elapsed: 0.674 sec - in org.apache.hadoop.hbase.io.asyncfs.TestLocalAsyncOutput
Running org.apache.hadoop.hbase.io.TestByteBufferOutputStream
Tests run: 1, Failures: 0, Errors: 0, Skipped: 0, Time elapsed: 0.159 sec - in org.apache.hadoop.hbase.io.TestByteBufferOutputStream
Running org.apache.hadoop.hbase.io.TestHFileLink
Tests run: 2, Failures: 0, Errors: 0, Skipped: 0, Time elapsed: 0.269 sec - in org.apache.hadoop.hbase.io.TestHFileLink
Running org.apache.hadoop.hbase.io.TestHalfStoreFileReader
Tests run: 2, Failures: 0, Errors: 0, Skipped: 0, Time elapsed: 1.322 sec - in org.apache.hadoop.hbase.io.TestHalfStoreFileReader
Running org.apache.hadoop.hbase.io.hfile.TestHFileWriterV3
Tests run: 4, Failures: 0, Errors: 0, Skipped: 0, Time elapsed: 3.348 sec - in org.apache.hadoop.hbase.io.hfile.TestHFileWriterV3
Running org.apache.hadoop.hbase.io.hfile.TestCombinedBlockCache
Tests run: 1, Failures: 0, Errors: 0, Skipped: 0, Time elapsed: 0.168 sec - in org.apache.hadoop.hbase.io.hfile.TestCombinedBlockCache
Running org.apache.hadoop.hbase.io.hfile.TestScannerSelectionUsingKeyRange
Tests run: 3, Failures: 0, Errors: 0, Skipped: 0, Time elapsed: 1.951 sec - in org.apache.hadoop.hbase.io.hfile.TestScannerSelectionUsingKeyRange
Running org.apache.hadoop.hbase.io.hfile.TestLruCachedBlock
Tests run: 1, Failures: 0, Errors: 0, Skipped: 0, Time elapsed: 0.346 sec - in org.apache.hadoop.hbase.io.hfile.TestLruCachedBlock
Running org.apache.hadoop.hbase.io.hfile.TestLazyDataBlockDecompression
Tests run: 2, Failures: 0, Errors: 0, Skipped: 0, Time elapsed: 1.423 sec - in org.apache.hadoop.hbase.io.hfile.TestLazyDataBlockDecompression
Running org.apache.hadoop.hbase.io.hfile.TestCachedBlockQueue
Tests run: 2, Failures: 0, Errors: 0, Skipped: 0, Time elapsed: 0.201 sec - in org.apache.hadoop.hbase.io.hfile.TestCachedBlockQueue
Running org.apache.hadoop.hbase.io.hfile.TestFixedFileTrailer
Tests run: 4, Failures: 0, Errors: 0, Skipped: 0, Time elapsed: 1.029 sec - in org.apache.hadoop.hbase.io.hfile.TestFixedFileTrailer
Running org.apache.hadoop.hbase.io.hfile.TestReseekTo
Tests run: 1, Failures: 0, Errors: 0, Skipped: 0, Time elapsed: 1.292 sec - in org.apache.hadoop.hbase.io.hfile.TestReseekTo
Running org.apache.hadoop.hbase.io.hfile.TestHFile
Tests run: 9, Failures: 0, Errors: 0, Skipped: 0, Time elapsed: 0.894 sec - in org.apache.hadoop.hbase.io.hfile.TestHFile
Running org.apache.hadoop.hbase.io.hfile.TestSeekTo
Tests run: 20, Failures: 0, Errors: 0, Skipped: 0, Time elapsed: 2.054 sec - in org.apache.hadoop.hbase.io.hfile.TestSeekTo
Running org.apache.hadoop.hbase.io.hfile.TestHFileInlineToRootChunkConversion
Tests run: 1, Failures: 0, Errors: 0, Skipped: 0, Time elapsed: 0.995 sec - in org.apache.hadoop.hbase.io.hfile.TestHFileInlineToRootChunkConversion
Running org.apache.hadoop.hbase.io.hfile.TestHFileEncryption
Tests run: 3, Failures: 0, Errors: 0, Skipped: 0, Time elapsed: 4.245 sec - in org.apache.hadoop.hbase.io.hfile.TestHFileEncryption
Running org.apache.hadoop.hbase.io.hfile.TestLruBlockCache
Tests run: 10, Failures: 0, Errors: 0, Skipped: 0, Time elapsed: 0.932 sec - in org.apache.hadoop.hbase.io.hfile.TestLruBlockCache
Running org.apache.hadoop.hbase.io.hfile.TestHFileBlockPositionalRead
Tests run: 6, Failures: 0, Errors: 0, Skipped: 0, Time elapsed: 0.511 sec - in org.apache.hadoop.hbase.io.hfile.TestHFileBlockPositionalRead
Running org.apache.hadoop.hbase.io.hfile.TestPrefetch
Tests run: 2, Failures: 0, Errors: 0, Skipped: 0, Time elapsed: 2.127 sec - in org.apache.hadoop.hbase.io.hfile.TestPrefetch
Running org.apache.hadoop.hbase.io.hfile.TestBlockCacheReporting
Tests run: 2, Failures: 0, Errors: 0, Skipped: 0, Time elapsed: 1.005 sec - in org.apache.hadoop.hbase.io.hfile.TestBlockCacheReporting
Running org.apache.hadoop.hbase.io.hfile.bucket.TestBucketCache
Tests run: 10, Failures: 0, Errors: 0, Skipped: 0, Time elapsed: 8.471 sec - in org.apache.hadoop.hbase.io.hfile.bucket.TestBucketCache
Running org.apache.hadoop.hbase.io.hfile.bucket.TestFileMmapEngine
Tests run: 1, Failures: 0, Errors: 0, Skipped: 0, Time elapsed: 0.179 sec - in org.apache.hadoop.hbase.io.hfile.bucket.TestFileMmapEngine
Running org.apache.hadoop.hbase.io.hfile.bucket.TestBucketWriterThread
Tests run: 4, Failures: 0, Errors: 0, Skipped: 0, Time elapsed: 0.686 sec - in org.apache.hadoop.hbase.io.hfile.bucket.TestBucketWriterThread
Running org.apache.hadoop.hbase.io.hfile.bucket.TestByteBufferIOEngine
Tests run: 2, Failures: 0, Errors: 0, Skipped: 0, Time elapsed: 0.409 sec - in org.apache.hadoop.hbase.io.hfile.bucket.TestByteBufferIOEngine
Running org.apache.hadoop.hbase.io.hfile.bucket.TestFileIOEngine
Tests run: 1, Failures: 0, Errors: 0, Skipped: 0, Time elapsed: 0.17 sec - in org.apache.hadoop.hbase.io.hfile.bucket.TestFileIOEngine
Running org.apache.hadoop.hbase.io.hfile.TestHFileDataBlockEncoder
Tests run: 40, Failures: 0, Errors: 0, Skipped: 0, Time elapsed: 2.189 sec - in org.apache.hadoop.hbase.io.hfile.TestHFileDataBlockEncoder
Running org.apache.hadoop.hbase.io.hfile.TestChecksum
Tests run: 4, Failures: 0, Errors: 0, Skipped: 0, Time elapsed: 1.124 sec - in org.apache.hadoop.hbase.io.hfile.TestChecksum
Running org.apache.hadoop.hbase.io.TestImmutableBytesWritable
Tests run: 3, Failures: 0, Errors: 0, Skipped: 0, Time elapsed: 0.239 sec - in org.apache.hadoop.hbase.io.TestImmutableBytesWritable
Running org.apache.hadoop.hbase.io.TestHeapSize
Tests run: 3, Failures: 0, Errors: 0, Skipped: 0, Time elapsed: 0.221 sec - in org.apache.hadoop.hbase.io.TestHeapSize
Running org.apache.hadoop.hbase.io.TestReference
Tests run: 1, Failures: 0, Errors: 0, Skipped: 0, Time elapsed: 0.672 sec - in org.apache.hadoop.hbase.io.TestReference
Running org.apache.hadoop.hbase.procedure.TestProcedureManager
Tests run: 1, Failures: 0, Errors: 0, Skipped: 0, Time elapsed: 1.661 sec - in org.apache.hadoop.hbase.procedure.TestProcedureManager
Running org.apache.hadoop.hbase.procedure.TestProcedure
Tests run: 4, Failures: 0, Errors: 0, Skipped: 0, Time elapsed: 0.584 sec - in org.apache.hadoop.hbase.procedure.TestProcedure
Running org.apache.hadoop.hbase.procedure.TestProcedureCoordinator
Tests run: 7, Failures: 0, Errors: 0, Skipped: 0, Time elapsed: 0.546 sec - in org.apache.hadoop.hbase.procedure.TestProcedureCoordinator
Running org.apache.hadoop.hbase.procedure.TestProcedureMember
Tests run: 8, Failures: 0, Errors: 0, Skipped: 0, Time elapsed: 0.703 sec - in org.apache.hadoop.hbase.procedure.TestProcedureMember
Running org.apache.hadoop.hbase.ipc.TestBufferChain
Tests run: 5, Failures: 0, Errors: 0, Skipped: 0, Time elapsed: 0.569 sec - in org.apache.hadoop.hbase.ipc.TestBufferChain
Running org.apache.hadoop.hbase.ipc.TestIPC
Tests run: 7, Failures: 0, Errors: 0, Skipped: 0, Time elapsed: 2.341 sec - in org.apache.hadoop.hbase.ipc.TestIPC
Running org.apache.hadoop.hbase.ipc.TestRpcHandlerException
Tests run: 1, Failures: 0, Errors: 0, Skipped: 1, Time elapsed: 0.001 sec - in org.apache.hadoop.hbase.ipc.TestRpcHandlerException
Running org.apache.hadoop.hbase.ipc.TestSimpleRpcScheduler
Tests run: 7, Failures: 0, Errors: 0, Skipped: 0, Time elapsed: 8.208 sec - in org.apache.hadoop.hbase.ipc.TestSimpleRpcScheduler
Running org.apache.hadoop.hbase.ipc.TestCallRunner
Tests run: 1, Failures: 0, Errors: 0, Skipped: 0, Time elapsed: 0.589 sec - in org.apache.hadoop.hbase.ipc.TestCallRunner
Running org.apache.hadoop.hbase.ipc.TestGlobalEventLoopGroup
Tests run: 1, Failures: 0, Errors: 0, Skipped: 0, Time elapsed: 0.995 sec - in org.apache.hadoop.hbase.ipc.TestGlobalEventLoopGroup
Running org.apache.hadoop.hbase.ipc.TestAsyncIPC
Tests run: 36, Failures: 0, Errors: 0, Skipped: 0, Time elapsed: 4.933 sec - in org.apache.hadoop.hbase.ipc.TestAsyncIPC
Running org.apache.hadoop.hbase.ipc.TestRpcMetrics
Tests run: 3, Failures: 0, Errors: 0, Skipped: 0, Time elapsed: 0.508 sec - in org.apache.hadoop.hbase.ipc.TestRpcMetrics
Running org.apache.hadoop.hbase.TestTableDescriptor
Tests run: 1, Failures: 0, Errors: 0, Skipped: 0, Time elapsed: 1.239 sec - in org.apache.hadoop.hbase.TestTableDescriptor
Running org.apache.hadoop.hbase.zookeeper.TestZooKeeperMainServer
Tests run: 2, Failures: 0, Errors: 0, Skipped: 0, Time elapsed: 1.243 sec - in org.apache.hadoop.hbase.zookeeper.TestZooKeeperMainServer
Running org.apache.hadoop.hbase.replication.regionserver.TestReplicationThrottler
Tests run: 1, Failures: 0, Errors: 0, Skipped: 0, Time elapsed: 0.054 sec - in org.apache.hadoop.hbase.replication.regionserver.TestReplicationThrottler
Running org.apache.hadoop.hbase.replication.regionserver.TestReplicationSinkManager
Tests run: 5, Failures: 0, Errors: 0, Skipped: 0, Time elapsed: 1.135 sec - in org.apache.hadoop.hbase.replication.regionserver.TestReplicationSinkManager
Running org.apache.hadoop.hbase.replication.master.TestTableCFsUpdater
Tests run: 1, Failures: 0, Errors: 0, Skipped: 0, Time elapsed: 0.131 sec - in org.apache.hadoop.hbase.replication.master.TestTableCFsUpdater
Running org.apache.hadoop.hbase.replication.TestReplicationWALEntryFilters
Tests run: 4, Failures: 0, Errors: 0, Skipped: 0, Time elapsed: 0.501 sec - in org.apache.hadoop.hbase.replication.TestReplicationWALEntryFilters
Running org.apache.hadoop.hbase.monitoring.TestMemoryBoundedLogMessageBuffer
Tests run: 2, Failures: 0, Errors: 0, Skipped: 0, Time elapsed: 0.213 sec - in org.apache.hadoop.hbase.monitoring.TestMemoryBoundedLogMessageBuffer
Running org.apache.hadoop.hbase.monitoring.TestTaskMonitor
Tests run: 3, Failures: 0, Errors: 0, Skipped: 0, Time elapsed: 0.534 sec - in org.apache.hadoop.hbase.monitoring.TestTaskMonitor
Running org.apache.hadoop.hbase.errorhandling.TestForeignExceptionSerialization
Tests run: 2, Failures: 0, Errors: 0, Skipped: 0, Time elapsed: 0.236 sec - in org.apache.hadoop.hbase.errorhandling.TestForeignExceptionSerialization
Running org.apache.hadoop.hbase.errorhandling.TestForeignExceptionDispatcher
Tests run: 3, Failures: 0, Errors: 0, Skipped: 0, Time elapsed: 0.315 sec - in org.apache.hadoop.hbase.errorhandling.TestForeignExceptionDispatcher
Running org.apache.hadoop.hbase.errorhandling.TestTimeoutExceptionInjector
Tests run: 4, Failures: 0, Errors: 0, Skipped: 0, Time elapsed: 0.403 sec - in org.apache.hadoop.hbase.errorhandling.TestTimeoutExceptionInjector
Running org.apache.hadoop.hbase.TestCompare
Tests run: 1, Failures: 0, Errors: 0, Skipped: 0, Time elapsed: 0.835 sec - in org.apache.hadoop.hbase.TestCompare
Running org.apache.hadoop.hbase.http.TestGlobalFilter
Tests run: 1, Failures: 0, Errors: 0, Skipped: 0, Time elapsed: 0.869 sec - in org.apache.hadoop.hbase.http.TestGlobalFilter
Running org.apache.hadoop.hbase.http.TestPathFilter
Tests run: 1, Failures: 0, Errors: 0, Skipped: 0, Time elapsed: 0.851 sec - in org.apache.hadoop.hbase.http.TestPathFilter
Running org.apache.hadoop.hbase.http.TestHttpRequestLogAppender
Tests run: 1, Failures: 0, Errors: 0, Skipped: 0, Time elapsed: 0.137 sec - in org.apache.hadoop.hbase.http.TestHttpRequestLogAppender
Running org.apache.hadoop.hbase.http.TestHtmlQuoting
Tests run: 4, Failures: 0, Errors: 0, Skipped: 0, Time elapsed: 0.454 sec - in org.apache.hadoop.hbase.http.TestHtmlQuoting
Running org.apache.hadoop.hbase.http.log.TestLogLevel
Tests run: 1, Failures: 0, Errors: 0, Skipped: 0, Time elapsed: 0.911 sec - in org.apache.hadoop.hbase.http.log.TestLogLevel
Running org.apache.hadoop.hbase.http.conf.TestConfServlet
Tests run: 3, Failures: 0, Errors: 0, Skipped: 0, Time elapsed: 0.749 sec - in org.apache.hadoop.hbase.http.conf.TestConfServlet
Running org.apache.hadoop.hbase.http.TestHttpRequestLog
Tests run: 2, Failures: 0, Errors: 0, Skipped: 0, Time elapsed: 0.17 sec - in org.apache.hadoop.hbase.http.TestHttpRequestLog
Running org.apache.hadoop.hbase.http.TestHttpServerWebapps
Tests run: 2, Failures: 0, Errors: 0, Skipped: 0, Time elapsed: 0.504 sec - in org.apache.hadoop.hbase.http.TestHttpServerWebapps
Running org.apache.hadoop.hbase.http.TestHttpServerLifecycle
Tests run: 6, Failures: 0, Errors: 0, Skipped: 6, Time elapsed: 0.002 sec - in org.apache.hadoop.hbase.http.TestHttpServerLifecycle
Running org.apache.hadoop.hbase.http.TestHttpServer
Tests run: 16, Failures: 0, Errors: 0, Skipped: 3, Time elapsed: 2.719 sec - in org.apache.hadoop.hbase.http.TestHttpServer
Running org.apache.hadoop.hbase.http.lib.TestStaticUserWebFilter
Tests run: 3, Failures: 0, Errors: 0, Skipped: 0, Time elapsed: 0.832 sec - in org.apache.hadoop.hbase.http.lib.TestStaticUserWebFilter
Running org.apache.hadoop.hbase.http.jmx.TestJMXJsonServlet
Tests run: 1, Failures: 0, Errors: 0, Skipped: 0, Time elapsed: 0.444 sec - in org.apache.hadoop.hbase.http.jmx.TestJMXJsonServlet
Running org.apache.hadoop.hbase.http.TestServletFilter
Tests run: 3, Failures: 0, Errors: 0, Skipped: 1, Time elapsed: 0.911 sec - in org.apache.hadoop.hbase.http.TestServletFilter
Running org.apache.hadoop.hbase.http.TestSSLHttpServer
Tests run: 1, Failures: 0, Errors: 0, Skipped: 0, Time elapsed: 0.378 sec - in org.apache.hadoop.hbase.http.TestSSLHttpServer
Running org.apache.hadoop.hbase.TestServerName
Tests run: 7, Failures: 0, Errors: 0, Skipped: 0, Time elapsed: 0.344 sec - in org.apache.hadoop.hbase.TestServerName
Running org.apache.hadoop.hbase.mapred.TestRowCounter
Tests run: 4, Failures: 0, Errors: 0, Skipped: 0, Time elapsed: 4.14 sec - in org.apache.hadoop.hbase.mapred.TestRowCounter
Running org.apache.hadoop.hbase.mapred.TestDriver
Tests run: 1, Failures: 0, Errors: 0, Skipped: 0, Time elapsed: 0.342 sec - in org.apache.hadoop.hbase.mapred.TestDriver
Running org.apache.hadoop.hbase.mapred.TestSplitTable
Tests run: 3, Failures: 0, Errors: 0, Skipped: 0, Time elapsed: 0.22 sec - in org.apache.hadoop.hbase.mapred.TestSplitTable
Running org.apache.hadoop.hbase.mapred.TestIdentityTableMap
Tests run: 1, Failures: 0, Errors: 0, Skipped: 0, Time elapsed: 0.488 sec - in org.apache.hadoop.hbase.mapred.TestIdentityTableMap
Running org.apache.hadoop.hbase.mapred.TestGroupingTableMap
Tests run: 4, Failures: 0, Errors: 0, Skipped: 0, Time elapsed: 1.128 sec - in org.apache.hadoop.hbase.mapred.TestGroupingTableMap

Results :

Failed tests: 
  TestDateTieredCompactionPolicy.negativeForMajor:248->AbstractTestDateTieredCompactionPolicy.compactEquals:69
expected:<true> but was:<false>

Tests run: 1089, Failures: 1, Errors: 0, Skipped: 21

[INFO] ------------------------------------------------------------------------
[INFO] Reactor Summary:
[INFO] 
[INFO] Apache HBase ...................................... SUCCESS [  2.841 s]
[INFO] Apache HBase - Checkstyle ......................... SUCCESS [  0.697 s]
[INFO] Apache HBase - Resource Bundle .................... SUCCESS [  0.279 s]
[INFO] Apache HBase - Annotations ........................ SUCCESS [  0.242 s]
[INFO] Apache HBase - Protocol ........................... SUCCESS [  3.067 s]
[INFO] Apache HBase - Common ............................. SUCCESS [01:31 min]
[INFO] Apache HBase - Procedure .......................... SUCCESS [02:22 min]
[INFO] Apache HBase - Client ............................. SUCCESS [ 38.730 s]
[INFO] Apache HBase - Hadoop Compatibility ............... SUCCESS [  7.515 s]
[INFO] Apache HBase - Hadoop Two Compatibility ........... SUCCESS [  8.884 s]
[INFO] Apache HBase - Prefix Tree ........................ SUCCESS [ 10.504 s]
[INFO] Apache HBase - Server ............................. FAILURE [16:13 min]
[INFO] Apache HBase - Testing Util ....................... SKIPPED
[INFO] Apache HBase - Thrift ............................. SKIPPED
[INFO] Apache HBase - RSGroup ............................ SKIPPED
[INFO] Apache HBase - Shell .............................. SKIPPED
[INFO] Apache HBase - Integration Tests .................. SKIPPED
[INFO] Apache HBase - Examples ........................... SKIPPED
[INFO] Apache HBase - Rest ............................... SKIPPED
[INFO] Apache HBase - External Block Cache ............... SKIPPED
[INFO] Apache HBase - Spark .............................. SKIPPED
[INFO] Apache HBase - Assembly ........................... SKIPPED
[INFO] Apache HBase - Shaded ............................. SKIPPED
[INFO] Apache HBase - Shaded - Client .................... SKIPPED
[INFO] Apache HBase - Shaded - Server .................... SKIPPED
[INFO] Apache HBase - Archetypes ......................... SKIPPED
[INFO] Apache HBase - Exemplar for hbase-client archetype  SKIPPED
[INFO] Apache HBase - Exemplar for hbase-shaded-client archetype  SKIPPED
[INFO] Apache HBase - Archetype builder .................. SKIPPED
[INFO] ------------------------------------------------------------------------
[INFO] BUILD FAILURE
[INFO] ------------------------------------------------------------------------
[INFO] Total time: 21:23 min
[INFO] Finished at: 2016-04-25T22:26:48+00:00
[INFO] Final Memory: 69M/577M
[INFO] ------------------------------------------------------------------------
[ERROR] Failed to execute goal org.apache.maven.plugins:maven-surefire-plugin:2.18.1:test
(default-test) on project hbase-server: There are test failures.
[ERROR] 
[ERROR] Please refer to <https://builds.apache.org/job/HBase-Trunk_matrix/jdk=latest1.7,label=yahoo-not-h2/ws/hbase-server/target/surefire-reports>
for the individual test results.
[ERROR] -> [Help 1]
[ERROR] 
[ERROR] To see the full stack trace of the errors, re-run Maven with the -e switch.
[ERROR] Re-run Maven using the -X switch to enable full debug logging.
[ERROR] 
[ERROR] For more information about the errors and possible solutions, please read the following
articles:
[ERROR] [Help 1] http://cwiki.apache.org/confluence/display/MAVEN/MojoFailureException
[ERROR] 
[ERROR] After correcting the problems, you can resume the build with the command
[ERROR]   mvn <goals> -rf :hbase-server
Build step 'Invoke top-level Maven targets' marked build as failure
Performing Post build task...
Match found for :.* : True
Logical operation result is TRUE
Running script  : # Run zombie detector script
./dev-support/zombie-detector.sh --jenkins ${BUILD_ID}
[yahoo-not-h2] $ /bin/bash -xe /tmp/hudson8366106824459313335.sh
+ ./dev-support/zombie-detector.sh --jenkins 870
Mon Apr 25 22:26:49 UTC 2016 We're ok: there is no zombie test


    {color:green}+1 zombies{color}. No zombie tests found running at the end of the build.
POST BUILD TASK : SUCCESS
END OF POST BUILD TASK : 0
Archiving artifacts
Recording test results
[FINDBUGS] Skipping publisher since build result is FAILURE
[CHECKSTYLE] Skipping publisher since build result is FAILURE

Mime
View raw message