hbase-builds mailing list archives

Site index · List index
Message view « Date » · « Thread »
Top « Date » · « Thread »
From Apache Jenkins Server <jenk...@builds.apache.org>
Subject Build failed in Jenkins: HBase-1.4 » latest1.7,yahoo-not-h2 #110
Date Fri, 22 Apr 2016 04:57:41 GMT
See <https://builds.apache.org/job/HBase-1.4/jdk=latest1.7,label=yahoo-not-h2/110/changes>

Changes:

[enis] HBASE-15671 Add per-table metrics on memstore, storefile and regionsize

------------------------------------------
[...truncated 46413 lines...]
Tests run: 1, Failures: 0, Errors: 0, Skipped: 0, Time elapsed: 7.75 sec - in org.apache.hadoop.hbase.client.TestPutWithDelete
Running org.apache.hadoop.hbase.client.TestMetaScanner
Running org.apache.hadoop.hbase.client.TestRestoreSnapshotFromClientWithRegionReplicas
Running org.apache.hadoop.hbase.client.TestResultSizeEstimation
Running org.apache.hadoop.hbase.client.TestMetaCache
Tests run: 12, Failures: 0, Errors: 0, Skipped: 0, Time elapsed: 94.352 sec - in org.apache.hadoop.hbase.client.TestIncrementsFromClientSide
Tests run: 2, Failures: 0, Errors: 0, Skipped: 0, Time elapsed: 14.18 sec - in org.apache.hadoop.hbase.client.TestResultSizeEstimation
Tests run: 1, Failures: 0, Errors: 1, Skipped: 0, Time elapsed: 26.361 sec <<< FAILURE!
- in org.apache.hadoop.hbase.client.TestMetaCache
testPreserveMetaCacheOnException(org.apache.hadoop.hbase.client.TestMetaCache)  Time elapsed:
21.335 sec  <<< ERROR!
java.lang.IllegalArgumentException: Row length is 0
	at org.apache.hadoop.hbase.client.Mutation.checkRow(Mutation.java:565)
	at org.apache.hadoop.hbase.client.Put.<init>(Put.java:110)
	at org.apache.hadoop.hbase.client.Put.<init>(Put.java:68)
	at org.apache.hadoop.hbase.client.Put.<init>(Put.java:58)
	at org.apache.hadoop.hbase.client.TestMetaCache.testPreserveMetaCacheOnException(TestMetaCache.java:122)

Tests run: 1, Failures: 0, Errors: 0, Skipped: 0, Time elapsed: 56.487 sec - in org.apache.hadoop.hbase.client.TestMetaCache
Running org.apache.hadoop.hbase.client.TestReplicasClient
Running org.apache.hadoop.hbase.client.TestHTableMultiplexer
Tests run: 2, Failures: 0, Errors: 0, Skipped: 0, Time elapsed: 139.087 sec - in org.apache.hadoop.hbase.client.TestMetaScanner
Tests run: 1, Failures: 0, Errors: 0, Skipped: 0, Time elapsed: 30.334 sec - in org.apache.hadoop.hbase.client.TestHTableMultiplexer
Running org.apache.hadoop.hbase.client.TestSnapshotCloneIndependence
Running org.apache.hadoop.hbase.client.TestHCM
Running org.apache.hadoop.hbase.client.TestAdmin2
Tests run: 8, Failures: 0, Errors: 0, Skipped: 6, Time elapsed: 102.11 sec - in org.apache.hadoop.hbase.client.TestSnapshotCloneIndependence
Running org.apache.hadoop.hbase.client.TestHTableMultiplexerFlushCache
Tests run: 2, Failures: 0, Errors: 0, Skipped: 0, Time elapsed: 40.651 sec - in org.apache.hadoop.hbase.client.TestHTableMultiplexerFlushCache
Tests run: 5, Failures: 0, Errors: 0, Skipped: 0, Time elapsed: 422.863 sec - in org.apache.hadoop.hbase.client.TestRestoreSnapshotFromClientWithRegionReplicas
Tests run: 21, Failures: 0, Errors: 0, Skipped: 3, Time elapsed: 242.71 sec - in org.apache.hadoop.hbase.client.TestHCM
Running org.apache.hadoop.hbase.client.TestShortCircuitConnection
Tests run: 1, Failures: 0, Errors: 0, Skipped: 0, Time elapsed: 8.202 sec - in org.apache.hadoop.hbase.client.TestShortCircuitConnection
Tests run: 14, Failures: 0, Errors: 0, Skipped: 0, Time elapsed: 382.833 sec - in org.apache.hadoop.hbase.client.TestReplicasClient
Tests run: 27, Failures: 0, Errors: 0, Skipped: 0, Time elapsed: 259.922 sec - in org.apache.hadoop.hbase.client.TestAdmin2
Running org.apache.hadoop.hbase.client.TestTableSnapshotScanner
Running org.apache.hadoop.hbase.client.TestSnapshotFromClient
Running org.apache.hadoop.hbase.client.TestClientScannerRPCTimeout
Tests run: 1, Failures: 0, Errors: 0, Skipped: 0, Time elapsed: 13.763 sec - in org.apache.hadoop.hbase.client.TestClientScannerRPCTimeout
Running org.apache.hadoop.hbase.client.TestFastFail
Tests run: 2, Failures: 0, Errors: 0, Skipped: 1, Time elapsed: 8.62 sec - in org.apache.hadoop.hbase.client.TestFastFail
Running org.apache.hadoop.hbase.client.TestUpdateConfiguration
Tests run: 2, Failures: 0, Errors: 0, Skipped: 0, Time elapsed: 2.497 sec - in org.apache.hadoop.hbase.client.TestUpdateConfiguration
Running org.apache.hadoop.hbase.client.TestMetaWithReplicas
Running org.apache.hadoop.hbase.client.TestClientOperationInterrupt
Running org.apache.hadoop.hbase.client.TestRpcControllerFactory
Tests run: 1, Failures: 0, Errors: 0, Skipped: 0, Time elapsed: 31.95 sec - in org.apache.hadoop.hbase.client.TestClientOperationInterrupt
Tests run: 2, Failures: 0, Errors: 0, Skipped: 0, Time elapsed: 7.953 sec - in org.apache.hadoop.hbase.client.TestRpcControllerFactory
Tests run: 9, Failures: 0, Errors: 0, Skipped: 0, Time elapsed: 165.3 sec - in org.apache.hadoop.hbase.client.TestSnapshotFromClient
Running org.apache.hadoop.hbase.client.TestIncrementFromClientSideWithCoprocessor
Running org.apache.hadoop.hbase.client.TestTimestampsFilter
Tests run: 3, Failures: 0, Errors: 0, Skipped: 0, Time elapsed: 33.581 sec - in org.apache.hadoop.hbase.client.TestTimestampsFilter
Running org.apache.hadoop.hbase.client.TestFromClientSide3
Tests run: 3, Failures: 0, Errors: 0, Skipped: 0, Time elapsed: 270.852 sec - in org.apache.hadoop.hbase.client.TestTableSnapshotScanner
Tests run: 12, Failures: 0, Errors: 0, Skipped: 0, Time elapsed: 94.612 sec - in org.apache.hadoop.hbase.client.TestIncrementFromClientSideWithCoprocessor
Running org.apache.hadoop.hbase.client.TestSplitOrMergeStatus
Running org.apache.hadoop.hbase.client.TestAdmin1
Running org.apache.hadoop.hbase.client.TestClientPushback
Tests run: 2, Failures: 0, Errors: 0, Skipped: 0, Time elapsed: 6.786 sec - in org.apache.hadoop.hbase.client.TestClientPushback
Tests run: 4, Failures: 0, Errors: 0, Skipped: 0, Time elapsed: 82.397 sec - in org.apache.hadoop.hbase.client.TestSplitOrMergeStatus
Running org.apache.hadoop.hbase.client.replication.TestReplicationAdmin
Tests run: 7, Failures: 0, Errors: 0, Skipped: 0, Time elapsed: 5.844 sec - in org.apache.hadoop.hbase.client.replication.TestReplicationAdmin
Running org.apache.hadoop.hbase.client.replication.TestReplicationAdminWithTwoDifferentZKClusters
Tests run: 8, Failures: 0, Errors: 0, Skipped: 0, Time elapsed: 283.009 sec - in org.apache.hadoop.hbase.client.TestFromClientSide3
Tests run: 12, Failures: 0, Errors: 0, Skipped: 0, Time elapsed: 456.772 sec - in org.apache.hadoop.hbase.client.TestMetaWithReplicas
Tests run: 2, Failures: 0, Errors: 0, Skipped: 0, Time elapsed: 49.591 sec - in org.apache.hadoop.hbase.client.replication.TestReplicationAdminWithTwoDifferentZKClusters
Running org.apache.hadoop.hbase.client.replication.TestReplicationAdminWithClusters
Running org.apache.hadoop.hbase.client.TestCheckAndMutate
Running org.apache.hadoop.hbase.client.TestFromClientSide
Tests run: 1, Failures: 0, Errors: 0, Skipped: 0, Time elapsed: 9.043 sec - in org.apache.hadoop.hbase.client.TestCheckAndMutate
Running org.apache.hadoop.hbase.client.TestCloneSnapshotFromClient

Results :

Failed tests: 
org.apache.hadoop.hbase.master.balancer.TestStochasticLoadBalancer2.testRegionReplicasOnLargeCluster(org.apache.hadoop.hbase.master.balancer.TestStochasticLoadBalancer2)
  Run 1: TestStochasticLoadBalancer2.testRegionReplicasOnLargeCluster:57->BalancerTestBase.testWithCluster:422->BalancerTestBase.testWithCluster:444->BalancerTestBase.assertClusterAsBalanced:202
null
  Run 2: TestStochasticLoadBalancer2.testRegionReplicasOnLargeCluster:57->BalancerTestBase.testWithCluster:422->BalancerTestBase.testWithCluster:444->BalancerTestBase.assertClusterAsBalanced:202
null

org.apache.hadoop.hbase.master.balancer.TestStochasticLoadBalancer2.testRegionReplicasOnMidClusterHighReplication(org.apache.hadoop.hbase.master.balancer.TestStochasticLoadBalancer2)
  Run 1: TestStochasticLoadBalancer2.testRegionReplicasOnMidClusterHighReplication:72->BalancerTestBase.testWithCluster:422->BalancerTestBase.testWithCluster:450->BalancerTestBase.assertRegionReplicaPlacement:225
Two or more region replicas are hosted on the same host after balance
  Run 2: TestStochasticLoadBalancer2.testRegionReplicasOnMidClusterHighReplication:72->BalancerTestBase.testWithCluster:422->BalancerTestBase.testWithCluster:450->BalancerTestBase.assertRegionReplicaPlacement:225
Two or more region replicas are hosted on the same host after balance

Tests in error: 
org.apache.hadoop.hbase.replication.TestReplicationKillSlaveRS.org.apache.hadoop.hbase.replication.TestReplicationKillSlaveRS
  Run 1: TestReplicationKillSlaveRS>TestReplicationBase.setUpBeforeClass:131 » IO Shutt...
  Run 2: TestReplicationKillSlaveRS>TestReplicationBase.tearDownAfterClass:163 » NullPointer

  TestReplicationSmallTests.setUp:84 » FailedServer This server is in the failed...
  TestReplicationSmallTests.setUp:84 » FailedServer This server is in the failed...
  TestReplicationSmallTests.setUp:84 » Connect Connection refused
  TestReplicationSmallTests.setUp:84 » FailedServer This server is in the failed...
  TestReplicationSmallTests.setUp:84 » Connect Connection refused
  TestReplicationSmallTests.setUp:84 » Connect Connection refused
  TestReplicationSmallTests.setUp:84 » FailedServer This server is in the failed...
  TestReplicationSmallTests.setUp:84 » FailedServer This server is in the failed...
  TestReplicationSmallTests.setUp:84 » FailedServer This server is in the failed...
  TestReplicationSmallTests.setUp:84 » FailedServer This server is in the failed...
  TestReplicationSmallTests.setUp:84 » FailedServer This server is in the failed...
  TestReplicationSmallTests.setUp:84 » Connect Connection refused
  TestReplicationSyncUpTool.testSyncUpTool:173->mimicSyncUpAfterPut:384->syncUp:416
» IO
  TestReplicationSyncUpToolWithBulkLoadedData.testSyncUpTool:86->loadAndReplicateHFiles:182->loadAndValidateHFileReplication:212
» IO
org.apache.hadoop.hbase.replication.multiwal.TestReplicationSyncUpToolWithMultipleWAL.org.apache.hadoop.hbase.replication.multiwal.TestReplicationSyncUpToolWithMultipleWAL
  Run 1: TestReplicationSyncUpToolWithMultipleWAL.setUpBeforeClass:34->TestReplicationBase.setUpBeforeClass:131
» IO
  Run 2: TestReplicationSyncUpToolWithMultipleWAL>TestReplicationBase.tearDownAfterClass:163
» NullPointer

Flaked tests: 
org.apache.hadoop.hbase.TestInfoServers.testInfoServersStatusPages(org.apache.hadoop.hbase.TestInfoServers)
  Run 1: TestInfoServers.testInfoServersStatusPages:89->assertContainsContent:110->getUrlContent:126
» SocketTimeout
  Run 2: PASS

org.apache.hadoop.hbase.client.TestMetaCache.testPreserveMetaCacheOnException(org.apache.hadoop.hbase.client.TestMetaCache)
  Run 1: TestMetaCache.testPreserveMetaCacheOnException:122 » IllegalArgument Row lengt...
  Run 2: PASS

org.apache.hadoop.hbase.replication.TestMasterReplication.testCyclicReplication2(org.apache.hadoop.hbase.replication.TestMasterReplication)
  Run 1: TestMasterReplication.testCyclicReplication2:239->startMiniClusters:475 » IO
S...
  Run 2: TestMasterReplication.testCyclicReplication2:239->startMiniClusters:475 » IO
S...
  Run 3: PASS

org.apache.hadoop.hbase.util.TestMiniClusterLoadParallel.loadTest[3](org.apache.hadoop.hbase.util.TestMiniClusterLoadParallel)
  Run 1: TestMiniClusterLoadParallel.loadTest:51 » TestTimedOut test timed out after 18...
  Run 2: PASS


Tests run: 1478, Failures: 2, Errors: 16, Skipped: 47, Flakes: 4

[INFO] ------------------------------------------------------------------------
[INFO] Reactor Summary:
[INFO] 
[INFO] Apache HBase ...................................... SUCCESS [2:34.403s]
[INFO] Apache HBase - Checkstyle ......................... SUCCESS [14.458s]
[INFO] Apache HBase - Resource Bundle .................... SUCCESS [1.465s]
[INFO] Apache HBase - Annotations ........................ SUCCESS [7.242s]
[INFO] Apache HBase - Protocol ........................... SUCCESS [1:39.329s]
[INFO] Apache HBase - Common ............................. SUCCESS [8:28.914s]
[INFO] Apache HBase - Procedure .......................... SUCCESS [9:31.227s]
[INFO] Apache HBase - Client ............................. SUCCESS [4:59.271s]
[INFO] Apache HBase - Hadoop Compatibility ............... SUCCESS [27.526s]
[INFO] Apache HBase - Hadoop Two Compatibility ........... SUCCESS [1:00.846s]
[INFO] Apache HBase - Prefix Tree ........................ SUCCESS [1:07.348s]
[INFO] Apache HBase - Server ............................. FAILURE [4:14:35.699s]
[INFO] Apache HBase - Testing Util ....................... SKIPPED
[INFO] Apache HBase - Thrift ............................. SKIPPED
[INFO] Apache HBase - Rest ............................... SKIPPED
[INFO] Apache HBase - Shell .............................. SKIPPED
[INFO] Apache HBase - Integration Tests .................. SKIPPED
[INFO] Apache HBase - Examples ........................... SKIPPED
[INFO] Apache HBase - External Block Cache ............... SKIPPED
[INFO] Apache HBase - Assembly ........................... SKIPPED
[INFO] Apache HBase - Shaded ............................. SKIPPED
[INFO] Apache HBase - Shaded - Client .................... SKIPPED
[INFO] Apache HBase - Shaded - Server .................... SKIPPED
[INFO] ------------------------------------------------------------------------
[INFO] BUILD FAILURE
[INFO] ------------------------------------------------------------------------
[INFO] Total time: 4:45:49.778s
[INFO] Finished at: Fri Apr 22 04:49:29 UTC 2016
[INFO] Final Memory: 366M/487M
[INFO] ------------------------------------------------------------------------
[ERROR] Failed to execute goal org.apache.maven.plugins:maven-surefire-plugin:2.18.1:test
(secondPartTestsExecution) on project hbase-server: ExecutionException: java.lang.RuntimeException:
java.lang.RuntimeException: org.apache.maven.surefire.report.ReporterException: When writing
xml report stdout/stderr: /tmp/stderr5878253501646329620deferred (No such file or directory)
-> [Help 1]
[ERROR] 
[ERROR] To see the full stack trace of the errors, re-run Maven with the -e switch.
[ERROR] Re-run Maven using the -X switch to enable full debug logging.
[ERROR] 
[ERROR] For more information about the errors and possible solutions, please read the following
articles:
[ERROR] [Help 1] http://cwiki.apache.org/confluence/display/MAVEN/MojoFailureException
[ERROR] 
[ERROR] After correcting the problems, you can resume the build with the command
[ERROR]   mvn <goals> -rf :hbase-server
Build step 'Invoke top-level Maven targets' marked build as failure
Performing Post build task...
Match found for :.* : True
Logical operation result is TRUE
Running script  : # Post-build task script. TODO: Check this in and have all builds reference
check-in.
pwd && ls
# NOTE!!!! The below code has been copied and pasted from ./dev-tools/run-test.sh
# Do not change here without syncing there and vice-versa.
ZOMBIE_TESTS_COUNT=`jps -v | grep surefirebooter | grep -e '-Dhbase.test' | wc -l`
if [[ $ZOMBIE_TESTS_COUNT != 0 ]] ; then
 echo "Suspicious java process found - waiting 30s to see if there are just slow to stop"
 sleep 30
 ZOMBIE_TESTS_COUNT=`jps -v | grep surefirebooter | grep -e '-Dhbase.test' | wc -l`
 if [[ $ZOMBIE_TESTS_COUNT != 0 ]] ; then
   echo " {color:red}There appear to be $ZOMBIE_TESTS_COUNT zombie tests{color}, they should
have been killed by surefire but survived"
   jps -v | grep surefirebooter | grep -e '-Dhbase.test'
   jps -v | grep surefirebooter | grep -e '-Dhbase.test' | cut -d ' ' -f 1 | xargs -n 1 jstack
   # Exit with error
   exit 1
 else
   echo "We're ok: there is no zombie test, but some tests took some time to stop"
 fi
else
  echo "We're ok: there is no zombie test"
fi
[yahoo-not-h2] $ /bin/bash -xe /tmp/hudson7593285680185136926.sh
+ pwd
<https://builds.apache.org/job/HBase-1.4/jdk=latest1.7,label=yahoo-not-h2/ws/>
+ ls
bin
CHANGES.txt
conf
dev-support
hbase-annotations
hbase-assembly
hbase-checkstyle
hbase-client
hbase-common
hbase-examples
hbase-external-blockcache
hbase-hadoop2-compat
hbase-hadoop-compat
hbase-it
hbase-native-client
hbase-prefix-tree
hbase-procedure
hbase-protocol
hbase-resource-bundle
hbase-rest
hbase-server
hbase-shaded
hbase-shell
hbase-testing-util
hbase-thrift
LICENSE.txt
NOTICE.txt
pom.xml
README.txt
src
target
++ jps -v
++ grep surefirebooter
++ grep -e -Dhbase.test
++ wc -l
+ ZOMBIE_TESTS_COUNT=2
+ [[ 2 != 0 ]]
+ echo 'Suspicious java process found - waiting 30s to see if there are just slow to stop'
Suspicious java process found - waiting 30s to see if there are just slow to stop
+ sleep 30
++ wc -l
++ grep -e -Dhbase.test
++ grep surefirebooter
++ jps -v
+ ZOMBIE_TESTS_COUNT=0
+ [[ 0 != 0 ]]
+ echo 'We'\''re ok: there is no zombie test, but some tests took some time to stop'
We're ok: there is no zombie test, but some tests took some time to stop
POST BUILD TASK : SUCCESS
END OF POST BUILD TASK : 0
Archiving artifacts
Recording test results

Mime
View raw message